{
    "standard": [
        {
            "midori": "Midori",
            "midori_with_version": "Midori {appVersion}",
            "midori_full": "Midori Browser",
            "midori_full_with_version": "Midori Browser {appVersion}",
            "button_open": "Abierto",
            "button_run": "Ejecutar",
            "button_send": "Enviar",
            "button_download": "Descargar",
            "search_placeholder": "Buscar",
            "quit": "Cerrar",
            "quit_midori": "Cerrar Midori",
            "quit_midori_with_version": "Cerrar Midori {appVersion}"
        }
    ],
    "languages": [
        {
            "en": "Ingles",
            "es": "Español",
            "de": "Alemán",
            "fr": "Francés",
            "fi": "Finlandés",
            "ru": "Ruso",
            "no": "Noruego",
            "ie": "Irlandés",
            "se": "Sueco"
        }
    ],
    "rich_presence": [
        {
            "default_details": "Navegando en",
            "audio_details": "Escuchando audio en",
            "file_details": "Viendo un archivo {fileType}",
            "active_small_text": "Navegando por una página web",
            "idle_small_text": "Ocioso",
            "idle_details": "Midori Browser",
            "large_text": "Midori Browser {version}"
        }
    ],
    "overlay": [
        {
            "dial_top_sites": "Mejores sitios",
            "dial_bookmarks": "Marcadores",
            "overview": "Visión general",
            "menu": "Menú",
            "tab_groups": "Grupos de pestañas",
            "default_tab_group": "Nuevo grupo",
            "world": "Mundo",
            "history_bubble": "Historia",
            "bookmarks_bubble": "Marcadores",
            "downloads_bubble": "Descargas",
            "settings_bubble": "Ajustes",
            "extensions_bubble": "Extensiones",
            "find_bubble": "Encontrar",
            "more_tools_bubble": "Más herramientas",
            "welcome_snackbar": "Bienvenido de nuevo, {username}"
        }
    ],
    "search_bar": [
        {
            "logged_in": [
                {
                    "message_1": "¿Dónde quieres ir hoy?",
                    "message_2": "¿Qué tienes en mente {username}?",
                    "message_3": "Ingrese un término de búsqueda o URL para comenzar.",
                    "message_4": "{currentTimeType}, {username}"
                }
            ],
            "guest": [
                {
                    "message_1": "¿Dónde quieres ir hoy?",
                    "message_2": "¿Qué tienes en mente?",
                    "message_3": "Ingrese un término de búsqueda o URL para comenzar.",
                    "message_4": "{currentTimeType}"
                }
            ],
            "timeTypes": [
                {
                    "morning": "Buenos días",
                    "afternoon": "Buenas tardes",
                    "evening": "Buena noches"
                }
            ]
        }
    ],
    "settings": [
        {
            "title": "Ajustes",
            "google_searchEngine": "Google",
            "bing_searchEngine": "Bing",
            "yahoo_searchEngine": "Yahoo",
            "ddg_searchEngine": "DuckDuckGo",
            "ecosia_searchEngine": "Ecosia",
            "my_profile": [
                {
                    "title": "Mi perfil",
                    "sign_in_btn": "Registrarse",
                    "sign_out_btn": "Cerrar sesión",
                    "guest_user": "Huésped"
                }
            ],
            "appearance": [
                {
                    "title": "Apariencia",
                    "toggle_midori": "Botón de alternar Midori",
                    "search_engine": "Buscador",
                    "temp_type": "Tipo de temperatura",
                    "guest_user": "Huésped"
                }
            ],
            "downloads": [
                {
                    "title": "Descargas",
                    "download_loc": "Ubicación de descargas"
                }
            ],
            "dev_tools": [
                {
                    "title": "Experimentos de desarrolladores",
                    "chromium_dt": "Herramientas de desarrollo de Chrome",
                    "send_test_notif": "Enviar notificación de prueba",
                    "open_log": "Abrir archivo de registro"
                }
            ],
            "about_midori": [
                {
                    "title": "Acerca de Midori",
                    "thanks_message": "Midori fue posible gracias a",
                    "wxnd_coffee": "y ☕.",
                    "made_in": "Hecho en",
                    "gb_with": "Gran Bretaña con ",
                    "end": ".",
                    "developers_title": "Desarrolladores",
                    "beta_testers_title": "Probadores beta",
                    "special_thanks_title": "Gracias especiales",
                    "translators_title": "Despues",
                    "verbose_loaded_fcm": "Servicios de notificación de FCM cargados",
                    "about_page_btn": "Visita la página de depuración",
                    "copyright_notice": "© 2019 Ender And Fire Development"
                }
            ],
            "feedback": [
                {
                    "title": "Enviar comentarios",
                    "feedback_title": "Enviar comentarios a los desarrolladores",
                    "bug_report_title": "Abrir un informe de error",
                    "describe_issue": "Describe tu problema"
                }
            ],
            "languages": [
                {
                    "title": "Idiomas",
                    "download_languages": "Descargar el paquete de idioma más reciente"
                }
            ]
        }
    ],
    "history": [
        {
            "title": "Historia",
            "clear_browsing_history": "Eliminar datos de navegación",
            "sort": [
                {
                    "range_all": "Todos",
                    "range_today": "Hoy",
                    "range_yesterday": "Ayer",
                    "range_last_week": "La semana pasada",
                    "range_last_month": "El mes pasado",
                    "range_older": "Más viejo"
                }
            ]
        }
    ],
    "bookmarks": [
        {
            "title": "Marcadores",
            "import": "Importar marcadores",
            "export": "Exportar marcadores",
            "add_bookmark": "Nuevo marcador"
        }
    ],
    "extensions": [
        {
            "title": "Extensiones"
        }
    ],
    "window": [
        {
            "find_on_page": "Encontrar en la página",
            "navigate_back": "Atras",
            "navigate_forward": "Adelante",
            "navigate_refresh": "Recargar (F5)",
            "navigate_close": "Cerrar pestaña (Ctrl+W)",
            "open_midori": "Abrir Midori Launcher"
        }
    ]
}