<?xml version="1.0" encoding="UTF-8" standalone="no"?>
<svg
   xmlns:dc="http://purl.org/dc/elements/1.1/"
   xmlns:cc="http://creativecommons.org/ns#"
   xmlns:rdf="http://www.w3.org/1999/02/22-rdf-syntax-ns#"
   xmlns:svg="http://www.w3.org/2000/svg"
   xmlns="http://www.w3.org/2000/svg"
   xmlns:sodipodi="http://sodipodi.sourceforge.net/DTD/sodipodi-0.dtd"
   xmlns:inkscape="http://www.inkscape.org/namespaces/inkscape"
   enable-background="new 0 0 64 64"
   height="64px"
   id="PLAY"
   version="1.1"
   viewBox="0 0 64 64"
   width="64px"
   xml:space="preserve"
   sodipodi:docname="ic_play.svg"
   inkscape:version="0.92.4 (5da689c313, 2019-01-14)"><metadata
     id="metadata11"><rdf:RDF><cc:Work
         rdf:about=""><dc:format>image/svg+xml</dc:format><dc:type
           rdf:resource="http://purl.org/dc/dcmitype/StillImage" /><dc:title></dc:title></cc:Work></rdf:RDF></metadata><defs
     id="defs9" /><sodipodi:namedview
     pagecolor="#ffffff"
     bordercolor="#666666"
     borderopacity="1"
     objecttolerance="10"
     gridtolerance="10"
     guidetolerance="10"
     inkscape:pageopacity="0"
     inkscape:pageshadow="2"
     inkscape:window-width="1509"
     inkscape:window-height="856"
     id="namedview7"
     showgrid="false"
     inkscape:zoom="5.2149125"
     inkscape:cx="15.511253"
     inkscape:cy="38.156324"
     inkscape:window-x="79"
     inkscape:window-y="37"
     inkscape:window-maximized="0"
     inkscape:current-layer="PLAY" /><path
     d="M 49.384326,27.001828 24.113567,9.9831608 C 19.752012,7.0466194 16.183035,9.0167248 16.183035,14.358835 v 35.816418 c 0,5.342109 3.573723,7.318691 7.943189,4.39348 L 49.373252,37.661765 c 4.367883,-2.928447 4.372629,-7.723396 0.01108,-10.659937 z m -3.368064,7.088818 -22.440573,15.027516 c -1.455434,0.976149 -2.646674,0.31729 -2.646674,-1.463414 V 16.87772 c 0,-1.780703 1.189659,-2.436326 2.64351,-1.456939 l 22.448484,15.116552 c 1.453851,0.977768 1.45227,2.577164 -0.0047,3.553313 z"
     id="path4"
     style="fill:#ff0000;fill-opacity:1;stroke:#ff0000;stroke-width:2.46;stroke-miterlimit:4;stroke-dasharray:none;stroke-opacity:1"
     inkscape:connector-curvature="0" /></svg>