<?xml version="1.0" encoding="utf-8"?>
<!-- Generator: Adobe Illustrator 23.1.1, SVG Export Plug-In . SVG Version: 6.00 Build 0)  -->
<svg version="1.1" id="Layer_1" xmlns="http://www.w3.org/2000/svg" xmlns:xlink="http://www.w3.org/1999/xlink" x="0px" y="0px"
	 viewBox="0 0 280 150" enable-background="new 0 0 280 150" xml:space="preserve">
<g>
	<linearGradient id="SVGID_1_" gradientUnits="userSpaceOnUse" x1="85.0935" y1="76.0089" x2="85.0935" y2="26.9061">
		<stop  offset="0" style="stop-color:#1D083F"/>
		<stop  offset="0.3198" style="stop-color:#331C67"/>
		<stop  offset="0.7758" style="stop-color:#51379B"/>
		<stop  offset="0.9995" style="stop-color:#5C41AF"/>
	</linearGradient>
	<path fill="url(#SVGID_1_)" d="M159.3,67c-0.6,0-1.2,0.1-1.8,0.2c-1.2-2.2-4.6-4.1-9.3-5.3c-0.9-2.6-4.7-4.6-9.3-4.6
		c-3.8,0-7,1.3-8.6,3.2c-1.9,0.2-3.8,0.4-5.5,0.8c-0.8-4.6-4.8-8.1-9.7-8.1c-1.7,0-3.3,0.4-4.7,1.2c1.1-1.7,1.7-3.7,1.7-5.9
		c0-6.2-5-11.2-11.2-11.2c-2.6,0-5,0.9-6.9,2.3c-0.2-7.1-6.1-12.8-13.2-12.8c-7.3,0-13.2,5.9-13.3,13.2c-1-0.3-2.1-0.5-3.2-0.5
		c-5.6,0-10.2,4.5-10.2,10.2c0,1.7,0.4,3.3,1.2,4.7c-1.4-0.8-3-1.2-4.7-1.2c-5.2,0-9.4,4-9.8,9.1c-3-1-6.4-1.6-10.1-1.8
		c-1.5-1.9-4.6-3.2-8.1-3.2c-5,0-9.1,2.6-9.1,5.7c0,0.1,0,0.3,0,0.4C8,66.2,4.3,70.2,4.3,74.7c0,0.5,0,0.9,0.1,1.4h98.4h19.6h25.8
		h4.9h12.2c0.3-0.7,0.5-1.6,0.5-2.4C165.8,70,162.9,67,159.3,67z"/>
	<linearGradient id="SVGID_2_" gradientUnits="userSpaceOnUse" x1="137.9585" y1="107.3127" x2="137.9585" y2="44.7051">
		<stop  offset="0" style="stop-color:#1D083F"/>
		<stop  offset="0.3198" style="stop-color:#331C67"/>
		<stop  offset="0.7758" style="stop-color:#51379B"/>
		<stop  offset="0.9995" style="stop-color:#5C41AF"/>
	</linearGradient>
	<path opacity="0.8" fill="url(#SVGID_2_)" d="M218.7,79.9c0-3.6-2.9-6.6-6.6-6.6c-0.6,0-1.2,0.1-1.8,0.2c-1.2-2.2-4.6-4.1-9.3-5.3
		c-0.9-2.6-4.7-4.6-9.3-4.6c-3.8,0-7,1.3-8.6,3.2c-1.9,0.2-3.8,0.4-5.5,0.8c-0.8-4.6-4.8-8.1-9.7-8.1c-1.8,0-3.4,0.5-4.8,1.3
		c-1.4-6.4-7.5-11.8-15.8-14.4c0,0-3.9-1.8-11.4-1.8c-8.5,0-11.8,1.8-11.8,1.8c-8.3,2.6-14.4,8-15.8,14.4c-1.4-0.8-3.1-1.3-4.8-1.3
		c-5.2,0-9.4,4-9.8,9.1c-3-1-6.4-1.6-10.1-1.8c-1.5-1.9-4.6-3.2-8.1-3.2c-5,0-9.1,2.6-9.1,5.7c0,0.1,0,0.3,0,0.4
		c-5.7,2.6-9.3,6.6-9.3,11.1c0,0.1,0,0.2,0,0.2c0,0.1,0,0.1,0,0.2c0,3.6,1.1,17.5,26.9,16.2c3.8-0.2,7-1.3,8.6-3.2
		c1.9-0.2,3.8-0.4,5.5-0.8c0.8,4.6,4.8,8.1,9.7,8.1c1.8,0,3.4-0.5,4.8-1.3c1.4,6.4,10.2,7.8,16.4,6.5c8.6-1.7,10.1-8.4,10.1-8.4
		c1.4,0.8,57.6-0.9,61.1-0.9c5,0,9.1-2.6,9.1-5.7c0-0.1,0-0.3,0-0.4c5.7-2.6,9.3-6.6,9.3-11.1c0-0.1,0-0.2,0-0.2
		C218.7,80,218.7,79.9,218.7,79.9z"/>
	<g>
		<path fill="#DB3B21" d="M157.3,29.8C157.3,29.8,157.3,29.8,157.3,29.8l5.9,2.1c0,0,0.1,0,0.1,0c0.1,0,0.1,0,0.2,0
			c0.1,0,0.2-0.1,0.2-0.3l0.1-0.3l0,0c0,0,0.1,0,0.1,0c0,0,0.1,0,0.1,0c0.1,0,0.1-0.1,0.2-0.2l0.1-0.2c0.1-0.4,0.3-0.7,0.6-0.8
			c0.2-0.1,0.5-0.1,0.9,0c0.4,0.1,0.7-0.3,0.8-0.5c0.1-0.2,0.1-0.4,0.1-0.5c0-0.1-0.1-0.2-0.3-0.3c0,0-0.9-0.3-1.5-0.5l0.1-0.2
			c0.1-0.3,0-0.5-0.3-0.6l-0.5-0.2c-0.1,0-0.3,0-0.4,0c-0.1,0.1-0.2,0.2-0.2,0.3c-0.2-0.1-0.4-0.2-0.6-0.3c-1.6-0.6-3.4-0.3-4.5,0.6
			c-0.5,0.1-0.9,0.3-1.1,0.8c0,0,0,0,0,0.1l0,0.1c0,0,0,0,0,0l0,0.1l-0.1,0.3c0,0,0,0,0,0C157,29.4,157.1,29.6,157.3,29.8z"/>
		<linearGradient id="SVGID_3_" gradientUnits="userSpaceOnUse" x1="172.9917" y1="83.5529" x2="172.9917" y2="19.0037">
			<stop  offset="0" style="stop-color:#1D083F"/>
			<stop  offset="0.3198" style="stop-color:#331C67"/>
			<stop  offset="0.7758" style="stop-color:#51379B"/>
			<stop  offset="0.9995" style="stop-color:#5C41AF"/>
		</linearGradient>
		<path fill="url(#SVGID_3_)" d="M245.3,91.7c-0.3,0-0.6,0-0.8,0.1v-1.1c0.7,0,0.8-0.1,0.8-0.2c0,0,0-0.1-0.8-0.2v-0.2
			c0.6,0,0.6-0.1,0.6-0.2c0,0,0-0.1-0.6-0.2v-0.1c0-0.1-0.1-0.2-0.2-0.2c-0.1,0-0.2,0.1-0.2,0.2v0.1c-0.6,0-0.6,0.1-0.6,0.2
			c0,0,0,0.1,0.6,0.2v0.2c-0.7,0-0.8,0.1-0.8,0.2c0,0,0,0.1,0.8,0.2v1.2c-0.4,0.1-0.8,0.2-1.2,0.4c0,0,0,0,0,0c0,0,0,0,0,0V76
			c0-0.9-0.8-1.7-1.7-1.7s-1.7,0.8-1.7,1.7v14.8c-0.4-0.4-0.8-0.7-1.2-1c0,0-0.1,0-0.1-0.1c-0.2-0.1-0.3-0.2-0.5-0.3
			c-0.1,0-0.1-0.1-0.2-0.1c0,0-0.1,0-0.1,0c0,0,0,0,0,0c-0.5-0.3-1.1-0.5-1.7-0.6v-1.7c1.1,0,1.1-0.2,1.1-0.2c0-0.1,0-0.2-1.1-0.2
			v-0.2c0.8,0,0.8-0.2,0.8-0.2s0-0.2-0.8-0.2v-0.1c0-0.1-0.1-0.3-0.2-0.3s-0.3,0.1-0.3,0.3v0.1c-0.2,0-0.4,0-0.5,0
			c0.5-6-2.2-12.1-6.2-16c-1.3-1.3-2.9-2.5-4.5-3.5c-1.1-0.7-2.3-1.3-3.5-1.8V62c0.6-1.4,0.9-2.7,0.4-3c-0.1-0.1-0.2-0.1-0.4,0v-1.8
			c0.6-1.4,0.9-2.7,0.4-3c-0.1-0.1-0.2-0.1-0.4,0v-1.9h6.7c0.1,0,0.1,0,0.1-0.1v-1.5c0-0.1,0-0.1-0.1-0.1h-1.5
			c-0.6-1.8-3.2-3.1-6.3-3.2v-6.8c0-0.1-0.1-0.3-0.3-0.3c-0.1,0-0.3,0.1-0.3,0.3v6.8c-0.2,0-0.4,0-0.5,0v-4.6c0-0.1-0.1-0.3-0.3-0.3
			s-0.3,0.1-0.3,0.3v4.6c-2.6,0.3-4.7,1.5-5.3,3.1h-1.5c-0.1,0-0.1,0-0.1,0.1v1.5c0,0.1,0,0.1,0.1,0.1h6.7v5.1c0,0,0,0,0,0
			c-0.8,1.5-1.3,3.2-0.7,3.6c0.1,0,0.2,0.1,0.2,0.1c0.1,0,0.3-0.1,0.5-0.1v1.3c0,0,0,0,0,0c-0.2,0.3-0.3,0.6-0.4,0.9
			c-3.9-1.5-8-2.5-12-3.5c-0.8-0.2-1.6-0.4-2.4-0.6l-0.4-0.1c-0.3-0.1-0.6-0.2-0.9-0.3c-0.1-4.2-0.2-8-0.4-10.8c0-0.3,0-0.5,0-0.8
			c0,0,0,0,0,0c1.5-3.3,5.4-6.3,8.5-8.7c2.4-1.8,4.2-3.3,4.2-4.3c0-0.6-0.4-1.2-1.1-1.8c0.7-0.7,1.1-1.2,1.1-1.7
			c0-0.9-0.7-1.7-2-2.3v-2.6c0-0.4-0.3-0.7-0.7-0.7c-0.2,0-0.4,0.1-0.5,0.2v-0.4c0-0.4-0.3-0.7-0.7-0.7c-0.2,0-0.4,0.1-0.5,0.2v-1.6
			c0-0.4-0.3-0.7-0.7-0.7c-0.4,0-0.7,0.3-0.7,0.7v4.3c-1.6-0.4-3.4-0.6-5.4-0.7c0.5-1.3,0.9-2.5,1.2-3.7c0.7-3,0.5-5-0.5-5.6
			c-1.8-1-5.7,2.1-9.6,7.8c-0.1-3.5-0.1-7.6-0.3-11.2C193.1,3,192.8,3,192.6,3c-0.2,0-0.5,0-0.8,10.5c-0.1,4.5-0.3,9.8-0.3,13.8
			c-0.5,0.2-1,0.3-1.4,0.5v-3.1c0-0.4-0.3-0.7-0.7-0.7c-0.4,0-0.7,0.3-0.7,0.7v3.9c-0.8,0.6-1.3,1.2-1.3,1.9c0,0.5,0.4,1,1.1,1.7
			c-0.7,0.5-1.1,1.1-1.1,1.8c0,0.4,0.3,0.9,0.8,1.4c-1.6,4.4-1.7,7.5-0.3,8.3c0.2,0.1,0.5,0.2,0.8,0.2c1.3,0,3.3-1.4,5.4-3.6
			c1,0.8,2.1,1.7,3,2.7c0,0,0,0.1,0.1,0.1c0,0,0,0,0,0c1.2,1.3,2.3,2.6,2.9,4c0,0,0,0,0,0c0,0.2,0,0.4,0,0.7
			c-0.1,1.1-0.1,2.3-0.2,3.6c0,0,0,0-0.1,0l-0.1,0.1c-0.7,1.1-1.3,2.2-1.5,3.5c-0.2,1.6,0.4,2.7,1.4,3.4v26.7
			c-0.4,0.1-0.4,0.2-0.4,0.2s0,0.1,0.4,0.2v0.3c-0.7,0-0.7,0.2-0.7,0.2c0,0.1,0,0.2,0.7,0.2v1.7c-0.3,0-0.6,0-0.8,0
			c-2.4,0-4.5,1-6,2.6V78.9c2.3-5.9,3.8-11.5,2-13c0,0,0,0-0.1,0c0,0,0,0,0,0c0,0,0-0.1-0.1-0.1c0,0-0.1,0-0.1,0
			c-0.2-0.1-0.3-0.1-0.5-0.1c-3.4-0.8-7,0.1-10.5,2V54.3c0.1,0,0.1,0,0.2-0.1c0.6-0.2,1.2-0.6,1.7-1c0.9-0.8,1.4-2,1.4-3.3
			c0-2.1-1.4-3.8-3.3-4.4v-3.6c0-0.7-0.6-1.3-1.3-1.3c-0.7,0-1.3,0.6-1.3,1.3v3.6c-1.9,0.5-3.3,2.3-3.3,4.4c0,1,0.3,2,0.9,2.8
			c0.6,0.8,1.4,1.3,2.3,1.6v14.8c-3,2-5.8,4.6-8.4,7.3v-4V71v-2.1v-1.4v-3.2h0.6c1.6,0,3-1.3,3-3s-1.3-3-3-3h-0.6v-9.7
			c0-2.5-2-4.4-4.4-4.4c-2.5,0-4.4,2-4.4,4.4v0.5h-0.5c-1.6,0-3,1.3-3,3s1.3,3,3,3h0.5v19.6c-1.1-3.8-2.3-6-3.4-6.7
			c-0.4-0.2-0.8-0.3-1.2-0.1c-2.2,0.8-3.9,6.4-5.2,12.5c-1-0.5-2-1-2.9-1.5c-1.7-0.9-3.2-1.6-4.2-2.2c-1.1-0.7-2.3-1.3-3.4-2
			c-1.3-0.8-2.7-1.5-4-2.3c-0.1-1.9-0.2-3.9-0.3-5.7c2.3-1.5,4-2.7,4.8-3.7c0.9-1.2,1.1-2.3,0.7-3.2c-1-2.3-5.6-2.7-5.8-2.7
			c0,0,0,0,0,0c-0.1-2.2-0.1-4.2-0.1-6.1c0.3-0.4,0.6-0.9,0.9-1.4c1.3-2.2,2.1-4.8,1.2-5.3c-0.5-0.3-1.3,0.2-2.2,1.3
			c0-2,0-3.5,0-4.2c0.1-0.1,0.3-0.1,0.4-0.2l1-1c0.2-0.2,0.3-0.5,0.3-0.7V39c2.3,0,3.9-0.1,3.9-0.2c0-0.1-1.6-0.2-3.9-0.2v-1.4
			c0-0.7,0.2-1.5,0.6-2.3c3,0,5.1-0.1,5.1-0.2c0-0.1-2-0.2-4.8-0.2c0.5-0.7,1.1-1.3,1.8-1.3h2.9c1.1,0,2-0.9,2-2v-0.6
			c0-0.3-0.3-0.6-0.6-0.6h-0.3v-1.1c0-0.3-0.2-0.5-0.5-0.5H145c0,0,0,0,0,0v-2.6c0-0.3-0.2-0.5-0.5-0.5H144c-0.3,0-0.5,0.2-0.5,0.5
			V30h-0.2v-1c0-0.3-0.2-0.5-0.5-0.5h-0.8c-0.3,0-0.5,0.2-0.5,0.5v1H140c-1.4-1.6-2-7.4-2.3-10.7c0.2-0.2,0.5-0.4,0.7-0.5
			c0.1,0.3,0.2,0.7,0.4,1.1c0,0,0,0.1,0,0.1c0,0.1,0.1,0.3,0.3,0.3s0.3-0.1,0.3-0.3c0-0.1-0.1-0.3-0.3-0.3c0,0,0,0,0,0
			c-0.2-0.4-0.3-0.7-0.4-1.1c0.5-0.2,1-0.3,1.3-0.3c0,0,0,0,0,0c0,0,0,0.1,0.1,0.1c0.1,0.1,0.3,0.1,0.4,0c0.1-0.1,0.1-0.3,0-0.4
			c-0.1-0.1-0.3-0.1-0.4,0c0,0,0,0,0,0.1c-0.5,0-1-0.2-1.3-0.4c0.1-0.8,0.7-1.4,0.9-1.7c0,0,0,0,0,0c0,0,0.1,0,0.1,0
			c0.1,0,0.3-0.1,0.3-0.3c0-0.1-0.1-0.3-0.3-0.3s-0.3,0.1-0.3,0.3c0,0,0,0.1,0,0.1c-0.6,0.5-1.2,0.8-1.9,0.8c0,0,0-0.1-0.1-0.1
			c-0.3-0.6-0.4-1.1-0.5-1.4c0,0,0,0,0,0c0.1-0.1,0.1-0.3,0-0.4c-0.1-0.1-0.3-0.1-0.4,0c-0.1,0.1-0.1,0.3,0,0.4c0,0,0,0,0.1,0.1
			c0,0.5,0,1-0.1,1.4c-0.1,0-0.1,0-0.2,0c-0.6-0.2-1.1-0.5-1.3-0.7c0,0,0,0,0,0c0-0.1-0.1-0.3-0.3-0.3s-0.3,0.1-0.3,0.3
			c0,0.1,0.1,0.3,0.3,0.3c0,0,0.1,0,0.1,0c0.7,0.6,1.1,1.2,1.3,1.6c-0.1,0.2-0.2,0.3-0.3,0.4c-0.1,0-0.2,0-0.3,0.1
			c-0.1,0.1-0.1,0.3,0,0.4c0.1,0.1,0.3,0.1,0.4,0c0.1-0.1,0.1-0.2,0.1-0.2c0.1-0.1,0.2-0.2,0.3-0.3c0.1,0.3,0.2,0.6,0.2,0.7
			c-0.1,0-0.2,0.1-0.2,0.2c0,0.1,0.1,0.3,0.3,0.3c0.1,0,0.3-0.1,0.3-0.3c0-0.1-0.1-0.2-0.1-0.2c0-0.2,0-0.5-0.2-1
			c0.1-0.2,0.2-0.5,0.3-0.9c0.1,0,0.3,0,0.4,0.1c0,0.3,0,1.3-0.2,2.7c-0.2,0.3-0.3,0.6-0.4,0.9c0,0-0.1,0-0.1,0.1
			c-0.1,0.1-0.1,0.3,0,0.4c0.1,0.1,0.3,0.1,0.4,0c0,0,0-0.1,0.1-0.1c-0.3,3.3-0.9,7.7-2.2,9.1h-2.2c-0.2-0.9-0.6-1.5-1.2-1.5
			c-0.2,0-0.5,0.1-0.7,0.3c-0.2-0.5-0.6-0.8-1-0.8c-0.7,0-1.2,0.9-1.3,2.1c-0.3,0-0.5,0.3-0.5,0.6v0.6c0,1.1,0.9,2,2,2h2.9
			c0.7,0,1.3,0.5,1.8,1.3c-2.8,0-4.8,0.1-4.8,0.2c0,0.1,2.1,0.2,5.1,0.2c0.4,0.7,0.6,1.6,0.6,2.3v1.4c-2.3,0-3.9,0.1-3.9,0.2
			c0,0.1,1.6,0.2,3.9,0.2v0.3c0,0.3,0.1,0.5,0.3,0.7l1,1c0.1,0.1,0.2,0.2,0.4,0.2c0,0.9,0,2.8,0,5.6c-0.2,0.3-0.4,0.6-0.6,1
			c-0.7,1.2-1.2,2.4-1.4,3.3c-0.3,1-0.2,1.7,0.2,1.9c0.1,0.1,0.2,0.1,0.3,0.1c0.4,0,0.9-0.3,1.4-0.8c-0.1,3-0.2,6.3-0.3,9.9
			c-0.7,0.1-4.7,0.6-5.7,2.7c-0.4,0.9-0.2,2,0.7,3.2c0.2,0.3,0.6,0.7,1,1.1c-1.2,0.7-2.4,1.5-3.7,2.2c-1,0.6-2.3,1.4-3.5,2.2v-4.5
			c0-1.5-1.2-2.6-2.6-2.6c-1.5,0-2.6,1.2-2.6,2.6V77c-2.6,1.6-4.9,3.1-6.7,4.5V63.8c0-2.3-1.8-4.1-4-4.3v-7.6v-6.7
			c0.4-0.1,0.7-0.5,0.7-1c0-0.5-0.3-0.8-0.7-1v-6.6c0.4-0.1,0.7-0.5,0.7-1c0-0.1,0-0.2,0-0.2c0.2-0.4,0.3-0.8,0.5-1.2
			c0.3-0.9,0.7-2,1.1-2.1c1.8-0.6,3.3-1.9,4.2-3.5c0,0,0.1,0,0.1,0c0,0,0,0,0,0c0,0,0,0,0,0c2.5-0.2,6.8-0.7,6.8-1.6
			c0-0.3-0.4-0.6-1.2-0.8v-2.1c0-0.4-0.3-0.7-0.7-0.7c-0.2,0-0.4,0.1-0.5,0.2v-0.4c0-0.4-0.3-0.7-0.7-0.7c-0.2,0-0.4,0.1-0.5,0.2
			v-1.6c0-0.4-0.3-0.7-0.7-0.7c-0.4,0-0.7,0.3-0.7,0.7v4.4c-0.3,0-0.5-0.1-0.8-0.1c0-0.3,0-0.5,0-0.8c0-4.2-3.3-7.6-7.5-7.8V7.4
			c0-0.2-0.1-0.3-0.3-0.3S109,7.2,109,7.4V17c-0.7,0-1.3,0.1-2,0.3v-5.1c0-0.2-0.1-0.3-0.3-0.3s-0.3,0.1-0.3,0.3v5.3
			c-2.9,1.2-4.9,4-4.9,7.2c0,0.3,0,0.5,0,0.8c-3.4,0.3-5.9,0.8-5.9,1.6c0,1,4.3,1.4,6.8,1.6c0,0,0,0,0.1,0c0,0,0.1,0,0.1,0
			c0.9,1.6,2.5,2.9,4.4,3.5c0.3,0.1,0.7,1.2,1,2.1c0.1,0.4,0.3,0.8,0.4,1.1c0,0.1-0.1,0.2-0.1,0.3c0,0.5,0.3,0.8,0.7,1v6.6
			c-0.4,0.1-0.7,0.5-0.7,1c0,0.5,0.3,0.8,0.7,1v6.7v7.6c-2.2,0.2-4,2-4,4.3v34.5c0,0.1,0,0.1,0.1,0.1h2.4h1.2h1.2h1.2h2.4
			c0.1,0,0.1,0,0.1-0.1v-6.8c0.8,0.7,1.7,1.4,2.8,2.1c-0.1,0.7-0.1,1.4-0.1,2.2c-0.2-1.5-0.4-1.6-0.5-1.6c0,0-0.1,0-0.2,0.1
			c-0.4,0.4-0.9,2.4-1.1,4c0,0,0,0.1,0,0.1c0,0,0.1,0,0.1,0h0.5h0.8h0.3h0.2h0.5h1.1h0.6c0,0,0.1,0,0.1,0c0,0,0,0,0-0.1
			c0-1.2-0.1-2.3-0.1-3.4c0.6,0.4,1.2,0.7,1.8,1v2.3c0,0.1,0,0.1,0.1,0.1h4.8c0.1,0,0.1,0,0.1,0c0,0,0,0,0,0h6.8
			c0.1,0,0.1,0,0.1-0.1c0,0,0-0.1-0.1-0.1c0,0-0.6-0.3-1.5-0.7V85.8c0-1.5-1.2-2.6-2.6-2.6c-1.1,0-2,0.7-2.4,1.6v-4.7v-0.8V78v-0.8
			v-3c1.3-0.7,2.5-1.4,3.8-2.1c1.4-0.8,2.8-1.5,4.1-2.3c0.8,0.6,1.8,1.3,2.9,2c-0.2,3.8-0.5,7.6-0.9,11.3c-0.2,0-0.5,0-0.7,0
			c-0.1,0-0.2,0-0.3,0c0,0,0,0,0,0c-0.1,0-0.2,0-0.3,0.1c0,0,0,0,0,0c0,0-0.1,0-0.1,0.1c-0.5,0.5,0.1,2.1,1.1,4
			c-0.5,3.9-1.1,7.7-1.8,10.9c0,0,0,0.1,0,0.1c0,0,0.1,0,0.1,0h5h4h7.6c0,0,0,0,0,0h1.4h0.4h2.3h3.1h0.3h6.5h1.7h2.7h4.3h0.3h5.1
			h11.2h3.5c5.9,0,16.2,0,23.9,0c5.6,0,9.8,0,9.8,0c0.1,0,0.2,0,0.2-0.1h7h7.7c0,0,0.1,0,0.1,0h4.2h4.6c0,0,0.1,0,0.1,0
			c0.1-0.5,0.2-1,0.2-1.4C250.4,94,248.1,91.7,245.3,91.7z M220.5,54.3c0.1,0,0.2,0,0.3,0c0.3,0.2,0.2,1.1-0.3,2.3V54.3z
			 M220.5,59.2c0.1,0,0.2,0,0.3,0c0.3,0.2,0.2,1.1-0.3,2.3V59.2z M136.5,17.4c-0.2-0.3-0.4-0.6-0.7-1c0.3,0.1,0.6,0.2,0.9,0.3
			C136.6,17,136.5,17.3,136.5,17.4z M136.9,16.6c0-0.2,0.1-0.4,0.1-0.7c0.1,0.2,0.2,0.5,0.3,0.7C137.2,16.7,137,16.7,136.9,16.6z
			 M137.1,20.7c0-0.1,0-0.1-0.1-0.1c0,0,0,0,0,0c0-0.1,0.1-0.3,0.1-0.4C137.1,20.4,137.1,20.6,137.1,20.7z M120.3,92.1
			c-0.7-0.4-1.3-0.8-2-1.2c-0.2-4.5-0.4-6-0.5-6.5c0-0.1,0-0.2-0.1-0.2c0,0,0,0,0,0c0,0-0.1,0-0.1,0c0,0,0,0,0,0c0,0,0,0,0,0
			c0,0,0,0,0,0c0,0,0,0,0,0c0,0,0,0,0,0c-0.1,0.1-0.4,0.7-0.8,4.4c0,0.3-0.1,0.7-0.1,1.1c-1.9-1.4-3.1-2.7-3.1-3.8
			c0-2.1,3.1-5.2,6.7-8V92.1z M136.4,70.6c-0.7-0.4-1.3-0.9-1.9-1.3c0.7-0.4,1.4-0.8,2-1.2C136.5,68.9,136.5,69.7,136.4,70.6z
			 M136.6,67c-0.9,0.6-1.8,1.2-2.7,1.7c-0.1,0-0.1-0.1-0.2-0.1c-1-0.8-2.1-2-1.8-3.2c0.3-1.2,1.9-2.1,4.9-2.8
			C136.8,64,136.7,65.5,136.6,67z M137.1,52.1c0,0-0.1,0.1-0.1,0.1c-0.7,0.6-1.2,0.9-1.5,0.7c-0.3-0.2-0.3-0.8-0.1-1.7
			c0.2-1,0.7-2.1,1.4-3.3c0.1-0.2,0.3-0.4,0.4-0.7C137.2,48.8,137.2,50.4,137.1,52.1z M139.2,18.3c-0.2,0-0.4,0.1-0.6,0.2
			c0-0.1,0-0.3,0-0.4C138.8,18.1,139,18.2,139.2,18.3z M138.9,16.5c-0.2,0.3-0.4,0.7-0.5,1.2c-0.3-0.2-0.6-0.5-0.8-0.8
			C138.1,16.9,138.5,16.8,138.9,16.5z M137.5,17.1c0.2,0.3,0.5,0.6,0.9,0.8c0,0.2,0,0.4,0,0.6c-0.2,0.1-0.5,0.3-0.7,0.5
			C137.6,18.1,137.6,17.4,137.5,17.1z M138.3,45.8c0.9-1.1,1.7-1.6,2.1-1.4c0.6,0.3,0.2,2.4-1.3,5c-0.2,0.4-0.5,0.8-0.8,1.2
			C138.4,48.8,138.3,47.2,138.3,45.8z M138.6,57.2c3,0.6,4.7,1.6,5,2.8c0.3,1.2-0.8,2.4-1.8,3.2c-0.9,0.7-1.9,1.5-2.9,2.2
			C138.7,62.6,138.6,59.8,138.6,57.2z M151.9,91.7c-3-3-7.1-6.2-11.7-7.7c-0.4-3.4-0.6-6.9-0.9-10.3c2.1,1.2,4.4,2.5,6.8,3.8
			c2.5,1.4,5,2.8,7.4,4.2C152.9,85.2,152.3,88.8,151.9,91.7z M199.7,57.4c-0.3-0.3-0.5-0.6-0.7-1c-0.5-1.2-0.2-2.8,0.9-4.7
			C199.8,53.5,199.7,55.4,199.7,57.4z M188,43.5c-1.3-0.7-1.1-3.7,0.3-7.9c0.8,0.8,1.9,1.7,3.2,2.7c0.7,0.6,1.5,1.2,2.3,1.8
			C191.4,42.8,189.2,44.2,188,43.5z M201,24.1c-0.1-0.1-0.2-0.3-0.3-0.4c0,0,0,0-0.1-0.1c-0.1-0.1-0.3-0.2-0.4-0.3c0,0-0.1,0-0.1,0
			c-0.1-0.1-0.2-0.1-0.2-0.2c0,0,0,0,0,0c-0.2-0.1-0.4-0.2-0.6-0.2v-0.6c0.4,0,0.4-0.1,0.4-0.2c0-0.1,0-0.1-0.2-0.1
			c0.1,0,0.1-0.1,0.1-0.1c0-0.1,0-0.1-0.3-0.2c0-0.1-0.1-0.1-0.2-0.1c-0.1,0-0.1,0.1-0.2,0.1c-0.3,0-0.3,0.1-0.3,0.2
			c0,0.1,0,0.1,0.1,0.1c-0.2,0-0.2,0.1-0.2,0.1c0,0.1,0,0.1,0.4,0.2v0.5c-0.1,0-0.3,0-0.4,0c-1.7,0-3,1.4-3,3c0,0.2,0,0.5,0.1,0.7
			c-0.6,0.1-1.2,0.2-1.8,0.3c0-0.5,0-1.1,0-1.7c3.8-5.6,7.7-8.9,9.5-7.9c1,0.6,1.1,2.5,0.4,5.3c-0.3,1.1-0.7,2.4-1.2,3.7
			c-0.3,0-0.6,0-0.9,0c0-0.1,0-0.2,0-0.4c0-0.2,0-0.4-0.1-0.5c0,0,0-0.1,0-0.1c0-0.2-0.1-0.3-0.1-0.5c0,0,0,0,0,0
			C201.2,24.4,201.1,24.3,201,24.1C201,24.1,201,24.1,201,24.1z M217.8,63.2c-0.1,0-0.2-0.1-0.3-0.1c0.1-0.2,0.2-0.4,0.3-0.6V63.2z
			 M217.8,60.5c-0.3,0.2-0.5,0.2-0.6,0.2c-0.3-0.2-0.2-1.4,0.6-2.9V60.5z M235.2,88.5c-0.3-0.1-0.7-0.1-1-0.1c0.1-0.5,0.2-1,0.3-1.6
			c0.2,0,0.4,0,0.7,0V88.5z M235.2,86.4c-0.3,0-0.5,0-0.6,0c0-0.1,0-0.2,0-0.3c0.1,0,0.3,0,0.6,0.1V86.4z"/>
		<path fill="#DB3B21" d="M236.4,36.3c0,0.1,0.1,0.1,0.2,0.1c0,0,0.1,0,0.1,0c0,0,0,0,0,0l0.7-0.3c0.2,0.1,0.3,0.3,0.6,0.3
			c0.1,0,0.2,0,0.3,0.1c0.1,0,0.2,0,0.3,0c0.2,0,0.4,0,0.6-0.1c0.1,0.1,0.1,0.5,0,1c0,0.1,0,0.2,0.1,0.2c0,0,0.1,0,0.1,0
			c0,0,0.1,0,0.1,0l1.4-0.9c0.3-0.2,0.5-0.5,0.5-0.8l0.1-0.8c0.5-0.3,1.1-0.6,1.6-0.9c0.6-0.4,1.2-0.7,1.8-1.1l1.1-0.6
			c1.5-0.9,2.9-1.8,3.5-3.4c0-0.1,0.1-0.2,0.1-0.3c0,0,0,0,0,0l0.2-0.3c0.1-0.1,0-0.3,0-0.4c-0.1-0.1-0.2-0.2-0.3-0.2l-0.3,0
			c-0.1-0.1-0.3-0.1-0.6-0.1c-1.7-0.2-3.1,0.6-4.6,1.6c-1,0.6-1.9,1.3-2.9,1.9c-0.5,0.3-1,0.6-1.4,1l-0.7-0.3
			c-0.3-0.1-0.7-0.1-1,0.1l-1.4,0.9c-0.1,0-0.1,0.1-0.1,0.2c0,0.1,0.1,0.2,0.2,0.2c0.5,0.1,0.9,0.3,0.9,0.4c0,0,0,0,0,0
			c-0.1,0.1-0.2,0.2-0.3,0.3c-0.2,0.4-0.3,0.8-0.3,1.1c0,0.1,0.1,0.2,0.1,0.3l-0.6,0.4C236.3,36.1,236.3,36.2,236.4,36.3z"/>
		<linearGradient id="SVGID_4_" gradientUnits="userSpaceOnUse" x1="173.3584" y1="83.5529" x2="173.3584" y2="19.0037">
			<stop  offset="0" style="stop-color:#1D083F"/>
			<stop  offset="0.3198" style="stop-color:#331C67"/>
			<stop  offset="0.7758" style="stop-color:#51379B"/>
			<stop  offset="0.9995" style="stop-color:#5C41AF"/>
		</linearGradient>
		<path fill="url(#SVGID_4_)" d="M172.6,34.9l1.4,0.5c0,0,0,0,0,0c0,0,0.1,0,0.1-0.1c0-0.1,0-0.1-0.1-0.1l-1.4-0.5
			c-0.1,0-0.1,0-0.1,0.1C172.6,34.8,172.6,34.9,172.6,34.9z"/>
		<linearGradient id="SVGID_5_" gradientUnits="userSpaceOnUse" x1="170.7789" y1="83.5529" x2="170.7789" y2="19.0037">
			<stop  offset="0" style="stop-color:#1D083F"/>
			<stop  offset="0.3198" style="stop-color:#331C67"/>
			<stop  offset="0.7758" style="stop-color:#51379B"/>
			<stop  offset="0.9995" style="stop-color:#5C41AF"/>
		</linearGradient>
		<path fill="url(#SVGID_5_)" d="M169.3,33.6c0,0.1,0,0.1,0.1,0.1l2.7,0.9c0,0,0,0,0,0c0,0,0.1,0,0.1-0.1c0-0.1,0-0.1-0.1-0.1
			l-2.7-0.9C169.4,33.6,169.4,33.6,169.3,33.6z"/>
		<linearGradient id="SVGID_6_" gradientUnits="userSpaceOnUse" x1="166.6966" y1="83.5529" x2="166.6966" y2="19.0037">
			<stop  offset="0" style="stop-color:#1D083F"/>
			<stop  offset="0.3198" style="stop-color:#331C67"/>
			<stop  offset="0.7758" style="stop-color:#51379B"/>
			<stop  offset="0.9995" style="stop-color:#5C41AF"/>
		</linearGradient>
		<path fill="url(#SVGID_6_)" d="M165.4,32.1c-0.1,0-0.1,0-0.1,0.1c0,0.1,0,0.1,0.1,0.1l2.6,0.9c0,0,0,0,0,0c0,0,0.1,0,0.1-0.1
			c0-0.1,0-0.1-0.1-0.1L165.4,32.1z"/>
		<linearGradient id="SVGID_7_" gradientUnits="userSpaceOnUse" x1="178.9476" y1="83.5529" x2="178.9476" y2="19.0037">
			<stop  offset="0" style="stop-color:#1D083F"/>
			<stop  offset="0.3198" style="stop-color:#331C67"/>
			<stop  offset="0.7758" style="stop-color:#51379B"/>
			<stop  offset="0.9995" style="stop-color:#5C41AF"/>
		</linearGradient>
		<path fill="url(#SVGID_7_)" d="M177.7,35.7l2.4,0.9c0,0,0,0,0,0c0,0,0.1,0,0.1-0.1c0-0.1,0-0.1-0.1-0.1l-2.4-0.9
			c-0.1,0-0.1,0-0.1,0.1C177.6,35.6,177.6,35.7,177.7,35.7z"/>
		<linearGradient id="SVGID_8_" gradientUnits="userSpaceOnUse" x1="174.6108" y1="83.5529" x2="174.6108" y2="19.0037">
			<stop  offset="0" style="stop-color:#1D083F"/>
			<stop  offset="0.3198" style="stop-color:#331C67"/>
			<stop  offset="0.7758" style="stop-color:#51379B"/>
			<stop  offset="0.9995" style="stop-color:#5C41AF"/>
		</linearGradient>
		<path fill="url(#SVGID_8_)" d="M173.9,34.1c-0.1,0-0.1,0-0.1,0.1c0,0.1,0,0.1,0.1,0.1l1.5,0.5c0,0,0,0,0,0c0,0,0.1,0,0.1-0.1
			c0-0.1,0-0.1-0.1-0.1L173.9,34.1z"/>
		<linearGradient id="SVGID_9_" gradientUnits="userSpaceOnUse" x1="168.998" y1="83.5529" x2="168.998" y2="19.0037">
			<stop  offset="0" style="stop-color:#1D083F"/>
			<stop  offset="0.3198" style="stop-color:#331C67"/>
			<stop  offset="0.7758" style="stop-color:#51379B"/>
			<stop  offset="0.9995" style="stop-color:#5C41AF"/>
		</linearGradient>
		<path fill="url(#SVGID_9_)" d="M166.2,31.5c0,0.1,0,0.1,0.1,0.1l5.3,1.9c0,0,0,0,0,0c0,0,0.1,0,0.1-0.1c0-0.1,0-0.1-0.1-0.1
			l-5.3-1.9C166.3,31.4,166.3,31.5,166.2,31.5z"/>
		<linearGradient id="SVGID_10_" gradientUnits="userSpaceOnUse" x1="174.3793" y1="83.5529" x2="174.3793" y2="19.0037">
			<stop  offset="0" style="stop-color:#1D083F"/>
			<stop  offset="0.3198" style="stop-color:#331C67"/>
			<stop  offset="0.7758" style="stop-color:#51379B"/>
			<stop  offset="0.9995" style="stop-color:#5C41AF"/>
		</linearGradient>
		<path fill="url(#SVGID_10_)" d="M173,32.8l2.7,0.9c0,0,0,0,0,0c0,0,0.1,0,0.1-0.1c0-0.1,0-0.1-0.1-0.1l-2.7-0.9
			c-0.1,0-0.1,0-0.1,0.1C172.9,32.7,172.9,32.8,173,32.8z"/>
		<linearGradient id="SVGID_11_" gradientUnits="userSpaceOnUse" x1="169.0878" y1="83.5529" x2="169.0878" y2="19.0037">
			<stop  offset="0" style="stop-color:#1D083F"/>
			<stop  offset="0.3198" style="stop-color:#331C67"/>
			<stop  offset="0.7758" style="stop-color:#51379B"/>
			<stop  offset="0.9995" style="stop-color:#5C41AF"/>
		</linearGradient>
		<path fill="url(#SVGID_11_)" d="M167.1,30.7l4,1.4c0,0,0,0,0,0c0,0,0.1,0,0.1-0.1c0-0.1,0-0.1-0.1-0.1l-4-1.4
			c-0.1,0-0.1,0-0.1,0.1C167,30.6,167,30.7,167.1,30.7z"/>
		<linearGradient id="SVGID_12_" gradientUnits="userSpaceOnUse" x1="225.772" y1="83.5529" x2="225.772" y2="19.0037">
			<stop  offset="0" style="stop-color:#1D083F"/>
			<stop  offset="0.3198" style="stop-color:#331C67"/>
			<stop  offset="0.7758" style="stop-color:#51379B"/>
			<stop  offset="0.9995" style="stop-color:#5C41AF"/>
		</linearGradient>
		<path fill="url(#SVGID_12_)" d="M226.7,43.6l-1.9,1.1c-0.1,0-0.1,0.1,0,0.1c0,0,0.1,0.1,0.1,0.1c0,0,0,0,0.1,0l1.9-1.1
			c0.1,0,0.1-0.1,0-0.1C226.8,43.5,226.7,43.5,226.7,43.6z"/>
		<linearGradient id="SVGID_13_" gradientUnits="userSpaceOnUse" x1="230.72" y1="83.5529" x2="230.72" y2="19.0037">
			<stop  offset="0" style="stop-color:#1D083F"/>
			<stop  offset="0.3198" style="stop-color:#331C67"/>
			<stop  offset="0.7758" style="stop-color:#51379B"/>
			<stop  offset="0.9995" style="stop-color:#5C41AF"/>
		</linearGradient>
		<path fill="url(#SVGID_13_)" d="M232.3,40.4l-3.3,1.9c-0.1,0-0.1,0.1,0,0.1c0,0,0.1,0.1,0.1,0.1c0,0,0,0,0.1,0l3.3-1.9
			c0.1,0,0.1-0.1,0-0.1S232.4,40.3,232.3,40.4z"/>
		<linearGradient id="SVGID_14_" gradientUnits="userSpaceOnUse" x1="235.3994" y1="83.5529" x2="235.3994" y2="19.0037">
			<stop  offset="0" style="stop-color:#1D083F"/>
			<stop  offset="0.3198" style="stop-color:#331C67"/>
			<stop  offset="0.7758" style="stop-color:#51379B"/>
			<stop  offset="0.9995" style="stop-color:#5C41AF"/>
		</linearGradient>
		<path fill="url(#SVGID_14_)" d="M237.3,37.5l-4,2.3c-0.1,0-0.1,0.1,0,0.1c0,0,0.1,0.1,0.1,0.1c0,0,0,0,0.1,0l4-2.3
			c0.1,0,0.1-0.1,0-0.1C237.5,37.5,237.4,37.5,237.3,37.5z"/>
		<linearGradient id="SVGID_15_" gradientUnits="userSpaceOnUse" x1="224.0496" y1="83.5529" x2="224.0496" y2="19.0037">
			<stop  offset="0" style="stop-color:#1D083F"/>
			<stop  offset="0.3198" style="stop-color:#331C67"/>
			<stop  offset="0.7758" style="stop-color:#51379B"/>
			<stop  offset="0.9995" style="stop-color:#5C41AF"/>
		</linearGradient>
		<path fill="url(#SVGID_15_)" d="M222.7,44C222.8,44,222.8,44,222.7,44l2.7-1.5c0.1,0,0.1-0.1,0-0.1c0-0.1-0.1-0.1-0.1,0l-2.6,1.5
			C222.6,43.8,222.6,43.9,222.7,44C222.7,44,222.7,44,222.7,44z"/>
		<linearGradient id="SVGID_16_" gradientUnits="userSpaceOnUse" x1="227.8119" y1="83.5529" x2="227.8119" y2="19.0037">
			<stop  offset="0" style="stop-color:#1D083F"/>
			<stop  offset="0.3198" style="stop-color:#331C67"/>
			<stop  offset="0.7758" style="stop-color:#51379B"/>
			<stop  offset="0.9995" style="stop-color:#5C41AF"/>
		</linearGradient>
		<path fill="url(#SVGID_16_)" d="M229,40.4c0-0.1-0.1-0.1-0.1,0l-2.1,1.2c-0.1,0-0.1,0.1,0,0.1c0,0,0.1,0.1,0.1,0.1c0,0,0,0,0.1,0
			l2.1-1.2C229,40.5,229,40.4,229,40.4z"/>
		<linearGradient id="SVGID_17_" gradientUnits="userSpaceOnUse" x1="231.1377" y1="83.5529" x2="231.1377" y2="19.0037">
			<stop  offset="0" style="stop-color:#1D083F"/>
			<stop  offset="0.3198" style="stop-color:#331C67"/>
			<stop  offset="0.7758" style="stop-color:#51379B"/>
			<stop  offset="0.9995" style="stop-color:#5C41AF"/>
		</linearGradient>
		<path fill="url(#SVGID_17_)" d="M232.7,38.2c0-0.1-0.1-0.1-0.1,0l-3,1.7c-0.1,0-0.1,0.1,0,0.1c0,0,0.1,0.1,0.1,0.1c0,0,0,0,0.1,0
			l3-1.7C232.8,38.3,232.8,38.3,232.7,38.2z"/>
		<linearGradient id="SVGID_18_" gradientUnits="userSpaceOnUse" x1="234.7651" y1="83.5529" x2="234.7651" y2="19.0037">
			<stop  offset="0" style="stop-color:#1D083F"/>
			<stop  offset="0.3198" style="stop-color:#331C67"/>
			<stop  offset="0.7758" style="stop-color:#51379B"/>
			<stop  offset="0.9995" style="stop-color:#5C41AF"/>
		</linearGradient>
		<path fill="url(#SVGID_18_)" d="M234.2,37.5C234.2,37.5,234.3,37.5,234.2,37.5l1.1-0.6c0.1,0,0.1-0.1,0-0.1c0-0.1-0.1-0.1-0.1,0
			l-1.1,0.6C234.1,37.3,234.1,37.4,234.2,37.5C234.1,37.5,234.2,37.5,234.2,37.5z"/>
		<linearGradient id="SVGID_19_" gradientUnits="userSpaceOnUse" x1="225.1687" y1="83.5529" x2="225.1687" y2="19.0037">
			<stop  offset="0" style="stop-color:#1D083F"/>
			<stop  offset="0.3198" style="stop-color:#331C67"/>
			<stop  offset="0.7758" style="stop-color:#51379B"/>
			<stop  offset="0.9995" style="stop-color:#5C41AF"/>
		</linearGradient>
		<path fill="url(#SVGID_19_)" d="M223.5,41.5C223.6,41.5,223.6,41.5,223.5,41.5l3.3-1.9c0.1,0,0.1-0.1,0-0.1c0-0.1-0.1-0.1-0.1,0
			l-3.3,1.8C223.4,41.3,223.4,41.4,223.5,41.5C223.5,41.5,223.5,41.5,223.5,41.5z"/>
		<linearGradient id="SVGID_20_" gradientUnits="userSpaceOnUse" x1="229.3497" y1="83.5529" x2="229.3497" y2="19.0037">
			<stop  offset="0" style="stop-color:#1D083F"/>
			<stop  offset="0.3198" style="stop-color:#331C67"/>
			<stop  offset="0.7758" style="stop-color:#51379B"/>
			<stop  offset="0.9995" style="stop-color:#5C41AF"/>
		</linearGradient>
		<path fill="url(#SVGID_20_)" d="M228.6,38.6C228.6,38.6,228.6,38.6,228.6,38.6l1.5-0.9c0.1,0,0.1-0.1,0-0.1c0-0.1-0.1-0.1-0.1,0
			l-1.5,0.8C228.5,38.4,228.5,38.5,228.6,38.6C228.5,38.6,228.6,38.6,228.6,38.6z"/>
		<linearGradient id="SVGID_21_" gradientUnits="userSpaceOnUse" x1="232.2849" y1="83.5529" x2="232.2849" y2="19.0037">
			<stop  offset="0" style="stop-color:#1D083F"/>
			<stop  offset="0.3198" style="stop-color:#331C67"/>
			<stop  offset="0.7758" style="stop-color:#51379B"/>
			<stop  offset="0.9995" style="stop-color:#5C41AF"/>
		</linearGradient>
		<path fill="url(#SVGID_21_)" d="M230.7,37.5C230.7,37.5,230.7,37.4,230.7,37.5l3.3-1.9c0.1,0,0.1-0.1,0-0.1c0-0.1-0.1-0.1-0.1,0
			l-3.3,1.8C230.5,37.3,230.5,37.3,230.7,37.5C230.6,37.4,230.6,37.5,230.7,37.5z"/>
		<linearGradient id="SVGID_22_" gradientUnits="userSpaceOnUse" x1="234.888" y1="83.5529" x2="234.888" y2="19.0037">
			<stop  offset="0" style="stop-color:#1D083F"/>
			<stop  offset="0.3198" style="stop-color:#331C67"/>
			<stop  offset="0.7758" style="stop-color:#51379B"/>
			<stop  offset="0.9995" style="stop-color:#5C41AF"/>
		</linearGradient>
		<path fill="url(#SVGID_22_)" d="M234.5,35.3C234.5,35.3,234.5,35.3,234.5,35.3l0.9-0.5c0.1,0,0.1-0.1,0-0.1s-0.1-0.1-0.1,0
			l-0.8,0.5C234.4,35.1,234.3,35.2,234.5,35.3C234.4,35.3,234.4,35.3,234.5,35.3z"/>
	</g>
	<linearGradient id="SVGID_23_" gradientUnits="userSpaceOnUse" x1="205.9867" y1="114.6025" x2="205.9867" y2="64.0693">
		<stop  offset="0" style="stop-color:#1D083F"/>
		<stop  offset="0.3198" style="stop-color:#331C67"/>
		<stop  offset="0.7758" style="stop-color:#51379B"/>
		<stop  offset="0.9995" style="stop-color:#5C41AF"/>
	</linearGradient>
	<path opacity="0.8" fill="url(#SVGID_23_)" d="M258.7,90.5c-1.2,0-2.4,0.1-3.6,0.3c-1.2-5.2-5.9-9-11.5-9c-2.1,0-4,0.5-5.7,1.5
		c-1.4-10.9-9.8-19.2-19.8-19.2c-10,0-18.2,8.2-19.7,19c-3.8-1.7-8.8-2.7-14.1-2.7c-11.9,0-21.6,4.9-22.3,11.1
		c-14,5.5-23.9,13.7-27,23.1h140c1.1-2.2,1.7-4.6,1.7-7.2C276.9,98.1,268.7,90.5,258.7,90.5z"/>
	<linearGradient id="SVGID_24_" gradientUnits="userSpaceOnUse" x1="118.7507" y1="145.1036" x2="118.31" y2="83.8421">
		<stop  offset="0" style="stop-color:#1D083F"/>
		<stop  offset="0.3198" style="stop-color:#331C67"/>
		<stop  offset="0.7758" style="stop-color:#51379B"/>
		<stop  offset="0.9995" style="stop-color:#5C41AF"/>
	</linearGradient>
	<path opacity="0.8" fill="url(#SVGID_24_)" d="M186.1,111.6c-0.7,0-1.4,0-2.1,0.1c-1.2-2.4-4.8-4.1-9.1-4.1c-3.8,0-7,1.3-8.6,3.2
		c-1.9,0.2-3.8,0.4-5.5,0.8c-0.8-4.6-4.8-8.1-9.7-8.1c-1.8,0-3.4,0.5-4.8,1.3c-0.4-1.7-1.1-3.3-2-4.8c1.3-2,2.1-4.4,2.1-6.9
		c0-7.8-7.1-14.1-15.9-14.1c-6.8,0-12.6,3.8-14.9,9.2c-1.9-0.5-3.9-0.8-6-0.8c-10.3,0-18.7,6.7-18.7,15c0,0.8,0.1,1.5,0.2,2.2
		c-1.3-0.7-2.8-1.1-4.4-1.1c-5.2,0-9.4,4-9.8,9.1c-3-1-6.4-1.6-10.1-1.8c-1.5-1.9-4.6-3.2-8.1-3.2c-5,0-9.1,2.6-9.1,5.7
		c0,0.1,0,0.2,0,0.3c-0.5,0-0.9-0.1-1.4-0.1c-9.4,0-16.9,7.6-16.9,16.9c0,9.4,7.6,16.9,16.9,16.9c7.3,0,13.4-4.6,15.9-11
		c1.6,1.1,3.5,1.8,5.7,1.8c2.5,0,4.8-0.9,6.5-2.5c1.5,5.9,6.8,10.3,13.2,10.3c7.2,0,13.1-5.6,13.6-12.8c4.2,1.9,10.1,3.1,16.8,3.1
		c8.8,0,16.3-2.1,20.2-5.1c1.6,5.2,8.2,9.2,16.1,9.2c6.6,0,12.3-2.7,15-6.7c3.7,2.9,9.1,4.7,15.1,4.7c11,0,19.9-6,19.9-13.4
		C206,117.6,197.1,111.6,186.1,111.6z"/>
	<path fill="#7DCAFA" d="M109.3,25.3c-6.7,0-13.9,0.7-13.9,1.9c0,1,4.3,1.5,6.9,1.6c0,0,0,0,0.1,0c1.6-0.7,4.3-1.5,6.9-1.5
		c2.8,0,5.5,0.9,6.9,1.5c0,0,0,0,0,0c0,0,0,0,0,0c2.6-0.2,6.9-0.7,6.9-1.6C123.2,25.9,116,25.3,109.3,25.3z"/>
</g>
</svg>
