G04 EAGLE Gerber RS-274X export*
G75*
%MOMM*%
%FSLAX34Y34*%
%LPD*%
%INSoldermask Bottom*%
%IPPOS*%
%AMOC8*
5,1,8,0,0,1.08239X$1,22.5*%
G01*
%ADD10C,0.703200*%
%ADD11C,1.203200*%
%ADD12C,2.003200*%


D10*
X98250Y821250D03*
X97500Y813750D03*
X97500Y806250D03*
X98250Y798750D03*
X238750Y962000D03*
X738750Y962000D03*
X902000Y821250D03*
X902500Y511250D03*
X246250Y962750D03*
X253750Y962750D03*
X261250Y962000D03*
X746250Y962750D03*
X753750Y962750D03*
X761250Y962000D03*
X902750Y813750D03*
X902750Y806250D03*
X902750Y799500D03*
X738750Y655000D03*
X746250Y655000D03*
X753750Y655000D03*
X761250Y655000D03*
X238500Y655000D03*
X246000Y655000D03*
X253500Y655000D03*
X261000Y655000D03*
X238500Y345250D03*
X246000Y345250D03*
X253500Y345250D03*
X261000Y345250D03*
X738750Y345250D03*
X746250Y345250D03*
X753750Y345250D03*
X761250Y345250D03*
X902500Y503750D03*
X902500Y496250D03*
X902500Y488750D03*
X97500Y510750D03*
X97500Y503250D03*
X97500Y495750D03*
X97500Y488250D03*
X902250Y201000D03*
X903000Y193500D03*
X903000Y186000D03*
X902250Y178500D03*
X761250Y37500D03*
X753750Y37500D03*
X746250Y37500D03*
X738750Y37500D03*
X261000Y37500D03*
X253500Y36750D03*
X246000Y36750D03*
X238500Y37500D03*
X97500Y179250D03*
X96750Y186750D03*
X96750Y194250D03*
X97500Y201750D03*
X915000Y345000D03*
X922500Y345000D03*
X930000Y345000D03*
X937500Y345000D03*
X945000Y345000D03*
X952500Y345000D03*
X960000Y345000D03*
X967500Y345000D03*
X975000Y345000D03*
X982500Y345000D03*
X990000Y345000D03*
X7500Y345000D03*
X15000Y345000D03*
X22500Y345000D03*
X30000Y345000D03*
X37500Y345000D03*
X45000Y345000D03*
X52500Y345000D03*
X60000Y345000D03*
X67500Y345000D03*
X75000Y345000D03*
X82500Y345000D03*
X917250Y654750D03*
X924750Y654750D03*
X932250Y654750D03*
X939750Y654750D03*
X947250Y654750D03*
X954750Y654750D03*
X962250Y654750D03*
X969750Y654750D03*
X977250Y654750D03*
X984750Y654750D03*
X992250Y654750D03*
X7500Y654750D03*
X15000Y654750D03*
X22500Y654750D03*
X30000Y654750D03*
X37500Y654750D03*
X45000Y654750D03*
X52500Y654750D03*
X60000Y654750D03*
X67500Y654750D03*
X75000Y654750D03*
X82500Y654750D03*
X213750Y994500D03*
X213750Y987000D03*
X213750Y979500D03*
X213750Y972000D03*
X783750Y994500D03*
X783750Y987000D03*
X783750Y979500D03*
X783750Y972000D03*
X780750Y28500D03*
X780750Y21000D03*
X780750Y13500D03*
X780750Y6000D03*
X210750Y28500D03*
X210750Y21000D03*
X210750Y13500D03*
X210750Y6000D03*
D11*
X522000Y118000D03*
X478000Y118000D03*
D12*
X587600Y294000D03*
X613000Y294000D03*
X638400Y294000D03*
X359000Y294000D03*
X384400Y294000D03*
X409800Y294000D03*
X435200Y294000D03*
X460600Y294000D03*
X486000Y294000D03*
X511400Y294000D03*
X536800Y294000D03*
D11*
X522000Y428000D03*
X478000Y428000D03*
D12*
X587600Y604000D03*
X613000Y604000D03*
X638400Y604000D03*
X359000Y604000D03*
X384400Y604000D03*
X409800Y604000D03*
X435200Y604000D03*
X460600Y604000D03*
X486000Y604000D03*
X511400Y604000D03*
X536800Y604000D03*
D11*
X522000Y738000D03*
X478000Y738000D03*
D12*
X587600Y914000D03*
X613000Y914000D03*
X638400Y914000D03*
X359000Y914000D03*
X384400Y914000D03*
X409800Y914000D03*
X435200Y914000D03*
X460600Y914000D03*
X486000Y914000D03*
X511400Y914000D03*
X536800Y914000D03*
M02*
