M48
; DRILL file {KiCad 8.0.4} date 2024-09-12T17:11:14+0200
; FORMAT={-:-/ absolute / inch / decimal}
; #@! TF.CreationDate,2024-09-12T17:11:14+02:00
; #@! TF.GenerationSoftware,Kicad,Pcbnew,8.0.4
; #@! TF.FileFunction,Plated,1,2,PTH
FMAT,2
INCH
; #@! TA.AperFunction,Plated,PTH,ViaDrill
T1C0.0118
; #@! TA.AperFunction,Plated,PTH,ComponentDrill
T2C0.0315
; #@! TA.AperFunction,Plated,PTH,ComponentDrill
T3C0.0394
; #@! TA.AperFunction,Plated,PTH,ComponentDrill
T4C0.0433
%
G90
G05
T1
X3.0472Y-2.4567
X3.0472Y-3.6772
X3.0472Y-4.8976
X3.063Y-2.1417
X3.063Y-3.3622
X3.063Y-4.5827
X3.0827Y-3.0079
X3.0827Y-4.2283
X3.0827Y-5.4488
X3.0866Y-2.622
X3.0866Y-3.8425
X3.0866Y-5.063
X3.1063Y-2.9213
X3.1063Y-4.1417
X3.1063Y-5.3622
X3.1339Y-2.4055
X3.1339Y-3.626
X3.1339Y-4.8465
X3.2126Y-2.9213
X3.2126Y-4.1417
X3.2126Y-5.3622
X3.4016Y-2.3701
X3.4016Y-3.5906
X3.4016Y-4.811
X3.4291Y-2.252
X3.4291Y-2.8543
X3.4291Y-3.4724
X3.4291Y-4.0748
X3.4291Y-4.6929
X3.4291Y-5.2953
X3.5079Y-2.4213
X3.5079Y-3.6417
X3.5079Y-4.8622
X3.5276Y-2.3031
X3.5276Y-3.5236
X3.5276Y-4.7441
X3.6378Y-2.937
X3.6378Y-4.1575
X3.6378Y-5.378
X3.6693Y-2.9016
X3.6693Y-2.9685
X3.6693Y-4.122
X3.6693Y-4.189
X3.6693Y-5.3425
X3.6693Y-5.4094
X3.7638Y-2.8425
X3.7638Y-4.063
X3.7638Y-5.2835
X3.8858Y-2.5315
X3.8858Y-3.752
X3.8858Y-4.9724
X3.9862Y-2.3425
X3.9862Y-3.563
X3.9862Y-4.7835
X4.0315Y-2.7323
X4.0315Y-3.9528
X4.0315Y-5.1732
X4.1102Y-2.8346
X4.1102Y-4.0551
X4.1102Y-5.2756
X4.2087Y-2.9016
X4.2087Y-2.9685
X4.2087Y-4.122
X4.2087Y-4.189
X4.2087Y-5.3425
X4.2087Y-5.4094
X4.2441Y-2.937
X4.2441Y-4.1575
X4.2441Y-5.378
X4.3661Y-2.4528
X4.3661Y-3.6732
X4.3661Y-4.8937
X4.3937Y-2.9016
X4.3937Y-4.122
X4.3937Y-5.3425
X4.4291Y-2.4016
X4.4291Y-3.622
X4.4291Y-4.8425
X4.7953Y-2.9921
X4.7953Y-4.2126
X4.7953Y-5.4331
X4.815Y-2.6772
X4.815Y-3.8976
X4.815Y-5.1181
X4.8268Y-2.1614
X4.8268Y-3.3819
X4.8268Y-4.6024
T2
X2.9445Y-2.4961
X2.9445Y-2.622
X2.9445Y-3.7165
X2.9445Y-3.8425
X2.9445Y-4.937
X2.9445Y-5.063
X3.2445Y-2.4961
X3.2445Y-2.622
X3.2445Y-3.7165
X3.2445Y-3.8425
X3.2445Y-4.937
X3.2445Y-5.063
X4.6669Y-2.4429
X4.6669Y-2.561
X4.6669Y-2.6791
X4.6669Y-3.6634
X4.6669Y-3.7815
X4.6669Y-3.8996
X4.6669Y-4.8839
X4.6669Y-5.002
X4.6669Y-5.1201
X4.9669Y-2.4429
X4.9669Y-2.561
X4.9669Y-2.6791
X4.9669Y-3.6634
X4.9669Y-3.7815
X4.9669Y-3.8996
X4.9669Y-4.8839
X4.9669Y-5.002
X4.9669Y-5.1201
T3
X3.3829Y-2.1496
X3.3829Y-3.3701
X3.3829Y-4.5906
X3.4829Y-2.1496
X3.4829Y-3.3701
X3.4829Y-4.5906
X3.5829Y-2.1496
X3.5829Y-3.3701
X3.5829Y-4.5906
X3.6829Y-2.1496
X3.6829Y-3.3701
X3.6829Y-4.5906
X3.7829Y-2.1496
X3.7829Y-3.3701
X3.7829Y-4.5906
X3.8829Y-2.1496
X3.8829Y-3.3701
X3.8829Y-4.5906
X3.9829Y-2.1496
X3.9829Y-3.3701
X3.9829Y-4.5906
X4.0829Y-2.1496
X4.0829Y-3.3701
X4.0829Y-4.5906
X4.2795Y-2.1496
X4.2795Y-3.3701
X4.2795Y-4.5906
X4.3795Y-2.1496
X4.3795Y-3.3701
X4.3795Y-4.5906
X4.4795Y-2.1496
X4.4795Y-3.3701
X4.4795Y-4.5906
T4
X2.5457Y-2.2896
X2.5457Y-2.8226
X2.5457Y-3.5101
X2.5457Y-4.043
X2.5457Y-4.7306
X2.5457Y-5.2635
X2.671Y-2.6973
X2.671Y-3.9178
X2.671Y-5.1382
X2.671Y-2.4149
X2.671Y-3.6354
X2.671Y-4.8559
X2.7267Y-2.1087
X2.7267Y-3.0035
X2.7267Y-3.3292
X2.7267Y-4.224
X2.7267Y-4.5496
X2.7267Y-5.4445
X2.8519Y-2.234
X2.8519Y-2.8782
X2.8519Y-3.4544
X2.8519Y-4.0987
X2.8519Y-4.6749
X2.8519Y-5.3192
X5.0201Y-2.2359
X5.0201Y-2.8782
X5.0201Y-3.4564
X5.0201Y-4.0987
X5.0201Y-4.6769
X5.0201Y-5.3192
X5.1454Y-2.1107
X5.1454Y-3.0035
X5.1454Y-3.3311
X5.1454Y-4.224
X5.1454Y-4.5516
X5.1454Y-5.4445
X5.2011Y-2.6973
X5.2011Y-3.9178
X5.2011Y-5.1382
X5.2011Y-2.4169
X5.2011Y-3.6374
X5.2011Y-4.8578
X5.3263Y-2.2916
X5.3263Y-2.8226
X5.3263Y-3.5121
X5.3263Y-4.043
X5.3263Y-4.7326
X5.3263Y-5.2635
M30
