%TF.GenerationSoftware,KiCad,Pcbnew,8.0.4*%
%TF.CreationDate,2024-08-31T16:47:04+02:00*%
%TF.ProjectId,semi_tht,73656d69-5f74-4687-942e-6b696361645f,rev?*%
%TF.SameCoordinates,Original*%
%TF.FileFunction,Soldermask,Bot*%
%TF.FilePolarity,Negative*%
%FSLAX46Y46*%
G04 Gerber Fmt 4.6, Leading zero omitted, Abs format (unit mm)*
G04 Created by KiCad (PCBNEW 8.0.4) date 2024-08-31 16:47:04*
%MOMM*%
%LPD*%
G01*
G04 APERTURE LIST*
%ADD10C,2.000000*%
%ADD11O,1.700000X1.700000*%
%ADD12R,1.700000X1.700000*%
%ADD13O,1.600000X1.600000*%
%ADD14C,1.600000*%
%ADD15C,0.900000*%
G04 APERTURE END LIST*
D10*
%TO.C,S1*%
X47439088Y-56742893D03*
X42842894Y-61339088D03*
X44257107Y-53560913D03*
X39660913Y-58157107D03*
%TD*%
%TO.C,S4*%
X105692894Y-53610913D03*
X110289088Y-58207107D03*
X102510913Y-56792894D03*
X107107108Y-61389088D03*
%TD*%
D11*
%TO.C,X1*%
X88780000Y-54600000D03*
X86240000Y-54600000D03*
D12*
X83700000Y-54600000D03*
%TD*%
D13*
%TO.C,R7*%
X101160000Y-65050000D03*
D14*
X93540000Y-65050000D03*
%TD*%
D10*
%TO.C,S2*%
X44257107Y-76289088D03*
X39660913Y-71692894D03*
X47439088Y-73107107D03*
X42842893Y-68510913D03*
%TD*%
D11*
%TO.C,X2*%
X78705000Y-54600000D03*
X76165000Y-54600000D03*
X73625000Y-54600000D03*
X71085000Y-54600000D03*
X68545000Y-54600000D03*
X66005000Y-54600000D03*
X63465000Y-54600000D03*
D12*
X60925000Y-54600000D03*
%TD*%
D14*
%TO.C,R4*%
X49790000Y-66600000D03*
D13*
X57410000Y-66600000D03*
%TD*%
D15*
%TO.C,X3*%
X77200000Y-72000000D03*
X72800000Y-72000000D03*
%TD*%
D13*
%TO.C,R8*%
X93540000Y-68050000D03*
D14*
X101160000Y-68050000D03*
%TD*%
D10*
%TO.C,S3*%
X110289088Y-71692894D03*
X105692894Y-76289088D03*
X107107107Y-68510913D03*
X102510913Y-73107108D03*
%TD*%
D14*
%TO.C,R3*%
X101160000Y-62050000D03*
D13*
X93540000Y-62050000D03*
%TD*%
D14*
%TO.C,R1*%
X57410000Y-63400000D03*
D13*
X49790000Y-63400000D03*
%TD*%
M02*
