<?xml version="1.0" encoding="utf-8"?>
<!-- Generator: Adobe Illustrator 27.1.0, SVG Export Plug-In . SVG Version: 6.00 Build 0)  -->
<svg version="1.1" fill="currentColor" id="Ebene_1" xmlns="http://www.w3.org/2000/svg" xmlns:xlink="http://www.w3.org/1999/xlink" x="0px" y="0px"
	 viewBox="0 0 64 64" style="enable-background:new 0 0 64 64;" xml:space="preserve">
<g>
	<g>
		<path d="M32,4.8c1.9,0,3.8,0.2,5.6,0.6c1.8,0.4,3.5,0.9,5.2,1.6c1,0.4,1.9,0.8,2.8,1.4c0,0.1,0,0.2,0,0.4c0,1,0.8,1.7,1.7,1.7
			c1,0,1.7-0.8,1.7-1.7s-0.8-1.7-1.7-1.7c-0.4,0-0.8,0.1-1.1,0.4c-1-0.5-1.9-1-3-1.4c-1.7-0.7-3.5-1.3-5.4-1.6
			c-1.7-0.3-3.4-0.5-5.2-0.5V1.7c1.9,0,3.8,0.2,5.6,0.6c2,0.4,3.9,1,5.8,1.8c1.8,0.8,3.6,1.7,5.2,2.8s3.2,2.3,4.6,3.7
			c1.4,1.4,2.7,2.9,3.8,4.5s2.1,3.3,2.8,5.1c0.1,0.3,0.5,0.4,0.8,0.3c0.3-0.1,0.4-0.5,0.3-0.8c0,0,0,0,0,0c-0.8-1.9-1.8-3.7-3-5.4
			c-1.2-1.7-2.5-3.2-3.9-4.7c-1.5-1.4-3-2.7-4.7-3.8S46.4,3.8,44.4,3c-1.9-0.8-3.9-1.4-6-1.8c-2.1-0.4-4.2-0.6-6.5-0.6
			c-0.3,0-0.6,0.3-0.6,0.6v3.1C31.4,4.5,31.7,4.8,32,4.8z M47.3,8.1c0.3,0,0.6,0.2,0.6,0.6s-0.2,0.6-0.6,0.6s-0.6-0.2-0.6-0.6
			S46.9,8.1,47.3,8.1z M57.7,32c0-1.7-0.2-3.5-0.5-5.1c0-0.3-0.3-0.5-0.6-0.5l0,0c-0.3,0-0.6,0.3-0.6,0.6c0,0,0,0.1,0,0.1
			c0.3,1.6,0.5,3.2,0.5,4.9s-0.2,3.3-0.5,4.9c-0.2,1-0.5,2-0.8,3c-0.1,0-0.1,0-0.2,0c-1,0-1.7,0.8-1.7,1.7c0,1,0.8,1.7,1.7,1.7
			c1,0,1.7-0.8,1.7-1.7c0-0.5-0.2-0.9-0.5-1.2c0.4-1.1,0.7-2.2,0.9-3.3C57.5,35.5,57.7,33.8,57.7,32z M55,42.1
			c-0.3,0-0.6-0.2-0.6-0.6c0-0.3,0.2-0.6,0.6-0.6c0.3,0,0.6,0.2,0.6,0.6C55.6,41.9,55.4,42.1,55,42.1z M24.8,8c0,1,0.8,1.7,1.7,1.7
			c0.9,0,1.7-0.7,1.7-1.6C29.5,8,30.8,7.9,32,7.9c1.7,0,3.3,0.2,4.9,0.5c1.6,0.3,3.1,0.8,4.6,1.4c1.5,0.6,2.9,1.4,4.2,2.2
			c1.3,0.9,2.5,1.9,3.6,3c1.1,1.1,2.1,2.3,3,3.6c0.9,1.3,1.6,2.7,2.3,4.1c0.1,0.3,0.5,0.4,0.8,0.3l2.9-1.2c0.3-0.1,0.4-0.5,0.3-0.8
			l0,0c-0.7-1.7-1.6-3.3-2.7-4.8c-0.7-1-1.4-1.9-2.2-2.8c0.1-0.2,0.1-0.4,0.1-0.6c0-1-0.8-1.7-1.7-1.7s-1.7,0.8-1.7,1.7
			s0.8,1.7,1.7,1.7c0.3,0,0.6-0.1,0.9-0.2c0.7,0.8,1.4,1.7,2,2.6c0.9,1.3,1.6,2.7,2.3,4.1l-1.8,0.8c-0.6-1.3-1.3-2.6-2.1-3.8
			c-0.9-1.4-2-2.6-3.1-3.7s-2.4-2.2-3.8-3.1C45,10.1,43.5,9.3,42,8.7c-1.5-0.6-3.2-1.1-4.8-1.5c-1.7-0.3-3.4-0.5-5.2-0.5
			c-1.4,0-2.7,0.1-4,0.3c-0.3-0.4-0.8-0.7-1.4-0.7C25.6,6.3,24.8,7.1,24.8,8z M52.1,13.3c-0.3,0-0.6-0.2-0.6-0.6
			c0-0.3,0.2-0.6,0.6-0.6s0.6,0.2,0.6,0.6S52.4,13.3,52.1,13.3z M27.2,8c0,0.3-0.2,0.6-0.6,0.6C26.3,8.6,26,8.3,26,8
			c0-0.3,0.2-0.6,0.6-0.6C26.9,7.4,27.2,7.7,27.2,8z M10.7,46.2c0.9,1.4,2,2.6,3.1,3.7c1.2,1.1,2.4,2.2,3.8,3.1s2.8,1.7,4.4,2.3
			c0.9,0.4,1.8,0.7,2.8,1c0.1,0.8,0.8,1.5,1.7,1.5c1,0,1.7-0.8,1.7-1.7c0-1-0.8-1.7-1.7-1.7c-0.6,0-1.2,0.3-1.5,0.8
			c-0.9-0.3-1.7-0.6-2.6-0.9c-1.5-0.6-2.9-1.4-4.2-2.2s-2.5-1.9-3.6-3s-2.1-2.3-3-3.6s-1.6-2.7-2.3-4.1c-0.1-0.3-0.5-0.4-0.8-0.3
			l-5.2,2.2c-0.7-1.6-1.2-3.4-1.6-5.1c-0.4-2-0.6-4-0.6-6.1s0.2-4.1,0.6-6.1s1-3.9,1.8-5.7c0.7-1.6,1.6-3.2,2.5-4.7l2.1,1.4
			c0.3,0.2,0.6,0.1,0.8-0.2c1-1.5,2.1-2.8,3.4-4s2.6-2.3,4.1-3.3c1.5-1,3.1-1.8,4.7-2.5s3.4-1.2,5.2-1.6c0.3-0.1,0.5-0.4,0.5-0.7
			l0,0l-0.6-3c-0.1-0.3-0.3-0.5-0.6-0.5l0,0c0,0-0.1,0-0.1,0c-2.1,0.4-4.1,1-6,1.8c-1.9,0.8-3.7,1.8-5.4,2.9s-3.3,2.4-4.7,3.8
			c-0.2,0.2-0.2,0.6,0,0.8s0.6,0.2,0.8,0l0,0c1.4-1.4,2.9-2.6,4.6-3.7s3.4-2,5.2-2.8c1.7-0.7,3.4-1.2,5.2-1.6l0.4,1.9
			c-1.7,0.4-3.3,0.9-4.9,1.5c-1.7,0.7-3.4,1.6-4.9,2.6c-1.5,1-3,2.2-4.3,3.5c-1.2,1.2-2.2,2.4-3.2,3.7l-2.1-1.4
			c-0.3-0.2-0.6-0.1-0.8,0.2c-1.2,1.7-2.1,3.5-3,5.4s-1.4,3.9-1.9,5.9C0.2,27.7,0,29.8,0,32c0,2.2,0.2,4.3,0.6,6.4
			c0.4,2,1.1,4,1.9,5.9c0.1,0.3,0.5,0.4,0.8,0.3l5.3-2.2C9.2,43.7,9.9,45,10.7,46.2z M26.5,55.5c0.3,0,0.6,0.2,0.6,0.6
			c0,0.3-0.2,0.6-0.6,0.6c-0.3,0-0.6-0.2-0.6-0.6S26.2,55.5,26.5,55.5z M9.4,22.6c0.6-1.4,1.4-2.8,2.3-4.1c0.9-1.3,1.9-2.5,3-3.6
			c0.8-0.8,1.7-1.6,2.7-2.3c0.3,0.2,0.6,0.3,1,0.3c1,0,1.7-0.8,1.7-1.7s-0.8-1.7-1.7-1.7s-1.7,0.8-1.7,1.7c0,0.2,0,0.3,0.1,0.5
			c-1,0.7-1.9,1.5-2.8,2.4c-1.2,1.1-2.2,2.4-3.1,3.7c-0.9,1.4-1.7,2.8-2.4,4.3c-0.6,1.5-1.2,3.1-1.5,4.8c-0.3,1.6-0.5,3.4-0.5,5.1
			c0,1.7,0.2,3.5,0.5,5.1c0.1,0.3,0.4,0.5,0.7,0.5C7.8,37.5,8,37.2,8,36.9v0c-0.3-1.6-0.5-3.2-0.5-4.9c0-1.7,0.2-3.3,0.5-4.9
			C8.3,25.6,8.8,24.1,9.4,22.6z M18.3,10.7c0.3,0,0.6,0.2,0.6,0.6s-0.2,0.6-0.6,0.6c-0.3,0-0.6-0.2-0.6-0.6S18,10.7,18.3,10.7z
			 M49.2,57.2c-1.6,1.1-3.4,2-5.2,2.8c-1.8,0.8-3.8,1.4-5.8,1.8c-2,0.4-4.1,0.6-6.2,0.6s-4.2-0.2-6.2-0.6c-2-0.4-3.9-1-5.8-1.8
			c-1.8-0.8-3.6-1.7-5.2-2.8s-3.2-2.3-4.6-3.7c-1.3-1.2-2.4-2.6-3.4-4l1.6-1.1c1,1.3,2,2.6,3.2,3.7c1.3,1.3,2.7,2.4,4.3,3.5
			c1.5,1,3.2,1.9,4.9,2.6s3.5,1.3,5.4,1.6c1.9,0.4,3.8,0.6,5.8,0.6c0.3,0,0.6-0.3,0.6-0.6v-2.5c1.6,0,3.1-0.2,4.6-0.5
			c1.7-0.3,3.3-0.8,4.8-1.5c1.5-0.6,3-1.4,4.4-2.3c0.8-0.5,1.5-1.1,2.2-1.7c0.2,0.1,0.5,0.2,0.8,0.2c1,0,1.7-0.8,1.7-1.7
			s-0.8-1.7-1.7-1.7s-1.7,0.8-1.7,1.7c0,0.2,0,0.4,0.1,0.6c-0.7,0.6-1.4,1.1-2.1,1.6c-1.3,0.9-2.7,1.6-4.2,2.2
			c-1.5,0.6-3,1.1-4.6,1.4c-1.6,0.3-3.3,0.5-4.9,0.5c-0.3,0-0.6,0.3-0.6,0.6v2.5c-1.7,0-3.4-0.2-5-0.5c-1.8-0.4-3.5-0.9-5.2-1.6
			c-1.7-0.7-3.2-1.5-4.7-2.5c-1.5-1-2.8-2.1-4.1-3.3s-2.4-2.6-3.4-4C8.9,47.1,8.8,47,8.6,47l0,0c-0.1,0-0.2,0-0.3,0.1l-2.6,1.7
			c-0.3,0.2-0.3,0.5-0.2,0.8l0,0c1.2,1.7,2.5,3.2,3.9,4.7c1.5,1.4,3,2.7,4.7,3.8c1.7,1.1,3.5,2.1,5.4,2.9s3.9,1.4,6,1.8
			c2.1,0.4,4.2,0.6,6.5,0.6c2.2,0,4.4-0.2,6.5-0.6c2.1-0.4,4.1-1,6-1.8s3.7-1.8,5.4-2.9c0.3-0.2,0.3-0.5,0.2-0.8
			C49.9,57.1,49.5,57,49.2,57.2z M49.5,49.3c0.3,0,0.6,0.2,0.6,0.6s-0.2,0.6-0.6,0.6s-0.6-0.2-0.6-0.6
			C48.9,49.5,49.2,49.3,49.5,49.3z M63.4,25.7c-0.1-0.3-0.3-0.5-0.6-0.5l0,0c0,0-0.1,0-0.1,0l-3.1,0.6c-0.3,0.1-0.5,0.4-0.5,0.7l0,0
			c0.4,1.8,0.6,3.6,0.6,5.5c0,1.9-0.2,3.7-0.6,5.5c-0.4,1.8-0.9,3.5-1.6,5.1c-0.4,0.9-0.8,1.7-1.3,2.6c-0.2-0.1-0.4-0.1-0.6-0.1
			c-1,0-1.7,0.8-1.7,1.7c0,1,0.8,1.7,1.7,1.7c1,0,1.7-0.8,1.7-1.7c0-0.3-0.1-0.6-0.2-0.9c0.5-0.9,1-1.9,1.4-2.9
			c0.7-1.7,1.3-3.5,1.7-5.3c0.4-1.8,0.6-3.8,0.6-5.7c0-1.8-0.2-3.5-0.5-5.1l1.9-0.4c0.3,1.8,0.5,3.6,0.5,5.5c0,2.1-0.2,4.1-0.6,6.1
			s-1,3.9-1.8,5.7c-0.8,1.8-1.7,3.5-2.8,5.1c-1,1.5-2.1,2.8-3.4,4.1l-1.8-1.8c-0.2-0.2-0.6-0.2-0.8,0c-1.3,1.2-2.6,2.3-4.1,3.3
			c-1.5,1-3.1,1.8-4.7,2.5c-1,0.4-2.1,0.8-3.2,1.1c-0.3-0.5-0.9-0.8-1.5-0.8c-1,0-1.7,0.8-1.7,1.7c0,1,0.8,1.7,1.7,1.7
			c0.9,0,1.6-0.6,1.7-1.5c1.2-0.3,2.3-0.7,3.4-1.2c1.7-0.7,3.4-1.6,4.9-2.6c1.4-0.9,2.6-2,3.8-3.1l1.8,1.8c0.2,0.2,0.6,0.2,0.8,0
			c1.5-1.4,2.8-3,3.9-4.7c1.2-1.7,2.1-3.5,3-5.4c0.8-1.9,1.4-3.9,1.9-5.9c0.4-2,0.6-4.2,0.6-6.4C64,29.8,63.8,27.7,63.4,25.7z
			 M55.7,47.4c-0.3,0-0.6-0.2-0.6-0.6c0-0.3,0.2-0.6,0.6-0.6c0.3,0,0.6,0.2,0.6,0.6C56.2,47.1,56,47.4,55.7,47.4z M38.1,59.7
			c-0.3,0-0.6-0.2-0.6-0.6s0.2-0.6,0.6-0.6s0.6,0.2,0.6,0.6S38.5,59.7,38.1,59.7z M5.7,23.4c0.9,0,1.7-0.8,1.7-1.7
			c0-1-0.8-1.7-1.7-1.7S4,20.7,4,21.7c0,0.5,0.3,1,0.7,1.4c-0.3,1-0.6,2.1-0.9,3.2c0,0,0,0,0,0.1s0,0,0,0.1
			c-0.4,1.8-0.6,3.7-0.6,5.7c0,2,0.2,3.9,0.6,5.7c0.1,0.3,0.4,0.5,0.7,0.5c0.3-0.1,0.5-0.4,0.5-0.7v0c-0.4-1.8-0.6-3.6-0.6-5.5
			s0.2-3.7,0.6-5.5C5.1,25.5,5.4,24.4,5.7,23.4z M5.7,21.1c0.3,0,0.6,0.2,0.6,0.6c0,0.3-0.2,0.6-0.6,0.6c-0.3,0-0.6-0.2-0.6-0.6
			C5.1,21.3,5.4,21.1,5.7,21.1z"/>
	</g>
</g>
</svg>
