<?xml version="1.0" encoding="utf-8"?>
<!-- Generator: Adobe Illustrator 27.1.0, SVG Export Plug-In . SVG Version: 6.00 Build 0)  -->
<svg version="1.1" id="logo_maschinendeck" xmlns:svg="http://www.w3.org/2000/svg"
	 xmlns="http://www.w3.org/2000/svg" xmlns:xlink="http://www.w3.org/1999/xlink" x="0px" y="0px" viewBox="0 0 512 512"
	 style="enable-background:new 0 0 512 512;" xml:space="preserve">
<g>
	<g>
		<path d="M256,36.3c15.4,0,30.5,1.5,45,4.5c14.5,2.9,28.5,7.2,41.9,12.8c7.7,3.2,15.2,6.8,22.4,10.9c-0.2,1-0.4,2-0.4,3.1
			c0,7.7,6.3,14,14,14s14-6.3,14-14s-6.3-14-14-14c-3.2,0-6.1,1.1-8.5,2.9c-7.7-4.3-15.7-8.2-23.9-11.6
			c-13.9-5.8-28.5-10.3-43.7-13.3c-13.6-2.7-27.8-4.1-42.1-4.4V11.6c15.5,0.3,30.7,1.8,45.4,4.7c16.2,3.3,31.8,8.1,46.6,14.3
			c14.9,6.2,29,13.8,42.2,22.6c13.2,8.8,25.5,18.8,36.8,29.9c11.2,11.1,21.4,23.2,30.3,36.2c8.9,13,16.6,26.9,22.9,41.5
			c1,2.4,3.8,3.6,6.2,2.6c2.4-1,3.6-3.7,2.6-6.1c0,0,0-0.1-0.1-0.1c-6.5-15.2-14.5-29.6-23.8-43.2c-9.3-13.5-19.8-26.1-31.5-37.6
			c-11.7-11.5-24.5-21.9-38.2-31s-28.4-17-43.8-23.4C341,15.5,324.8,10.5,308,7.1C291.2,3.8,273.8,2,256,2c-2.6,0-4.7,2.1-4.7,4.7
			v24.9C251.3,34.2,253.4,36.3,256,36.3z M379,63c2.6,0,4.6,2,4.6,4.5s-2,4.5-4.6,4.5s-4.6-2-4.6-4.5S376.4,63,379,63z M463.3,256
			c0-14.1-1.4-27.9-4.2-41.2c-0.4-2.3-2.4-3.9-4.7-3.8v0c-2.6,0.1-4.7,2.2-4.6,4.8c0,0.3,0,0.6,0.1,0.9c2.6,12.7,4,25.8,4,39.2
			c0,13.4-1.4,26.6-4,39.2c-1.7,8.2-4,16.3-6.7,24.1c-0.5-0.1-1-0.1-1.6-0.1c-7.7,0-14,6.3-14,14c0,7.7,6.3,14,14,14s14-6.3,14-14
			c0-3.7-1.5-7.1-3.9-9.6c3.1-8.6,5.6-17.4,7.4-26.4C461.9,283.9,463.3,270.1,463.3,256z M441.6,337.7c-2.6,0-4.6-2-4.6-4.5
			c0-2.6,2-4.5,4.6-4.5s4.6,2,4.6,4.5C446.2,335.8,444.2,337.7,441.6,337.7z M198.3,62.5c0,7.7,6.3,14,14,14c7.4,0,13.5-5.8,14-13
			c9.7-1.4,19.6-2.2,29.7-2.2c13.7,0,27,1.4,39.9,4c12.9,2.6,25.3,6.4,37.1,11.4c11.8,4.9,23.1,11,33.6,18c10.5,7,20.3,15,29.3,23.8
			c9,8.8,17.1,18.5,24.2,28.8c7.1,10.4,13.2,21.4,18.2,33.1c1,2.4,3.8,3.5,6.2,2.5l23.3-9.7c2.4-1,3.6-3.8,2.5-6.2c0,0,0,0,0,0
			c-5.9-13.7-13.1-26.7-21.5-38.9c-5.5-8-11.4-15.6-17.9-22.8c0.6-1.5,0.9-3.1,0.9-4.8c0-7.7-6.3-14-14-14s-14,6.3-14,14
			c0,7.7,6.3,14,14,14c2.5,0,4.9-0.7,7-1.9c5.8,6.6,11.2,13.5,16.2,20.8c7.1,10.4,13.2,21.5,18.5,33l-14.6,6.1
			c-4.9-10.6-10.5-20.9-17.1-30.5c-7.5-10.9-15.9-21-25.3-30.2c-9.4-9.2-19.7-17.6-30.7-24.9c-11-7.3-22.8-13.7-35.2-18.8
			c-12.4-5.2-25.4-9.2-38.9-11.9c-13.5-2.7-27.5-4.1-41.8-4.1c-11,0-21.8,0.9-32.3,2.5c-2.6-3.5-6.7-5.7-11.3-5.7
			C204.6,48.6,198.3,54.9,198.3,62.5z M417.9,104.9c-2.6,0-4.6-2-4.6-4.5c0-2.6,2-4.5,4.6-4.5s4.6,2,4.6,4.5
			C422.5,102.9,420.5,104.9,417.9,104.9z M216.9,62.5c0,2.6-2,4.5-4.6,4.5c-2.6,0-4.6-2-4.6-4.5c0-2.6,2-4.5,4.6-4.5
			S216.9,60,216.9,62.5z M84.1,370.2c7.5,10.9,15.9,21,25.3,30.2c9.4,9.2,19.7,17.6,30.7,24.9c11,7.3,22.8,13.7,35.2,18.8
			c7.2,3,14.7,5.6,22.3,7.8c1,6.8,6.8,12,13.9,12c7.7,0,14-6.3,14-14s-6.3-14-14-14c-5,0-9.4,2.7-11.9,6.6c-7-2.1-13.9-4.5-20.6-7.3
			c-11.8-4.9-23.1-11-33.6-18c-10.5-7-20.3-15-29.3-23.8c-9-8.8-17.1-18.5-24.2-28.8s-13.2-21.4-18.2-33.1c-1-2.4-3.8-3.5-6.2-2.5
			l-42.1,17.5c-5.4-13.3-9.9-27.1-12.8-41.5c-3.3-15.9-5-32.4-5-49.3c0-16.9,1.7-33.4,5-49.3c3.3-15.9,8.2-31.3,14.5-45.9
			c5.7-13.2,12.6-25.7,20.5-37.6l16.9,11.2c2.2,1.4,5.1,0.9,6.5-1.3c8-11.7,17.2-22.6,27.3-32.5s21.2-18.9,33-26.8
			c11.9-7.9,24.6-14.7,37.9-20.3s27.4-9.9,41.9-12.8c2.6-0.5,4.2-3,3.7-5.5c0,0,0,0,0,0l-5.1-24.4c-0.5-2.2-2.5-3.8-4.8-3.7v0
			c-0.3,0-0.5,0-0.8,0.1c-16.8,3.4-33,8.4-48.4,14.8c-15.4,6.4-30.1,14.3-43.8,23.4s-26.5,19.5-38.2,31c-1.9,1.8-2,4.8-0.2,6.7
			c1.8,1.9,4.8,2,6.7,0.2c0,0,0.1-0.1,0.1-0.1C91.5,72,103.8,62,117,53.2c13.2-8.8,27.3-16.4,42.2-22.6c13.4-5.6,27.6-9.9,42.1-13.1
			l3.2,15.2c-13.5,3-26.6,7-39.1,12.2c-13.9,5.8-27.1,12.9-39.5,21.1c-12.4,8.2-23.9,17.6-34.4,28c-9.4,9.3-17.9,19.4-25.6,30.2
			l-17.3-11.5c-2.2-1.4-5.1-0.9-6.5,1.3c-9.3,13.5-17.3,28-23.8,43.2c-6.5,15.2-11.6,31.2-15,47.7C-0.2,221.3-2,238.5-2,256
			c0,17.5,1.8,34.7,5.2,51.2s8.5,32.5,15,47.7c1,2.4,3.8,3.5,6.2,2.5L67,339.7C71.9,350.3,77.5,360.6,84.1,370.2z M211.5,445.5
			c2.6,0,4.6,2,4.6,4.5c0,2.6-2,4.5-4.6,4.5s-4.6-2-4.6-4.5C206.9,447.5,208.9,445.5,211.5,445.5z M73.7,180.2
			c5-11.6,11.1-22.7,18.2-33.1c7.1-10.4,15.2-20,24.2-28.8c6.7-6.6,13.9-12.7,21.5-18.3c2.3,1.6,5,2.5,8,2.5c7.7,0,14-6.3,14-14
			s-6.3-14-14-14s-14,6.3-14,14c0,1.3,0.2,2.6,0.5,3.8c-8,5.9-15.6,12.3-22.6,19.3c-9.4,9.2-17.9,19.3-25.3,30.2
			c-7.5,10.9-13.9,22.5-19.1,34.7s-9.3,25-12.1,38.3c-2.8,13.3-4.2,27.1-4.2,41.2c0,14.1,1.5,27.9,4.2,41.1c0.5,2.6,3,4.2,5.5,3.7
			c2.6-0.5,4.3-3,3.8-5.5c0,0,0-0.1,0-0.1c-2.6-12.7-4-25.8-4-39.2s1.4-26.6,4-39.2C64.8,204.1,68.7,191.9,73.7,180.2z M145.5,84
			c2.6,0,4.6,2,4.6,4.5s-2,4.5-4.6,4.5s-4.6-2-4.6-4.5S142.9,84,145.5,84z M395,458.8c-13.2,8.8-27.4,16.4-42.2,22.6
			c-14.9,6.2-30.5,11-46.6,14.3c-16.2,3.3-32.9,5-50.1,5c-17.2,0-33.9-1.7-50.1-5c-16.2-3.3-31.8-8.1-46.6-14.3
			c-14.9-6.2-29-13.8-42.2-22.6c-13.2-8.8-25.5-18.8-36.8-29.9c-10.1-10-19.2-20.9-27.5-32.4l13.1-8.7c7.7,10.7,16.2,20.9,25.6,30.2
			c10.5,10.4,22.1,19.7,34.4,28c12.4,8.2,25.6,15.3,39.5,21.1c13.9,5.8,28.5,10.3,43.7,13.3c15.1,3.1,30.8,4.7,46.9,4.7
			c2.6,0,4.7-2.1,4.7-4.7v-20.5c12.6-0.3,25-1.5,37-3.9c13.5-2.7,26.5-6.7,38.9-11.9s24.2-11.5,35.2-18.8
			c6.3-4.2,12.3-8.7,18.1-13.5c2,1.1,4.3,1.8,6.8,1.8c7.7,0,14-6.3,14-14c0-7.7-6.3-14-14-14s-14,6.3-14,14c0,1.8,0.4,3.5,1,5.1
			c-5.4,4.5-11.1,8.8-17.1,12.7c-10.5,7-21.8,13-33.6,18c-11.8,4.9-24.3,8.8-37.1,11.3c-12.9,2.6-26.2,4-39.9,4
			c-2.6,0-4.7,2.1-4.7,4.7v20c-13.7-0.3-27.2-1.6-40.3-4.2c-14.5-2.9-28.5-7.2-41.9-12.8c-13.4-5.6-26-12.4-37.9-20.3
			c-11.9-7.9-22.9-16.9-33-26.8c-10.1-9.9-19.2-20.8-27.3-32.5c-0.9-1.3-2.4-2.1-4-2.1v0c-0.9,0-1.8,0.3-2.5,0.8l-21,13.9
			c-2.2,1.4-2.8,4.4-1.3,6.5c0,0,0,0,0,0c9.3,13.5,19.8,26.1,31.5,37.6c11.7,11.5,24.5,21.9,38.2,31c13.7,9.1,28.4,17,43.8,23.4
			s31.6,11.4,48.4,14.8c16.8,3.4,34.2,5.2,52,5.2s35.2-1.8,52-5.2c16.8-3.4,33-8.4,48.4-14.8c15.4-6.4,30.1-14.3,43.8-23.4
			c2.2-1.4,2.8-4.4,1.3-6.5C400.1,458,397.1,457.4,395,458.8z M396.8,395.1c2.6,0,4.6,2,4.6,4.5s-2,4.5-4.6,4.5s-4.6-2-4.6-4.5
			C392.2,397,394.2,395.1,396.8,395.1z M508.8,204.8c-0.5-2.2-2.5-3.8-4.8-3.8v0c-0.3,0-0.5,0-0.8,0.1l-24.8,5
			c-2.6,0.5-4.2,3-3.7,5.6c0,0,0,0,0,0c3,14.3,4.5,29.1,4.5,44.3s-1.6,30-4.5,44.3c-3,14.3-7.4,28.1-13,41.2
			c-3,7.1-6.5,14-10.2,20.6c-1.5-0.6-3.1-0.9-4.8-0.9c-7.7,0-14,6.3-14,14c0,7.7,6.3,14,14,14c7.7,0,14-6.3,14-14
			c0-2.5-0.7-4.9-1.9-6.9c4.3-7.5,8.1-15.2,11.6-23.1c5.9-13.7,10.5-28.1,13.6-43c3.1-14.9,4.7-30.4,4.7-46.2c0-14.2-1.5-28-4-41.5
			l15.5-3.1c2.7,14.5,4.3,29.4,4.3,44.6c0,16.9-1.7,33.4-5,49.3c-3.3,15.9-8.2,31.3-14.5,45.9c-6.3,14.6-14,28.5-22.9,41.5
			c-8,11.7-17.2,22.6-27.2,32.8l-14.4-14.2c-1.8-1.8-4.8-1.8-6.7,0c-10.1,9.9-21.2,18.9-33,26.8c-11.9,7.9-24.6,14.7-37.9,20.3
			c-8.3,3.4-16.8,6.4-25.5,8.8c-2.5-4.1-6.9-6.8-12-6.8c-7.7,0-14,6.3-14,14c0,7.7,6.3,14,14,14c7,0,12.8-5.2,13.9-11.8
			c9.4-2.6,18.5-5.7,27.3-9.4c13.9-5.8,27.1-12.9,39.5-21.1c11.1-7.4,21.3-15.8,30.9-24.8l14.7,14.5c1.8,1.8,4.8,1.8,6.7,0
			c11.7-11.5,22.2-24.1,31.5-37.6c9.3-13.5,17.3-28,23.8-43.2c6.5-15.2,11.6-31.2,15-47.7c3.4-16.5,5.2-33.7,5.2-51.2
			C514,238.5,512.2,221.3,508.8,204.8z M446.7,379.8c-2.6,0-4.6-2-4.6-4.5c0-2.6,2-4.5,4.6-4.5c2.6,0,4.6,2,4.6,4.5
			C451.2,377.8,449.2,379.8,446.7,379.8z M305.4,478.9c-2.6,0-4.6-2-4.6-4.5s2-4.5,4.6-4.5s4.6,2,4.6,4.5S308,478.9,305.4,478.9z
			 M44.2,186.6c7.6-0.1,13.9-6.4,13.9-13.9c0-7.7-6.3-14-14-14s-14,6.3-14,14c0,4.4,2.1,8.3,5.3,10.9c-2.8,8.4-5.2,17-7.1,25.9
			c-0.1,0.2-0.1,0.3-0.1,0.5c0,0.2-0.1,0.4-0.1,0.6c-3,14.7-4.6,30-4.6,45.6c0,15.8,1.6,31.3,4.7,46.2c0.5,2.6,3,4.2,5.5,3.7
			c2.6-0.5,4.3-3,3.8-5.5c0,0,0-0.1,0-0.1c-3-14.3-4.5-29.1-4.5-44.3s1.6-30,4.5-44.3C39.1,203.2,41.4,194.8,44.2,186.6z M44,168.1
			c2.6,0,4.6,2,4.6,4.5c0,2.6-2,4.5-4.6,4.5s-4.6-2-4.6-4.5C39.4,170.1,41.4,168.1,44,168.1z M201.7,241.5L244.8,352h19.9L310,241.5
			L326.6,352h49.7L343.7,160h-49.3l-38.2,102.3L217.7,160h-49.3L135.8,352h49.3L201.7,241.5z"/>
	</g>
</g>
</svg>
