<?xml version="1.0" encoding="UTF-8" standalone="no"?>
<svg
   xmlns:dc="http://purl.org/dc/elements/1.1/"
   xmlns:cc="http://creativecommons.org/ns#"
   xmlns:rdf="http://www.w3.org/1999/02/22-rdf-syntax-ns#"
   xmlns:svg="http://www.w3.org/2000/svg"
   xmlns="http://www.w3.org/2000/svg"
   xmlns:sodipodi="http://sodipodi.sourceforge.net/DTD/sodipodi-0.dtd"
   xmlns:inkscape="http://www.inkscape.org/namespaces/inkscape"
   inkscape:version="1.0 (4035a4f, 2020-05-01)"
   sodipodi:docname="logo_maschinendeck_digital_shadow.svg"
   xml:space="preserve"
   style="enable-background:new 0 0 512 512;"
   viewBox="0 0 512 512"
   y="0px"
   x="0px"
   id="Ebene_1"
   version="1.1"><metadata
   id="metadata850"><rdf:RDF><cc:Work
       rdf:about=""><dc:format>image/svg+xml</dc:format><dc:type
         rdf:resource="http://purl.org/dc/dcmitype/StillImage" /></cc:Work></rdf:RDF></metadata><defs
   id="defs848"><filter
     id="filter1228"
     inkscape:label="Drop Shadow"
     style="color-interpolation-filters:sRGB;"><feFlood
       id="feFlood1218"
       result="flood"
       flood-color="rgb(0,0,0)"
       flood-opacity="0.192157" /><feComposite
       id="feComposite1220"
       result="composite1"
       operator="in"
       in2="SourceGraphic"
       in="flood" /><feGaussianBlur
       id="feGaussianBlur1222"
       result="blur"
       stdDeviation="18.018"
       in="composite1" /><feOffset
       id="feOffset1224"
       result="offset"
       dy="-0"
       dx="0" /><feComposite
       id="feComposite1226"
       result="composite2"
       operator="over"
       in2="offset"
       in="SourceGraphic" /></filter></defs><sodipodi:namedview
   inkscape:current-layer="Ebene_1"
   inkscape:window-maximized="1"
   inkscape:window-y="25"
   inkscape:window-x="0"
   inkscape:cy="256"
   inkscape:cx="256"
   inkscape:zoom="1.1484375"
   showgrid="false"
   id="namedview846"
   inkscape:window-height="789"
   inkscape:window-width="1440"
   inkscape:pageshadow="2"
   inkscape:pageopacity="0"
   guidetolerance="10"
   gridtolerance="10"
   objecttolerance="10"
   borderopacity="1"
   bordercolor="#666666"
   pagecolor="#ffffff" />
<style
   id="style833"
   type="text/css">
	.st0{fill:#FFFFFF;}
	.st1{enable-background:new    ;}
</style>
<g
   style="filter:url(#filter1228)"
   id="g843">
	<g
   id="g837">
		<ellipse
   id="ellipse835"
   ry="203.2"
   rx="205"
   cy="253.8"
   cx="256"
   class="st0" />
	</g>
	<g
   id="g841"
   class="st1">
		<path
   id="path839"
   d="M162.5,324.7l25.3-149.2h38.4l29.9,79.5l29.7-79.5h38.4l25.3,149.2h-38.6l-12.9-85.8l-35.2,85.8h-15.5l-33.5-85.8    l-12.9,85.8H162.5z" />
	</g>
</g>
</svg>
