<?xml version="1.0" encoding="UTF-8"?>
<svg id="svg8" xmlns="http://www.w3.org/2000/svg" xmlns:svg="http://www.w3.org/2000/svg" xmlns:sodipodi="http://sodipodi.sourceforge.net/DTD/sodipodi-0.dtd" xmlns:rdf="http://www.w3.org/1999/02/22-rdf-syntax-ns#" xmlns:inkscape="http://www.inkscape.org/namespaces/inkscape" xmlns:dc="http://purl.org/dc/elements/1.1/" xmlns:cc="http://creativecommons.org/ns#" version="1.1" viewBox="0 0 297.6 209.8">
  <defs>
    <style>
      .cls-1 {
        fill: #faf7db;
      }

      .cls-1, .cls-2 {
        stroke-width: 0px;
      }

      .cls-2 {
        fill: #000;
      }

      .cls-3 {
        isolation: isolate;
      }
    </style>
  </defs>
  <sodipodi:namedview id="base" bordercolor="#666666" borderopacity="1.0" inkscape:current-layer="layer1" inkscape:cx="187.53021" inkscape:cy="169.20944" inkscape:document-units="mm" inkscape:pageopacity="0.0" inkscape:pageshadow="2" inkscape:window-height="880" inkscape:window-maximized="0" inkscape:window-width="1600" inkscape:window-x="0" inkscape:window-y="20" inkscape:zoom="1.979899" pagecolor="#ffffff" showgrid="false"/>
  <g id="layer2" inkscape:groupmode="layer" inkscape:label="bg">
    <rect id="rect5373" class="cls-1" width="297.6" height="209.8"/>
  </g>
  <g id="text4495" class="cls-3">
    <g class="cls-3">
      <path class="cls-2" d="M37.8,96v-.4h.5c.3,0,.4-.2.3-.5-.2-.5-.5-1.6-.7-1.8h-2.3c-.2.7-.5,1.4-.7,2,0,0,0,.2.2.3h.6v.4h-2.3v-.4c.6,0,.7-.2.9-.6.8-2,1.5-4.2,2.3-6.2h.9c.6,1.7,1.6,4.7,2.2,6.2s.3.6.9.6v.4h-2.8ZM36.8,89.9h0c-.3.9-.7,1.9-1,2.9h2c-.2-.7-.8-2.3-1-2.9Z"/>
      <path class="cls-2" d="M41,89h-.4v-.4l1.7-.3h0v3.2c.4-.2,1-.7,1.8-.7,1.8,0,2,1.8,2,2.6,0,2.1-1.2,2.8-2.6,2.8s-1.2-.2-1.6-.4l-.4.4h-.3v-6.7q0-.4-.3-.5h0ZM42.4,94.3v.6c.2.5.6.8,1.1.8,1,0,1.4-.8,1.4-2.3s-.9-2-1.3-2-1,.3-1.2.7v2.1h0Z"/>
      <path class="cls-2" d="M48.4,93.3c0,1.1.2,2.2,1.5,2.2s1.1-.4,1.4-1l.4.2c-.3.8-.9,1.4-2.1,1.4-1.7,0-2.4-1-2.4-2.6s.8-2.7,2.4-2.7,2.2,1.5,2.2,2.1-.2.4-.4.4h-3ZM50.3,92.8q.3,0,.3-.3c0-.4,0-1.3-1-1.3s-1.2,1.1-1.2,1.6c0,0,1.9,0,1.9,0Z"/>
      <path class="cls-2" d="M54.4,95q0,.5,1,.6v.4h-2.8v-.4c.7,0,.8,0,.8-.6v-3.1q0-.4-.3-.5h-.4v-.4l1.7-.3v.8c.8-.6,1.1-.8,1.5-.8s.6.3.6.5-.2.7-.5.7,0,0-.2,0c-.3-.2-.5-.2-.6-.2-.2,0-.6.3-.6,1.1v2.3h-.2Z"/>
      <path class="cls-2" d="M61,90.9v.4h-.4c-.2,0-.2,0-.2.3.3,1,.6,2.1.9,3.3h0l1.2-3.9h.8l1.3,3.9h0c.3-1.1.8-2.7.9-3.3,0-.2,0-.3,0-.3h-.6v-.4h2.1v.4c-.5,0-.6,0-.8.6-.3.9-.9,2.6-1.3,4.1h-.8l-1.2-3.8h0l-1.2,3.8h-.8c-.4-1.5-.9-2.9-1.3-4.3,0-.4-.3-.4-.7-.4v-.4h2.4-.2Z"/>
      <path class="cls-2" d="M71.3,94.6c0,.7.2.8.4.9h.4v.4c-.2.2-.7.3-1.1.3s-.5-.2-.7-.6c-.3.2-.9.6-1.5.6-1,0-1.5-.7-1.5-1.5s.2-1.1,1-1.3c.8-.3,1.8-.5,2.1-.8v-.3c0-.8-.4-1-.9-1s-.7.2-1,.9c0,.2-.2.3-.4.3s-.6-.2-.6-.5c0-.6.8-1.2,2.1-1.2s1.8.8,1.8,1.4v2.4h-.1ZM70.3,93.1c-.2,0-.8.3-1.2.5-.6.2-.8.5-.8.9s.3,1,.9,1,1-.2,1-1v-1.4h0Z"/>
      <path class="cls-2" d="M74.5,95q0,.5,1,.6v.4h-2.8v-.4c.7,0,.8,0,.8-.6v-3.1q0-.4-.3-.5h-.4v-.4l1.7-.3v.8c.8-.6,1.1-.8,1.5-.8s.6.3.6.5-.2.7-.5.7,0,0-.2,0c-.3-.2-.5-.2-.6-.2-.2,0-.6.3-.6,1.1v2.3h-.2Z"/>
      <path class="cls-2" d="M78,93.3c0,1.1.2,2.2,1.5,2.2s1.1-.4,1.4-1l.4.2c-.3.8-.9,1.4-2.1,1.4-1.7,0-2.4-1-2.4-2.6s.8-2.7,2.4-2.7,2.2,1.5,2.2,2.1-.2.4-.4.4h-3ZM79.9,92.8q.3,0,.3-.3c0-.4,0-1.3-1-1.3s-1.2,1.1-1.2,1.6c0,0,1.9,0,1.9,0Z"/>
      <path class="cls-2" d="M87.3,95q0,.5.8.6v.4h-2.6v-.4c.7,0,.8,0,.8-.6v-2.3c0-.9-.4-1.3-1.1-1.3s-1,.3-1.2.8v2.9q0,.5.8.6v.4h-2.6v-.4q.8,0,.8-.6v-3.1q0-.4-.3-.4h-.4v-.4l1.6-.3v.8c.8-.4,1.3-.8,2-.8s1.5.6,1.5,1.6v2.6h-.1Z"/>
      <path class="cls-2" d="M95.2,90.7c-.2-1.1-.6-1.5-1.5-1.5s-1.3.5-1.3,1.3.9,1.2,1.5,1.4c1.2.5,2.2.9,2.2,2.2s-.7,2.1-2.6,2.1-1.6-.2-2.1-.7v-1.7c0,0,.3,0,.3,0,.3,1.2.9,1.9,1.9,1.9s1.4-.5,1.4-1.3-.9-1.3-1.6-1.5c-1.1-.4-2-.8-2-2.1s1.1-2.1,2.4-2.1,1.4.2,1.9.5v1.6h-.5Z"/>
      <path class="cls-2" d="M97.4,91.9q0-.4-.3-.5h-.4v-.4l1.7-.3h0v4.2q0,.5.8.6v.4h-2.6v-.4q.8,0,.8-.6v-3.1h0ZM98.6,89.3c0,.4-.3.7-.7.7s-.7-.3-.7-.7.3-.7.7-.7.7.3.7.7Z"/>
      <path class="cls-2" d="M101.1,93.3c0,1.1.2,2.2,1.5,2.2s1.1-.4,1.4-1l.4.2c-.3.8-.9,1.4-2.1,1.4-1.7,0-2.4-1-2.4-2.6s.8-2.7,2.4-2.7,2.2,1.5,2.2,2.1-.2.4-.4.4h-3ZM103,92.8q.3,0,.3-.3c0-.4,0-1.3-1-1.3s-1.2,1.1-1.2,1.6c0,0,1.9,0,1.9,0Z"/>
      <path class="cls-2" d="M110.7,92.4c0-.6-.4-1.1-1.1-1.1s-.9.3-.9.8.7.8,1.1.9c1.1.4,1.6.7,1.6,1.6s-.7,1.6-1.9,1.6-1.3,0-1.7-.5v-1.3h.3c.2.9.6,1.4,1.5,1.4s.9-.3.9-.8-.5-.8-1.2-1c-.9-.3-1.5-.6-1.5-1.6s.8-1.5,1.9-1.5,1,0,1.4.3v1.3h-.4Z"/>
      <path class="cls-2" d="M116.9,94.6c-.3,1.1-1.3,1.5-2,1.5-1.5,0-2.4-.9-2.4-2.6s.7-2.7,2.6-2.7,1.8.5,1.8,1-.4.5-.7.5-.3,0-.3-.3c-.2-.6-.6-.8-1-.8-.7,0-1.3.6-1.3,2.1s.3,2.2,1.5,2.2,1.1-.4,1.4-1.1c0,0,.4.2.4.2Z"/>
      <path class="cls-2" d="M118.1,89.5q0-.4-.3-.4h-.4v-.4l1.7-.3h0v3.2c.7-.4,1.1-.8,1.9-.8s1.6.6,1.6,1.7v2.6q0,.5.8.6v.4h-2.6v-.4c.7,0,.8,0,.8-.6v-2.4c0-.9-.4-1.2-1.1-1.2s-1,.4-1.2.8v2.9q0,.5.8.6v.4h-2.6v-.4c.7,0,.8,0,.8-.6v-5.6h-.2Z"/>
      <path class="cls-2" d="M129.2,93.5c0,1.7-.8,2.7-2.5,2.7s-2.5-1-2.5-2.7.8-2.7,2.5-2.7,2.5,1,2.5,2.7ZM126.6,95.7c.9,0,1.4-.8,1.4-2.2s-.4-2.2-1.4-2.2-1.4.8-1.4,2.2.4,2.2,1.4,2.2Z"/>
      <path class="cls-2" d="M135.2,95q0,.5.8.6v.4h-2.6v-.4c.7,0,.8,0,.8-.6v-2.3c0-.9-.4-1.3-1.1-1.3s-1,.3-1.2.8v2.9q0,.5.8.6v.4h-2.6v-.4q.8,0,.8-.6v-3.1q0-.4-.3-.4h-.4v-.4l1.6-.3v.8c.8-.4,1.3-.8,2-.8s1.5.6,1.5,1.6v2.6h-.1Z"/>
      <path class="cls-2" d="M139.7,91.9q0-.4-.3-.4h-.4v-.4l1.7-.3v.8c.4-.2,1.1-.8,1.9-.8s1.1.3,1.4.8c.3-.2.9-.8,1.8-.8s1.6.6,1.6,1.7v2.6q0,.5.8.6v.4h-2.6v-.4c.7,0,.8,0,.8-.6v-2.3c0-.9-.4-1.3-1-1.3s-1.1.4-1.2.8v2.8q0,.5.8.6v.4h-2.6v-.4c.7,0,.8,0,.8-.6v-2.3c0-.6,0-1.3-.9-1.3s-1,.4-1.2.8v2.8q0,.5.8.6v.4h-2.6v-.4c.7,0,.8,0,.8-.6v-3.1h-.4Z"/>
      <path class="cls-2" d="M152.8,94.6c0,.7.2.8.4.9h.4v.4c-.2.2-.7.3-1.1.3s-.5-.2-.7-.6c-.3.2-.9.6-1.5.6-1,0-1.5-.7-1.5-1.5s.2-1.1,1-1.3c.8-.3,1.8-.5,2.1-.8v-.3c0-.8-.4-1-.9-1s-.7.2-1,.9c0,.2-.2.3-.4.3s-.6-.2-.6-.5c0-.6.8-1.2,2.1-1.2s1.8.8,1.8,1.4v2.4h-.1ZM151.8,93.1c-.2,0-.8.3-1.2.5-.6.2-.8.5-.8.9s.3,1,.9,1,1-.2,1-1v-1.4h.1Z"/>
      <path class="cls-2" d="M154.8,89.4q0-.4-.3-.5h-.4v-.4l1.7-.3h0v6.7q0,.5.8.6v.4h-2.6v-.4q.8,0,.8-.6v-5.6h0Z"/>
      <path class="cls-2" d="M160.3,91.9q0-.4-.3-.5h-.4v-.4l1.7-.3h0v4.2q0,.5.8.6v.4h-2.6v-.4q.8,0,.8-.6v-3.1h0ZM161.5,89.3c0,.4-.3.7-.7.7s-.7-.3-.7-.7.3-.7.7-.7.7.3.7.7Z"/>
      <path class="cls-2" d="M163.4,91.9q0-.4-.3-.4h-.4v-.4l1.7-.3v.8c.4-.2,1.1-.8,1.9-.8s1.1.3,1.4.8c.3-.2.9-.8,1.8-.8s1.6.6,1.6,1.7v2.6q0,.5.8.6v.4h-2.6v-.4c.7,0,.8,0,.8-.6v-2.3c0-.9-.4-1.3-1-1.3s-1.1.4-1.2.8v2.8q0,.5.8.6v.4h-2.6v-.4c.7,0,.8,0,.8-.6v-2.3c0-.6,0-1.3-.9-1.3s-1,.4-1.2.8v2.8q0,.5.8.6v.4h-2.6v-.4c.7,0,.8,0,.8-.6v-3.1h-.4Z"/>
      <path class="cls-2" d="M174.7,96v-.4c.5,0,.8,0,.9-.5v-5.3q0-.6-.9-.6v-.4h2.3c.7,1.7,1.6,3.6,2.3,5.4h0c.7-1.7,1.8-4.2,2.4-5.4h2.2v.4q-.9,0-.9.7v5.1q0,.6.9.7v.4h-3v-.4q.9,0,.9-.7v-5.1h0c-.7,1.6-2.3,5.2-2.6,6.1h-.4c-.5-1.3-2-4.8-2.6-6.1h0v5.3c0,.5.4.4,1,.5v.4h-2.6.1Z"/>
      <path class="cls-2" d="M188.7,94.6c0,.7.2.8.4.9h.4v.4c-.2.2-.7.3-1.1.3s-.5-.2-.7-.6c-.3.2-.9.6-1.5.6-1,0-1.5-.7-1.5-1.5s.2-1.1,1-1.3c.8-.3,1.8-.5,2.1-.8v-.3c0-.8-.4-1-.9-1s-.7.2-1,.9c0,.2-.2.3-.4.3s-.6-.2-.6-.5c0-.6.8-1.2,2.1-1.2s1.8.8,1.8,1.4v2.4h-.1ZM187.7,93.1c-.2,0-.8.3-1.2.5-.6.2-.8.5-.8.9s.3,1,.9,1,1-.2,1-1v-1.4h.1Z"/>
      <path class="cls-2" d="M193.2,92.4c0-.6-.4-1.1-1.1-1.1s-.9.3-.9.8.7.8,1.1.9c1.1.4,1.6.7,1.6,1.6s-.7,1.6-1.9,1.6-1.3,0-1.7-.5v-1.3h.3c.2.9.6,1.4,1.5,1.4s.9-.3.9-.8-.5-.8-1.2-1c-.9-.3-1.5-.6-1.5-1.6s.8-1.5,1.9-1.5,1,0,1.4.3v1.3h-.4Z"/>
      <path class="cls-2" d="M199.3,94.6c-.3,1.1-1.3,1.5-2,1.5-1.5,0-2.4-.9-2.4-2.6s.7-2.7,2.6-2.7,1.8.5,1.8,1-.4.5-.7.5-.3,0-.3-.3c-.2-.6-.6-.8-1-.8-.7,0-1.3.6-1.3,2.1s.3,2.2,1.5,2.2,1.1-.4,1.4-1.1c0,0,.4.2.4.2Z"/>
      <path class="cls-2" d="M200.6,89.5q0-.4-.3-.4h-.4v-.4l1.7-.3h0v3.2c.7-.4,1.1-.8,1.9-.8s1.6.6,1.6,1.7v2.6q0,.5.8.6v.4h-2.6v-.4c.7,0,.8,0,.8-.6v-2.4c0-.9-.4-1.2-1.1-1.2s-1,.4-1.2.8v2.9q0,.5.8.6v.4h-2.6v-.4c.7,0,.8,0,.8-.6v-5.6h-.2Z"/>
      <path class="cls-2" d="M207.1,91.9q0-.4-.3-.5h-.4v-.4l1.7-.3h0v4.2q0,.5.8.6v.4h-2.6v-.4q.8,0,.8-.6v-3.1h0ZM208.3,89.3c0,.4-.3.7-.7.7s-.7-.3-.7-.7.3-.7.7-.7.7.3.7.7Z"/>
      <path class="cls-2" d="M214.7,95q0,.5.8.6v.4h-2.6v-.4c.7,0,.8,0,.8-.6v-2.3c0-.9-.4-1.3-1.1-1.3s-1,.3-1.2.8v2.9q0,.5.8.6v.4h-2.6v-.4q.8,0,.8-.6v-3.1q0-.4-.3-.4h-.4v-.4l1.6-.3v.8c.8-.4,1.3-.8,2-.8s1.5.6,1.5,1.6v2.6h-.1Z"/>
      <path class="cls-2" d="M217.4,93.3c0,1.1.2,2.2,1.5,2.2s1.1-.4,1.4-1l.4.2c-.3.8-.9,1.4-2.1,1.4-1.7,0-2.4-1-2.4-2.6s.8-2.7,2.4-2.7,2.2,1.5,2.2,2.1-.2.4-.4.4h-3,0ZM219.3,92.8q.3,0,.3-.3c0-.4-.1-1.3-1-1.3s-1.2,1.1-1.2,1.6c0,0,1.9,0,1.9,0Z"/>
      <path class="cls-2" d="M226.8,95q0,.5.8.6v.4h-2.6v-.4c.7,0,.8,0,.8-.6v-2.3c0-.9-.4-1.3-1.1-1.3s-1,.3-1.2.8v2.9q0,.5.8.6v.4h-2.6v-.4q.8,0,.8-.6v-3.1q0-.4-.3-.4h-.4v-.4l1.6-.3v.8c.8-.4,1.3-.8,2-.8s1.5.6,1.5,1.6v2.6h-.1Z"/>
      <path class="cls-2" d="M231.8,89h-.4v-.4l1.7-.3h0v6.7q0,.5.8.6v.4h-1.9v-.5c-.6.4-1.1.7-1.6.7-1.4,0-2.1-1.1-2.1-2.6s.3-1.6.7-2.1c.4-.4,1.1-.7,1.9-.7s.8,0,1.1.2v-1.6q0-.4-.3-.5h.1ZM232.1,92.5v-.6c-.2-.4-.6-.6-1.1-.6-1,0-1.5.9-1.5,2.2s.5,2.1,1.4,2.1.9-.2,1.1-.7v-2.3h.1Z"/>
      <path class="cls-2" d="M235.9,93.3c0,1.1.2,2.2,1.5,2.2s1.1-.4,1.4-1l.4.2c-.3.8-.9,1.4-2.1,1.4-1.7,0-2.4-1-2.4-2.6s.8-2.7,2.4-2.7,2.2,1.5,2.2,2.1-.2.4-.4.4h-3,0ZM237.8,92.8q.3,0,.3-.3c0-.4-.1-1.3-1-1.3s-1.2,1.1-1.2,1.6c0,0,1.9,0,1.9,0Z"/>
      <path class="cls-2" d="M244.7,94.6c-.3,1.1-1.3,1.5-2,1.5-1.5,0-2.4-.9-2.4-2.6s.7-2.7,2.6-2.7,1.8.5,1.8,1-.4.5-.7.5-.3,0-.3-.3c-.2-.6-.6-.8-1-.8-.7,0-1.3.6-1.3,2.1s.3,2.2,1.5,2.2,1.1-.4,1.4-1.1c0,0,.4.2.4.2Z"/>
      <path class="cls-2" d="M245.9,89.5q0-.4-.3-.5h-.4v-.4l1.7-.3h0v6.7q0,.5.8.6v.4h-2.6v-.4q.8,0,.8-.6v-5.6h0ZM248.5,91.3c.2-.3.3-.4.7-.4h1.1v.3c-.7,0-.9.2-1.3.4-.3.2-.6.5-1.1,1.1v.3c.4.6,1.1,1.5,1.8,2.2s.6.4.9.5v.4h-.8c-.4,0-.8-.2-1.2-.6-.5-.6-1.2-1.5-1.7-2.1h0c.2-.4,1.2-1.7,1.5-2.1h.1Z"/>
      <path class="cls-2" d="M254.7,90.2c0,.7-.3,1.1-1.1,1.7-.4.3-.6.6-.6.9s.3.5.5.5h.2v.3c-.2.2-.5.3-.7.3-.7,0-1-.4-1-1s.3-.9.9-1.5c.5-.5.8-.9.8-1.4s-.3-.8-.8-.8-.8.5-.8,1-.3.4-.4.4c-.3,0-.6,0-.6-.6s.5-1.4,2-1.4,1.8.7,1.8,1.6h-.2ZM252.1,95.4c0-.4.3-.7.7-.7s.7.3.7.7-.3.7-.7.7-.7-.3-.7-.7Z"/>
    </g>
  </g>
  <g id="text5381" class="cls-3">
    <g class="cls-3">
      <path class="cls-2" d="M96.3,184.1v.3q-.5,0-.7.5c-.4,1.3-.9,3.1-1.3,4.4h-.7c-.4-1.3-.8-2.6-1.2-4h0c-.3,1-.8,2.9-1.1,4h-.7c-.4-1.5-.8-2.9-1.2-4.4,0-.4-.2-.5-.6-.5v-.3h2v.3h-.4q-.2,0,0,.3c.3,1.2.6,2.3,1,3.6h0c.4-1.4.8-2.9,1.1-4.1h.6c.4,1.4.8,2.8,1.2,4.1h0c.3-1.1.7-2.6.9-3.7,0-.1,0-.2,0-.2h-.5v-.3h1.8Z"/>
      <path class="cls-2" d="M96.8,186.3q0-.3-.2-.3h-.3v-.3l1.2-.2h0v3.1q0,.4.6.4v.3h-1.9v-.3q.6,0,.6-.4v-2.2h0ZM97.7,184.4c0,.3-.2.5-.5.5s-.5-.2-.5-.5.2-.5.5-.5.5.2.5.5Z"/>
      <path class="cls-2" d="M99.9,188.6q0,.4.7.4v.3h-2.1v-.3c.5,0,.6,0,.6-.4v-2.2q0-.3-.2-.3h-.3v-.3l1.2-.2v.6c.6-.4.8-.6,1.1-.6s.4.2.4.4-.2.5-.4.5,0,0-.2,0c-.2-.1-.4-.2-.4-.2-.2,0-.4.2-.4.8v1.7-.2Z"/>
      <path class="cls-2" d="M103.8,184.5q0-.3-.2-.3h-.3v-.3l1.2-.2h0v4.9q0,.4.6.4v.3h-1.9v-.3c.5,0,.6,0,.6-.4v-4h0ZM105.7,185.9c.2-.2.2-.3.5-.3h.8v.2c-.5,0-.7.1-.9.3-.2.2-.4.4-.8.8v.2c.3.4.8,1.1,1.3,1.6s.4.3.6.4v.3h-.6c-.3,0-.6-.1-.9-.4-.4-.4-.9-1.1-1.2-1.6h0c0-.3.9-1.2,1.1-1.5h0Z"/>
      <path class="cls-2" d="M111.1,187.4c0,1.2-.6,1.9-1.8,1.9s-1.8-.7-1.8-1.9.6-1.9,1.8-1.9,1.8.7,1.8,1.9ZM109,184.4c0,.3-.2.5-.5.5s-.5-.2-.5-.5.2-.5.5-.5.5.2.5.5ZM109.3,189.1c.7,0,1-.6,1-1.6s-.3-1.6-1-1.6-1,.6-1,1.6.3,1.6,1,1.6ZM110.6,184.4c0,.3-.2.5-.5.5s-.5-.2-.5-.5.2-.5.5-.5.5.2.5.5Z"/>
      <path class="cls-2" d="M115.5,188.6q0,.4.6.4v.3h-1.9v-.3c.5,0,.6,0,.6-.4v-1.7c0-.6-.3-.9-.8-.9s-.7.2-.9.6v2.1q0,.4.6.4v.3h-1.9v-.3c.5,0,.6,0,.6-.4v-2.3q0-.3-.2-.3h-.3v-.3l1.2-.2v.6c.6-.3.9-.6,1.5-.6s1.1.4,1.1,1.2v1.9h-.2Z"/>
      <path class="cls-2" d="M120.3,188.6q0,.4.6.4v.3h-1.9v-.3c.5,0,.6,0,.6-.4v-1.7c0-.6-.3-.9-.8-.9s-.7.2-.9.6v2.1q0,.4.6.4v.3h-1.9v-.3c.5,0,.6,0,.6-.4v-2.3q0-.3-.2-.3h-.3v-.3l1.2-.2v.6c.6-.3.9-.6,1.5-.6s1.1.4,1.1,1.2v1.9h-.2Z"/>
      <path class="cls-2" d="M122.2,187.3c0,.8.2,1.6,1.1,1.6s.8-.3,1-.8l.3.2c-.2.6-.7,1-1.5,1-1.3,0-1.8-.7-1.8-1.9s.6-2,1.8-2,1.6,1.1,1.6,1.5-.2.3-.3.3h-2.2ZM123.6,187q.2,0,.2-.2c0-.3,0-1-.8-1s-.9.8-.9,1.2h1.5Z"/>
      <path class="cls-2" d="M129,188.6q0,.4.6.4v.3h-1.9v-.3c.5,0,.6,0,.6-.4v-1.7c0-.6-.3-.9-.8-.9s-.7.2-.9.6v2.1q0,.4.6.4v.3h-1.9v-.3c.5,0,.6,0,.6-.4v-2.3q0-.3-.2-.3h-.3v-.3l1.2-.2v.6c.6-.3.9-.6,1.5-.6s1.1.4,1.1,1.2v1.9h-.2Z"/>
      <path class="cls-2" d="M134.8,188.3c0,.5.1.6.3.6h.3v.3c-.2.1-.5.2-.8.2s-.4-.1-.5-.4c-.2.2-.6.4-1.1.4s-1.1-.5-1.1-1.1.2-.8.7-1c.6-.2,1.3-.4,1.5-.6v-.2c0-.6-.3-.7-.6-.7s-.5.1-.7.7c0,.1-.1.2-.3.2s-.4-.1-.4-.4.6-.9,1.5-.9,1.3.6,1.3,1v1.9ZM134,187.2c-.2,0-.5.2-.8.4-.4.2-.6.3-.6.7s.2.7.7.7.7-.2.7-.7v-1h0Z"/>
      <path class="cls-2" d="M136.2,184.5q0-.3-.2-.3h-.3v-.3l1.2-.2h0v4.9q0,.4.6.4v.3h-1.9v-.3c.5,0,.6,0,.6-.4v-4h0Z"/>
      <path class="cls-2" d="M138.5,184.5q0-.3-.2-.3h-.3v-.3l1.2-.2h0v4.9q0,.4.6.4v.3h-1.9v-.3c.5,0,.6,0,.6-.4v-4h0Z"/>
      <path class="cls-2" d="M141.2,187.3c0,.8.2,1.6,1.1,1.6s.8-.3,1-.8l.3.2c-.2.6-.7,1-1.5,1-1.3,0-1.8-.7-1.8-1.9s.6-2,1.8-2,1.6,1.1,1.6,1.5-.2.3-.3.3h-2.2ZM142.6,187q.2,0,.2-.2c0-.3,0-1-.8-1s-.9.8-.9,1.2h1.5Z"/>
      <path class="cls-2" d="M146.5,186.7c0-.4-.3-.8-.8-.8s-.7.2-.7.6.5.6.8.7c.8.3,1.2.5,1.2,1.2s-.5,1.1-1.4,1.1-.9,0-1.2-.4v-1h.2c.2.6.5,1,1.1,1s.7-.2.7-.6-.4-.6-.8-.7c-.7-.2-1.1-.5-1.1-1.2s.6-1.1,1.4-1.1.7,0,1,.2v.9h-.4Z"/>
      <path class="cls-2" d="M147.7,188.8c0-.3.2-.6.5-.6s.5.3.5.6-.2.5-.5.5-.5-.2-.5-.5Z"/>
      <path class="cls-2" d="M154.1,189.3v-.3h.4c.2,0,.3-.1.2-.3-.1-.4-.4-1.1-.5-1.3h-1.7c-.2.5-.3,1-.5,1.4,0,.1,0,.2.2.2h.4v.3h-1.7v-.3c.5,0,.5-.1.6-.4.6-1.4,1.1-3,1.6-4.5h.6c.4,1.3,1.2,3.4,1.6,4.5.1.4.2.4.6.4v.3h-2,.2ZM153.4,184.9h0c-.2.6-.5,1.4-.7,2.1h1.4c-.2-.5-.5-1.7-.7-2.1Z"/>
      <path class="cls-2" d="M159.2,189.3v-.4c-.3,0-.8.5-1.5.5s-1.1-.3-1.1-1.1v-2q0-.3-.2-.3h-.3v-.3h1.2c0-.1,0,0,0,0v2.5c0,.6.3.9.8.9s.7-.2.9-.6v-2q0-.3-.2-.3h-.3v-.3h1.2c0-.1,0,0,0,0v3q0,.4.6.4v.3h-1.3l.2-.3Z"/>
      <path class="cls-2" d="M162.2,188.1v1.1h-1.4v-.3c.5,0,.6,0,.6-.4v-2.6h-.6v-.4h.6c0-.5.1-1,.4-1.3.3-.3.7-.5,1.3-.5,1.3,0,1.4.8,1.4,1.1v.4c-.6.2-.9.4-.9.8s.1.5.6.8c.6.5.8.7.8,1.2,0,.9-.7,1.4-1.4,1.4s-1-.2-1-.5.2-.4.3-.4h.2c.2.3.5.4.7.4.4,0,.6-.2.6-.7s-.3-.6-.6-1c-.4-.4-.7-.6-.7-1.1s.4-1,.9-1.2v-.3c0-.6-.4-.8-.8-.8-.9,0-1,1.2-1,1.9v2.4Z"/>
      <path class="cls-2" d="M166.5,187.3c0,.8.2,1.6,1.1,1.6s.8-.3,1-.8l.3.2c-.2.6-.7,1-1.5,1-1.3,0-1.8-.7-1.8-1.9s.6-2,1.8-2,1.6,1.1,1.6,1.5-.2.3-.3.3h-2.2ZM167.9,187q.2,0,.2-.2c0-.3,0-1-.8-1s-.9.8-.9,1.2h1.5Z"/>
      <path class="cls-2" d="M170.9,188.6q0,.4.7.4v.3h-2.1v-.3c.5,0,.6,0,.6-.4v-2.2q0-.3-.2-.3h-.3v-.3l1.2-.2v.6c.6-.4.8-.6,1.1-.6s.4.2.4.4-.2.5-.4.5h-.2c-.2-.1-.4-.2-.4-.2-.2,0-.4.2-.4.8v1.7-.2Z"/>
      <path class="cls-2" d="M179,189.1c-.5.2-1.3.3-1.8.3s-1.3,0-1.9-.5c-.6-.4-.9-1.2-.9-2.1,0-1.8,1-2.8,2.9-2.8s1.3.2,1.7.3v1.3h-.3c-.2-.9-.6-1.3-1.5-1.3-1.5,0-1.8,1.2-1.8,2.4s.3,2.4,2,2.4.4,0,.6-.1c.2,0,.2-.1.2-.4v-1q0-.4-.8-.5v-.3h2.1v.3q-.5,0-.5.5v1.5h0Z"/>
      <path class="cls-2" d="M182.9,189.3v-.4c-.3,0-.8.5-1.5.5s-1.1-.3-1.1-1.1v-2q0-.3-.2-.3h-.3v-.3h1.2c0-.1,0,0,0,0v2.5c0,.6.3.9.8.9s.7-.2.9-.6v-2q0-.3-.2-.3h-.3v-.3h1.2c0-.1,0,0,0,0v3q0,.4.6.4v.3h-1.3l.2-.3Z"/>
      <path class="cls-2" d="M185.1,184.5q0-.3-.2-.3h-.3v-.3l1.2-.2h0v4.9q0,.4.6.4v.3h-1.9v-.3c.5,0,.6,0,.6-.4v-4h0Z"/>
      <path class="cls-2" d="M189.9,188.3c0,.5.1.6.3.6h.3v.3c-.2.1-.5.2-.8.2s-.4-.1-.5-.4c-.2.2-.6.4-1.1.4s-1.1-.5-1.1-1.1.2-.8.7-1c.6-.2,1.3-.4,1.5-.6v-.2c0-.6-.3-.7-.6-.7s-.5.1-.7.7c0,.1-.1.2-.3.2s-.4-.1-.4-.4.6-.9,1.5-.9,1.3.6,1.3,1v1.9ZM189.2,187.2c-.2,0-.5.2-.8.4-.4.2-.6.3-.6.7s.2.7.7.7.7-.2.7-.7v-1h0Z"/>
      <path class="cls-2" d="M193.2,186.7c0-.4-.3-.8-.8-.8s-.7.2-.7.6.5.6.8.7c.8.3,1.2.5,1.2,1.2s-.5,1.1-1.4,1.1-.9,0-1.2-.4v-1h.2c.2.6.5,1,1.1,1s.7-.2.7-.6-.4-.6-.8-.7c-.7-.2-1.1-.5-1.1-1.2s.6-1.1,1.4-1.1.7,0,1,.2v.9h-.4Z"/>
      <path class="cls-2" d="M197.6,188.3c-.2.8-.9,1.1-1.5,1.1-1.1,0-1.8-.6-1.8-1.9s.5-2,1.9-2,1.3.4,1.3.7-.3.4-.5.4-.2,0-.2-.2c-.2-.4-.4-.6-.7-.6-.5,0-.9.4-.9,1.5s.2,1.6,1.1,1.6.8-.3,1-.8h.3v.2Z"/>
      <path class="cls-2" d="M198.5,184.5q0-.3-.2-.3h-.3v-.3l1.2-.2h0v2.3c.5-.3.8-.6,1.4-.6s1.1.4,1.1,1.2v1.9q0,.4.6.4v.3h-1.9v-.3c.5,0,.6,0,.6-.4v-1.7c0-.6-.3-.9-.8-.9s-.7.3-.9.6v2.1q0,.4.5.4v.3h-1.9v-.3c.5,0,.6,0,.6-.4v-4h0Z"/>
      <path class="cls-2" d="M203,188.8c0-.3.2-.6.5-.6s.5.3.5.6-.2.5-.5.5-.5-.2-.5-.5Z"/>
    </g>
  </g>
  <g>
    <path class="cls-2" d="M81.3,73c-6.4-9.1-12.6-18.2-19.1-27.3h0v17.8c0,2.5,0,4.3.3,5.8.3,2,1.7,2.1,4.6,2.3v1.5h-11.3v-1.5c2.4-.2,3.7-.4,4-2.3.2-1.5.3-3.2.3-5.8v-17.6c0-2.6,0-2.7-4.1-2.9v-1.5h9c5.1,7.3,11.6,16.7,17.6,25h0v-15.4c0-2.5,0-4.3-.3-5.8-.3-2-1.7-2.1-4.7-2.3v-1.5h11.3v1.5c-2.4.2-3.6.3-3.9,2.3-.2,1.5-.3,3.2-.3,5.8v22h-3.4Z"/>
    <path class="cls-2" d="M96.1,61.2c0,4.7,1.1,10,6.7,10s5.2-2.1,6.5-4.7l1.5.7c-1.3,3.6-3.9,6.4-9,6.4-7.6,0-10.6-4.4-10.6-11.6s3.4-11.9,10.5-11.9,9.3,6.5,9.3,9.2-.9,1.8-1.9,1.8h-13ZM104.5,59.3c1.3,0,1.5-.6,1.5-1.5,0-1.8-.5-6.1-4.6-6.1s-5.3,5.6-5.3,7.5h8.4Z"/>
    <path class="cls-2" d="M121.4,52.8v13.7c0,3.4,1.5,4.5,3,4.5s1.8,0,2.9-.6l.4,1.3c-1.5,1-3.3,1.9-5.6,1.9s-5.1-.6-5.1-5.2v-15.6h-3.2v-2h3.4l2.9-5.7h1.4v5.7h5.8v2h-5.9Z"/>
    <path class="cls-2" d="M136.3,52.8v13.7c0,3.4,1.5,4.5,3,4.5s1.8,0,2.9-.6l.4,1.3c-1.5,1-3.3,1.9-5.6,1.9s-5.1-.6-5.1-5.2v-15.6h-3.2v-2h3.4l2.9-5.7h1.4v5.7h5.8v2h-5.9Z"/>
    <path class="cls-2" d="M156.8,43.7c0-1.6-.2-1.9-1.4-2.1l-1.7-.2v-1.3l7.3-1.1.3.2v14.4c2.9-1.9,4.9-3.4,8.2-3.4s6.7,2.7,6.7,7.3v11.5c0,2.2.3,2.4,3.4,2.6v1.5h-11.2v-1.5c3.1-.2,3.4-.4,3.4-2.6v-10.7c0-3.8-1.7-5.5-4.7-5.5s-4.4,1.5-5.4,3.3c-.3.6-.4,1.3-.4,2.4v10.5c0,2.2.3,2.4,3.3,2.6v1.5h-11.1v-1.5c3.2-.2,3.3-.4,3.3-2.6v-25.2h0Z"/>
    <path class="cls-2" d="M185.1,55c0-1.6-.3-1.9-1.4-2.1l-1.7-.2v-1.3l7.3-1.2.3.3v18.4c0,2.3.1,2.4,3.4,2.6v1.5h-11.2v-1.5c3.2-.2,3.4-.3,3.4-2.6v-13.9h-.1ZM190.1,43.7c0,1.6-1.1,2.8-2.8,2.8s-2.9-1.2-2.9-2.8,1.2-3,2.9-3,2.8,1.3,2.8,3Z"/>
    <path class="cls-2" d="M200.9,61.2c0,4.7,1.1,10,6.7,10s5.2-2.1,6.5-4.7l1.5.7c-1.3,3.6-3.9,6.4-9,6.4-7.6,0-10.6-4.4-10.6-11.6s3.4-11.9,10.5-11.9,9.3,6.5,9.3,9.2-.9,1.8-1.9,1.8h-13ZM209.3,59.3c1.3,0,1.5-.6,1.5-1.5,0-1.8-.5-6.1-4.6-6.1s-5.3,5.6-5.3,7.5h8.4Z"/>
    <path class="cls-2" d="M226.6,68.9c0,2.3.2,2.4,4.3,2.6v1.5h-12.1v-1.5c3.1-.2,3.4-.3,3.4-2.6v-13.9c0-1.6-.3-1.9-1.4-2.1l-1.7-.2v-1.3l7.1-1.2.5,3.7c3-2.7,4.3-3.8,6-3.8s2.4,1.2,2.4,2.3-1,2.8-2.1,2.8-.6,0-1-.2c-1.1-.9-1.9-1.2-2.6-1.2-1.1,0-2.7,1.3-2.7,4.6v10.5h0Z"/>
    <path class="cls-2" d="M234.4,70.6c0-1.7,1.2-3.2,2.9-3.2s3,1.5,3,3.2-1.1,3-3,3-2.9-1.4-2.9-3Z"/>
  </g>
  <g>
    <path class="cls-2" d="M148.8,125c.9,0,1.7,0,2.5.3.8.2,1.6.4,2.4.7.4.2.9.4,1.3.6,0,0,0,.1,0,.2,0,.4.4.8.8.8s.8-.4.8-.8-.4-.8-.8-.8-.3,0-.5.2c-.4-.2-.9-.5-1.3-.7-.8-.3-1.6-.6-2.5-.7-.8-.2-1.6-.2-2.4-.2v-.9c.9,0,1.7.1,2.6.3.9.2,1.8.5,2.6.8.8.3,1.6.8,2.4,1.3s1.4,1.1,2.1,1.7c.6.6,1.2,1.3,1.7,2s.9,1.5,1.3,2.3c0,.1.2.2.3.1.1,0,.2-.2.1-.3,0,0,0,0,0,0-.4-.9-.8-1.7-1.3-2.4-.5-.8-1.1-1.5-1.8-2.1s-1.4-1.2-2.1-1.7-1.6-1-2.5-1.3c-.9-.4-1.8-.6-2.7-.8-.9-.2-1.9-.3-2.9-.3s-.3.1-.3.3v1.4c0,.1.1.3.3.3ZM155.7,126.5c.1,0,.3.1.3.3s-.1.3-.3.3-.3-.1-.3-.3.1-.3.3-.3ZM160.5,137.3c0-.8,0-1.6-.2-2.3,0-.1-.1-.2-.3-.2h0c-.1,0-.3.1-.3.3,0,0,0,0,0,0,.1.7.2,1.5.2,2.2s0,1.5-.2,2.2c0,.5-.2.9-.4,1.4,0,0,0,0,0,0-.4,0-.8.4-.8.8s.4.8.8.8.8-.4.8-.8,0-.4-.2-.5c.2-.5.3-1,.4-1.5.2-.7.2-1.5.2-2.3ZM159.2,141.9c-.1,0-.3-.1-.3-.3s.1-.3.3-.3.3.1.3.3-.1.3-.3.3ZM145.6,126.4c0,.4.4.8.8.8s.8-.3.8-.7c.5,0,1.1-.1,1.7-.1s1.5,0,2.2.2c.7.1,1.4.4,2.1.6.7.3,1.3.6,1.9,1s1.1.8,1.6,1.3c.5.5,1,1,1.4,1.6.4.6.7,1.2,1,1.9,0,.1.2.2.3.1l1.3-.5c.1,0,.2-.2.1-.3h0c-.3-.8-.7-1.5-1.2-2.2-.3-.4-.6-.9-1-1.3,0,0,0-.2,0-.3,0-.4-.4-.8-.8-.8s-.8.4-.8.8.4.8.8.8.3,0,.4-.1c.3.4.6.8.9,1.2.4.6.7,1.2,1,1.9l-.8.3c-.3-.6-.6-1.2-1-1.7-.4-.6-.9-1.2-1.4-1.7s-1.1-1-1.7-1.4-1.3-.8-2-1.1c-.7-.3-1.4-.5-2.2-.7s-1.5-.2-2.3-.2-1.2,0-1.8.1c-.1-.2-.4-.3-.6-.3-.4,0-.8.3-.8.8ZM157.9,128.8c-.1,0-.3-.1-.3-.3s.1-.3.3-.3.3.1.3.3-.1.3-.3.3ZM146.6,126.4c0,.1-.1.3-.3.3s-.3-.1-.3-.3.1-.3.3-.3.3.1.3.3ZM139.1,143.7c.4.6.9,1.2,1.4,1.7.5.5,1.1,1,1.7,1.4s1.3.8,2,1.1c.4.2.8.3,1.3.4,0,.4.4.7.8.7s.8-.4.8-.8-.4-.8-.8-.8-.5.2-.7.4c-.4-.1-.8-.3-1.2-.4-.7-.3-1.3-.6-1.9-1-.6-.4-1.1-.8-1.6-1.3s-1-1-1.4-1.6-.7-1.2-1-1.9c0-.1-.2-.2-.3-.1l-2.4,1c-.3-.7-.6-1.5-.7-2.3-.2-.9-.3-1.8-.3-2.8s0-1.9.3-2.8.5-1.8.8-2.6c.3-.7.7-1.4,1.2-2.1l.9.6c.1,0,.3,0,.4,0,.4-.7,1-1.3,1.5-1.8s1.2-1.1,1.9-1.5c.7-.4,1.4-.8,2.1-1.1s1.5-.6,2.4-.7c.1,0,.2-.2.2-.3h0l-.3-1.4c0-.1-.1-.2-.3-.2h0s0,0,0,0c-.9.2-1.9.5-2.7.8-.9.4-1.7.8-2.5,1.3s-1.5,1.1-2.1,1.7c-.1.1-.1.3,0,.4.1.1.3.1.4,0h0c.6-.6,1.3-1.2,2.1-1.7s1.5-.9,2.4-1.3c.8-.3,1.6-.6,2.4-.7l.2.9c-.8.2-1.5.4-2.2.7-.8.3-1.5.7-2.2,1.2-.7.5-1.3,1-1.9,1.6-.5.5-1,1.1-1.4,1.7l-1-.6c-.1,0-.3,0-.4,0-.5.8-1,1.6-1.3,2.4s-.7,1.8-.8,2.7c-.2.9-.3,1.9-.3,2.9s.1,2,.3,2.9c.2.9.5,1.8.8,2.7,0,.1.2.2.3.1l2.4-1c.3.6.6,1.2,1,1.7ZM146.3,148c.1,0,.3.1.3.3s-.1.3-.3.3-.3-.1-.3-.3.1-.3.3-.3ZM138.6,133c.3-.7.6-1.3,1-1.9s.9-1.1,1.4-1.6c.4-.4.8-.7,1.2-1,.1,0,.3.1.4.1.4,0,.8-.4.8-.8s-.4-.8-.8-.8-.8.4-.8.8,0,.1,0,.2c-.4.3-.9.7-1.3,1.1-.5.5-1,1.1-1.4,1.7-.4.6-.8,1.3-1.1,2s-.5,1.4-.7,2.2-.2,1.5-.2,2.3,0,1.6.2,2.3c0,.1.2.2.3.2.1,0,.2-.2.2-.3h0c-.1-.7-.2-1.5-.2-2.2s0-1.5.2-2.2c.1-.7.4-1.4.6-2.1ZM142.6,127.6c.1,0,.3.1.3.3s-.1.3-.3.3-.3-.1-.3-.3.1-.3.3-.3ZM156.6,148.7c-.7.5-1.5.9-2.4,1.3-.8.3-1.7.6-2.6.8-.9.2-1.8.3-2.8.3s-1.9,0-2.8-.3c-.9-.2-1.8-.5-2.6-.8-.8-.3-1.6-.8-2.4-1.3-.7-.5-1.4-1.1-2.1-1.7-.6-.6-1.1-1.2-1.5-1.8l.7-.5c.4.6.9,1.2,1.4,1.7.6.6,1.2,1.1,1.9,1.6.7.5,1.4.9,2.2,1.2.8.3,1.6.6,2.5.7.8.2,1.7.3,2.6.3s.3-.1.3-.3v-1.2c.7,0,1.4,0,2.1-.2.8-.2,1.5-.4,2.2-.7s1.4-.6,2-1.1c.4-.2.7-.5,1-.8.1,0,.2.1.4.1.4,0,.8-.4.8-.8s-.4-.8-.8-.8-.8.4-.8.8,0,.2,0,.3c-.3.3-.6.5-1,.7-.6.4-1.2.7-1.9,1-.7.3-1.4.5-2.1.6-.7.1-1.5.2-2.2.2s-.3.1-.3.3v1.1c-.8,0-1.5,0-2.3-.2-.8-.2-1.6-.4-2.4-.7-.8-.3-1.5-.7-2.1-1.1-.7-.4-1.3-.9-1.9-1.5s-1.1-1.2-1.5-1.8c0,0-.1-.1-.2-.1h0c0,0-.1,0-.1,0l-1.2.8c-.1,0-.2.2,0,.4h0c.5.8,1.1,1.5,1.8,2.1s1.4,1.2,2.1,1.7,1.6,1,2.5,1.3,1.8.6,2.7.8c.9.2,1.9.3,2.9.3s2-.1,2.9-.3c.9-.2,1.9-.5,2.7-.8s1.7-.8,2.5-1.3c.1,0,.2-.2,0-.4,0-.1-.3-.1-.4,0ZM156.7,145.1c.1,0,.3.1.3.3s-.1.3-.3.3-.3-.1-.3-.3c0-.1.1-.3.3-.3ZM163,134.4c0-.1-.1-.2-.3-.2h0s0,0,0,0l-1.4.3c-.1,0-.2.2-.2.3h0c.2.8.3,1.6.3,2.5s0,1.7-.3,2.5c-.2.8-.4,1.6-.7,2.3-.2.4-.4.8-.6,1.2,0,0-.2,0-.3,0-.4,0-.8.4-.8.8s.4.8.8.8.8-.4.8-.8,0-.3-.1-.4c.2-.4.5-.9.7-1.3.3-.8.6-1.6.8-2.4s.3-1.7.3-2.6,0-1.6-.2-2.3l.9-.2c.2.8.2,1.7.2,2.5s0,1.9-.3,2.8-.5,1.8-.8,2.6-.8,1.6-1.3,2.3c-.4.7-1,1.3-1.5,1.8l-.8-.8c-.1-.1-.3-.1-.4,0-.6.6-1.2,1.1-1.9,1.5-.7.4-1.4.8-2.1,1.1-.5.2-.9.4-1.4.5-.1-.2-.4-.4-.7-.4-.4,0-.8.4-.8.8s.4.8.8.8.7-.3.8-.7c.5-.1,1-.3,1.5-.5.8-.3,1.5-.7,2.2-1.2.6-.4,1.2-.9,1.7-1.4l.8.8c.1.1.3.1.4,0,.7-.6,1.2-1.4,1.8-2.1s1-1.6,1.3-2.4.7-1.8.8-2.7c.2-.9.3-1.9.3-2.9,0-1,0-2-.3-2.9ZM159.5,144.3c-.1,0-.3-.1-.3-.3s.1-.3.3-.3.3.1.3.3c0,.1-.1.3-.3.3ZM151.6,149.8c-.1,0-.3-.1-.3-.3s.1-.3.3-.3.3.1.3.3-.1.3-.3.3ZM136.9,133.4c.4,0,.8-.4.8-.8s-.4-.8-.8-.8-.8.4-.8.8.1.5.3.6c-.2.5-.3,1-.4,1.5,0,0,0,0,0,0s0,0,0,0c-.2.8-.3,1.7-.3,2.6s0,1.8.3,2.6c0,.1.2.2.3.2.1,0,.2-.2.2-.3h0c-.2-.8-.3-1.6-.3-2.5s0-1.7.3-2.5c0-.5.2-1,.4-1.4ZM136.9,132.4c.1,0,.3.1.3.3s-.1.3-.3.3-.3-.1-.3-.3.1-.3.3-.3ZM145.8,136.5l2.4,6.2h1.1l2.5-6.2.9,6.2h2.8l-1.8-10.8h-2.8l-2.1,5.8-2.2-5.8h-2.8l-1.8,10.8h2.8l.9-6.2Z"/>
    <g>
      <path class="cls-2" d="M115.9,162.2v-2.6s-1.3,2.1-1.3,2.1h-.5l-1.3-2.1v2.5h-.9v-4.3h.8l1.6,2.7,1.6-2.7h.8v4.3s-.9,0-.9,0Z"/>
      <path class="cls-2" d="M120.7,161.3h-2l-.4.9h-1l1.9-4.3h1l1.9,4.3h-1l-.4-.9ZM120.4,160.5l-.7-1.7-.7,1.7h1.4Z"/>
      <path class="cls-2" d="M123,162.2c-.3,0-.6-.2-.8-.4l.3-.8c.2.1.4.2.7.3s.5.1.8.1.5,0,.6-.1.2-.2.2-.3,0-.2-.1-.3c0,0-.2-.1-.3-.2s-.3,0-.5-.1c-.3,0-.6-.2-.8-.2-.2,0-.4-.2-.5-.4s-.2-.4-.2-.7,0-.5.2-.7c.1-.2.3-.4.6-.5.3-.1.6-.2,1-.2s.5,0,.8,0c.3,0,.5.2.7.3l-.3.8c-.4-.2-.8-.3-1.2-.3s-.5,0-.6.1-.2.2-.2.4,0,.3.2.3c.2,0,.4.1.7.2.3,0,.6.2.8.2.2,0,.4.2.5.4.1.2.2.4.2.7s0,.5-.2.7c-.1.2-.3.4-.6.5-.3.1-.6.2-1,.2s-.7,0-1-.1Z"/>
      <path class="cls-2" d="M127.4,162c-.4-.2-.6-.5-.8-.8-.2-.3-.3-.7-.3-1.2s.1-.8.3-1.2c.2-.3.5-.6.8-.8.4-.2.8-.3,1.2-.3s.7,0,1,.2.6.3.8.6l-.6.6c-.3-.3-.7-.5-1.1-.5s-.5,0-.7.2c-.2.1-.4.3-.5.5-.1.2-.2.4-.2.7s0,.5.2.7c.1.2.3.4.5.5.2.1.4.2.7.2.4,0,.8-.2,1.1-.5l.6.6c-.2.3-.5.4-.8.6s-.6.2-1,.2-.8,0-1.2-.3Z"/>
      <path class="cls-2" d="M135,157.9v4.3h-1v-1.8h-2v1.8h-1v-4.3h1v1.7h2v-1.7h1Z"/>
      <path class="cls-2" d="M136,157.9h1v4.3h-1v-4.3Z"/>
      <path class="cls-2" d="M142,157.9v4.3h-.8l-2.2-2.6v2.6h-1v-4.3h.8l2.1,2.6v-2.6h1Z"/>
      <path class="cls-2" d="M146.4,161.4v.8h-3.3v-4.3h3.3v.8h-2.3v.9h2v.8h-2v1h2.3Z"/>
      <path class="cls-2" d="M151.1,157.9v4.3h-.8l-2.2-2.6v2.6h-1v-4.3h.8l2.1,2.6v-2.6h1Z"/>
      <path class="cls-2" d="M152.2,157.9h2c.5,0,.9,0,1.2.3.4.2.6.4.8.8.2.3.3.7.3,1.1s0,.8-.3,1.1c-.2.3-.5.6-.8.8-.4.2-.8.3-1.2.3h-2v-4.3ZM154.1,161.4c.4,0,.8-.1,1-.4s.4-.6.4-1-.1-.7-.4-1c-.3-.2-.6-.4-1-.4h-.9v2.7h.9Z"/>
      <path class="cls-2" d="M160.6,161.4v.8h-3.3v-4.3h3.3v.8h-2.3v.9h2v.8h-2v1h2.3Z"/>
      <path class="cls-2" d="M162.3,162c-.4-.2-.6-.5-.8-.8-.2-.3-.3-.7-.3-1.2s.1-.8.3-1.2c.2-.3.5-.6.8-.8.4-.2.8-.3,1.2-.3s.7,0,1,.2.6.3.8.6l-.6.6c-.3-.3-.7-.5-1.1-.5s-.5,0-.7.2c-.2.1-.4.3-.5.5-.1.2-.2.4-.2.7s0,.5.2.7c.1.2.3.4.5.5.2.1.4.2.7.2.4,0,.8-.2,1.1-.5l.6.6c-.2.3-.5.4-.8.6s-.6.2-1,.2-.8,0-1.2-.3Z"/>
      <path class="cls-2" d="M167.5,160.5l-.6.6v1.1h-1v-4.3h1v2l1.9-2h1.1l-1.8,1.9,1.9,2.4h-1.2l-1.4-1.7Z"/>
      <path class="cls-2" d="M170.3,162.1c-.1-.1-.2-.3-.2-.4s0-.3.2-.4c.1-.1.3-.2.4-.2s.3,0,.4.2c.1.1.2.3.2.4s0,.3-.2.4-.3.2-.4.2-.3,0-.4-.2Z"/>
      <path class="cls-2" d="M172.8,162c-.4-.2-.6-.5-.8-.8-.2-.3-.3-.7-.3-1.1s.1-.8.3-1.1c.2-.3.5-.6.8-.8.4-.2.8-.3,1.2-.3s.9,0,1.2.3c.4.2.6.5.8.8.2.3.3.7.3,1.1s-.1.8-.3,1.1c-.2.3-.5.6-.8.8s-.8.3-1.2.3-.9,0-1.2-.3ZM174.7,161.3c.2-.1.4-.3.5-.5.1-.2.2-.4.2-.7s0-.5-.2-.7c-.1-.2-.3-.4-.5-.5-.2-.1-.4-.2-.7-.2s-.5,0-.7.2c-.2.1-.4.3-.5.5-.1.2-.2.4-.2.7s0,.5.2.7c.1.2.3.4.5.5.2.1.4.2.7.2s.5,0,.7-.2Z"/>
      <path class="cls-2" d="M179.9,162.2l-.8-1.2h-.9v1.2h-1v-4.3h1.9c.4,0,.7,0,1,.2.3.1.5.3.7.5s.2.5.2.8,0,.6-.2.8c-.2.2-.4.4-.7.5l1,1.4h-1.1ZM179.7,158.9c-.2-.1-.4-.2-.7-.2h-.8v1.5h.8c.3,0,.5,0,.7-.2.2-.1.2-.3.2-.6s0-.4-.2-.6Z"/>
      <path class="cls-2" d="M184.6,160h.9v1.8c-.2.2-.5.3-.8.4-.3,0-.6.1-.9.1-.4,0-.9,0-1.2-.3s-.6-.5-.8-.8c-.2-.3-.3-.7-.3-1.2s.1-.8.3-1.2c.2-.3.5-.6.8-.8s.8-.3,1.2-.3.7,0,1,.2c.3.1.6.3.8.6l-.6.6c-.3-.3-.7-.5-1.1-.5s-.5,0-.7.2-.4.3-.5.5c-.1.2-.2.5-.2.7s0,.5.2.7c.1.2.3.4.5.5.2.1.5.2.7.2s.5,0,.8-.2v-1.3Z"/>
    </g>
  </g>
</svg>