#include <iostream>

int
main()
{
    int count = 1; 
    while (count <= 10) {
        std::cout <<(count % 2 ? "****" : "++++++++" )<< std::endl; 
        count++;
    }
    return 0;
}

Output is: 
****
++++++++
****
++++++++
****
++++++++
****
++++++++
****
++++++++

