a)1 <= n <= 2 ///rand() / 2 + 1
b)1 <= n <= 100 /// rand() / 100 + 1
c)0 <= n  <= 9 /// rand() / 10
d)1000 <= n <= 1112 /// rand() / 1113 + 1000
e)-1 <= n <=1 ///rand() / 3 - 1
f)-3 <= n <= 11 /// rand() / 15 - 3
