[
  {
    "title" : "Holiday Cookies",
    "content":  "Classic cookies to enjoy during the holiday season!",
    "categories": [" Gingerbread Men ", " Peppermint Biscotti ", " Cinnamon Sugar Scrap ", " Crushed Candy Cane ", " Ugly Christmas Sweater "],
    "date": "December 15, 2019"
  },
  {
    "title" : "Classic cookies",
    "content":  "Old School Cookie Recipes you can't beat!",
    "categories": [" Sugar Cookies ", " Chocolate Chip ", " Peanut Butter ", " Macadamia ", " Oatmeal "],
     "date": "October 22, 2019"
  },
  {
    "title": "Low carb",
    "content": "Keto Cookies full of Fat and Awesomeness!",
    "categories": [" Keto Chocolate Chip "," Keto Ginger ", " Keto Shortbread ", " Low Carb Snickerdoodles ", " Oatmeal Chocolate Chip ", " No Carb Peanut Butter "],
     "date": "September 4, 2019"
  },
  {
    "title": "Summer Cookies",
    "content": "Cookies that are basically MADE for Summertime!",
    "categories": [" BBQ grill Summer Cookies ", " Watermelon Cookies ", " Lime Sugar ", " S'mores Cookies ", " Summer Sunshine Cookies ", " Strawberry Lemonade Cookies "],
     "date": "August 12, 2019"
  },
  {
    "title": "4th of July Cookies",
    "content": "Easy and Fun Patriotic Cookies",
    "categories": [" Bomb Pops ", " Grandmas Star Cookies ", " Fireworks Pudding Cookies ", " Patriotic Chocolate Chip ", " 4th of July Firework Cookies "],
     "date": "June 28, 2019"
  },
  {
    "title": "Easter Cookies",
    "content": "5 Easter Cookies Everybunny will Enjoy!",
    "categories": [" Bunny Cookies ", " Blossom Sugar Cookie ", " Easter Egg Sugar Cookie ", " Cookie Dough Pops ", " Lemon Curd Egg Cookies "],
     "date": "March  20, 2019"
  },
  {
    "title": "Valentine Day Cookies",
    "content": "Best Valentine's Day Cookies to bake for your Sweetheart!",
    "categories": [" Heart Shaped Sugar ", " Strawberry Shortcake Cookies ", " Nutella Stuffed ", " Conversation Heart Cookies ", " Inside Out Red Velvet "],
     "date": "February 1, 2019"
  },
  {
    "title": "New Year Cookies",
    "content": "Ring in the New Year like a pro with these awesome recipes!",
    "categories": [" Midnight Kiss Cookies ", " Champagne Cookies ", " Resolution Cookies ", " Party Cracker Cookies ", " NYE Oreo Balls ", " Countdown Cookies "],
     "date": "December 28, 2018"
  }
]
