\relax 
\providecommand\hyper@newdestlabel[2]{}
\@nameuse{bbl@beforestart}
\providecommand\HyperFirstAtBeginDocument{\AtBeginDocument}
\HyperFirstAtBeginDocument{\ifx\hyper@anchor\@undefined
\global\let\oldcontentsline\contentsline
\gdef\contentsline#1#2#3#4{\oldcontentsline{#1}{#2}{#3}}
\global\let\oldnewlabel\newlabel
\gdef\newlabel#1#2{\newlabelxx{#1}#2}
\gdef\newlabelxx#1#2#3#4#5#6{\oldnewlabel{#1}{{#2}{#3}}}
\AtEndDocument{\ifx\hyper@anchor\@undefined
\let\contentsline\oldcontentsline
\let\newlabel\oldnewlabel
\fi}
\fi}
\global\let\hyper@last\relax 
\gdef\HyperFirstAtBeginDocument#1{#1}
\providecommand\HyField@AuxAddToFields[1]{}
\providecommand\HyField@AuxAddToCoFields[2]{}
\abx@aux@refcontext{none/global//global/global}
\abx@aux@cite{TODO}
\abx@aux@segm{0}{0}{TODO}
\@LN@col{1}
\providecommand\@newglossary[4]{}
\@newglossary{main}{glg}{gls}{glo}
\@writefile{toc}{\boolfalse {citerequest}\boolfalse {citetracker}\boolfalse {pagetracker}\boolfalse {backtracker}\relax }
\@writefile{lof}{\boolfalse {citerequest}\boolfalse {citetracker}\boolfalse {pagetracker}\boolfalse {backtracker}\relax }
\@writefile{lot}{\boolfalse {citerequest}\boolfalse {citetracker}\boolfalse {pagetracker}\boolfalse {backtracker}\relax }
\babel@aux{english}{}
\@writefile{toc}{\contentsline {section}{\numberline {1}Introduction}{1}{section.0.1}\protected@file@percent }
\newlabel{sec:intro}{{1}{1}{Introduction}{section.0.1}{}}
\newlabel{sec:intro@cref}{{[section][1][]1}{[1][1][]1}}
\@writefile{toc}{\contentsline {section}{\numberline {2}Results}{1}{section.0.2}\protected@file@percent }
\newlabel{sec:results}{{2}{1}{Results}{section.0.2}{}}
\newlabel{sec:results@cref}{{[section][2][]2}{[1][1][]1}}
\@LN@col{2}
\@writefile{toc}{\contentsline {section}{\numberline {3}Discussion}{1}{section.0.3}\protected@file@percent }
\newlabel{sec:discussion}{{3}{1}{Discussion}{section.0.3}{}}
\newlabel{sec:discussion@cref}{{[section][3][]3}{[1][1][]1}}
\abx@aux@refcontextdefaultsdone
\abx@aux@defaultrefcontext{0}{TODO}{none/global//global/global}
\@writefile{toc}{\contentsline {section}{\numberline {S1}Extra stuff}{2}{section.1.1}\protected@file@percent }
\newlabel{sec:s1}{{S1}{2}{Extra stuff}{section.1.1}{}}
\newlabel{sec:s1@cref}{{[section][1][]S1}{[1][2][]2}}
\newlabel{LastPage}{{}{2}{}{page.2}{}}
\xdef\lastpage@lastpage{2}
\xdef\lastpage@lastpageHy{2}
