{
    "sections": {
        "Audio": {
            "Synthesis method":{
                "current": {
                    "name": "Unity",
                    "value": 1
                },
                "type": "list",
                "all": [
                    {
                        "name": "Unity",
                        "value": 1
                    },
                    {
                        "name": "AudioKit",
                        "value": 2
                    },
                    {
                        "name": "SC",
                        "value": 3
                    },
                ]
            },
        },
        "Grid": {
            "Nr. notes": {
                "current": 12,
                "from": 6,
                "to": 40,
                "type": "float",
            },

            "Nr. octaves": {
                "current": 5,
                "from": 3,
                "to": 8,
                "type": "float",
            },

            "Octave multiplier": {
                "current": 2,
                "from": 1.5,
                "to": 4,
                "type": "float",
            },
            "Toggle scaling":{
                "type": "button",
                "name": "Scaling",
                "action": "Scaling", 
            },
            "Scaling mode":{
                "current": {
                    "name": "Heptatonic",
                    "value": 7
                },
                "type": "list",
                "all": [
                    {
                        "name": "Pentatonic",
                    "value": 5
                    },
                    {
                        "name": "Heptatonic",
                        "value": 7
                    },
                ]
            },
            
        },
        "SuperCollider": {
            "Enabled": {
                "current": true,
                "type": "bool",
            },
            "IP":{
                "current": "127.0.0.1:57120",
                "type": "string",
                "showIfName": "Enabled",
                "showIfValue": true,
            },
            "Connect":{
                "type": "button",
                "name": "SC",
                "action": "SC", 
                "showIfName": "Enabled",
                "showIfValue": true,
            },
        },
        "Visuals": {
            "Visual":{
                "current": {
                    "name": "Over time",
                    "value": 1
                },
                "type": "list",
                "all": [
                    {
                        "name": "Over time",
                    "value": 1
                    },
                    {
                        "name": "One",
                        "value": 2
                    },
                ]
            },
        },
    },

}