<?xml version="1.0" encoding="utf-8"?>
<!DOCTYPE eagle SYSTEM "eagle.dtd">
<eagle version="9.4.2">
<drawing>
<settings>
<setting alwaysvectorfont="no"/>
<setting keepoldvectorfont="yes"/>
<setting verticaltext="up"/>
</settings>
<grid distance="0.1" unitdist="inch" unit="inch" style="lines" multiple="1" display="no" altdistance="0.01" altunitdist="inch" altunit="inch"/>
<layers>
<layer number="1" name="Top" color="4" fill="1" visible="no" active="no"/>
<layer number="2" name="Route2" color="15" fill="1" visible="no" active="no"/>
<layer number="3" name="Route3" color="4" fill="3" visible="no" active="no"/>
<layer number="4" name="Route4" color="1" fill="4" visible="no" active="no"/>
<layer number="5" name="Route5" color="4" fill="4" visible="no" active="no"/>
<layer number="6" name="Route6" color="1" fill="8" visible="no" active="no"/>
<layer number="7" name="Route7" color="4" fill="8" visible="no" active="no"/>
<layer number="8" name="Route8" color="1" fill="2" visible="no" active="no"/>
<layer number="9" name="Route9" color="4" fill="2" visible="no" active="no"/>
<layer number="10" name="Route10" color="1" fill="7" visible="no" active="no"/>
<layer number="11" name="Route11" color="4" fill="7" visible="no" active="no"/>
<layer number="12" name="Route12" color="1" fill="5" visible="no" active="no"/>
<layer number="13" name="Route13" color="4" fill="5" visible="no" active="no"/>
<layer number="14" name="Route14" color="1" fill="6" visible="no" active="no"/>
<layer number="15" name="Route15" color="11" fill="1" visible="no" active="no"/>
<layer number="16" name="Bottom" color="1" fill="1" visible="no" active="no"/>
<layer number="17" name="Pads" color="2" fill="1" visible="no" active="no"/>
<layer number="18" name="Vias" color="2" fill="1" visible="no" active="no"/>
<layer number="19" name="Unrouted" color="6" fill="1" visible="no" active="no"/>
<layer number="20" name="Dimension" color="15" fill="1" visible="no" active="no"/>
<layer number="21" name="tPlace" color="7" fill="1" visible="no" active="no"/>
<layer number="22" name="bPlace" color="7" fill="1" visible="no" active="no"/>
<layer number="23" name="tOrigins" color="15" fill="1" visible="no" active="no"/>
<layer number="24" name="bOrigins" color="15" fill="1" visible="no" active="no"/>
<layer number="25" name="tNames" color="7" fill="1" visible="no" active="no"/>
<layer number="26" name="bNames" color="7" fill="1" visible="no" active="no"/>
<layer number="27" name="tValues" color="7" fill="1" visible="no" active="no"/>
<layer number="28" name="bValues" color="7" fill="1" visible="no" active="no"/>
<layer number="29" name="tStop" color="7" fill="3" visible="no" active="no"/>
<layer number="30" name="bStop" color="7" fill="6" visible="no" active="no"/>
<layer number="31" name="tCream" color="7" fill="4" visible="no" active="no"/>
<layer number="32" name="bCream" color="7" fill="5" visible="no" active="no"/>
<layer number="33" name="tFinish" color="6" fill="3" visible="no" active="no"/>
<layer number="34" name="bFinish" color="6" fill="6" visible="no" active="no"/>
<layer number="35" name="tGlue" color="7" fill="4" visible="no" active="no"/>
<layer number="36" name="bGlue" color="7" fill="5" visible="no" active="no"/>
<layer number="37" name="tTest" color="7" fill="1" visible="no" active="no"/>
<layer number="38" name="bTest" color="7" fill="1" visible="no" active="no"/>
<layer number="39" name="tKeepout" color="4" fill="11" visible="no" active="no"/>
<layer number="40" name="bKeepout" color="1" fill="11" visible="no" active="no"/>
<layer number="41" name="tRestrict" color="4" fill="10" visible="no" active="no"/>
<layer number="42" name="bRestrict" color="1" fill="10" visible="no" active="no"/>
<layer number="43" name="vRestrict" color="2" fill="10" visible="no" active="no"/>
<layer number="44" name="Drills" color="7" fill="1" visible="no" active="no"/>
<layer number="45" name="Holes" color="7" fill="1" visible="no" active="no"/>
<layer number="46" name="Milling" color="3" fill="1" visible="no" active="no"/>
<layer number="47" name="Measures" color="7" fill="1" visible="no" active="no"/>
<layer number="48" name="Document" color="7" fill="1" visible="no" active="no"/>
<layer number="49" name="Reference" color="7" fill="1" visible="no" active="no"/>
<layer number="50" name="dxf" color="7" fill="1" visible="no" active="no"/>
<layer number="51" name="tDocu" color="7" fill="1" visible="no" active="no"/>
<layer number="52" name="bDocu" color="7" fill="1" visible="no" active="no"/>
<layer number="53" name="tGND_GNDA" color="7" fill="9" visible="no" active="no"/>
<layer number="54" name="bGND_GNDA" color="1" fill="9" visible="no" active="no"/>
<layer number="56" name="wert" color="7" fill="1" visible="no" active="no"/>
<layer number="88" name="SimResults" color="9" fill="1" visible="yes" active="yes"/>
<layer number="89" name="SimProbes" color="9" fill="1" visible="yes" active="yes"/>
<layer number="90" name="Modules" color="5" fill="1" visible="yes" active="yes"/>
<layer number="91" name="Nets" color="2" fill="1" visible="yes" active="yes"/>
<layer number="92" name="Busses" color="1" fill="1" visible="no" active="yes"/>
<layer number="93" name="Pins" color="2" fill="1" visible="no" active="yes"/>
<layer number="94" name="Symbols" color="4" fill="1" visible="yes" active="yes"/>
<layer number="95" name="Names" color="7" fill="1" visible="yes" active="yes"/>
<layer number="96" name="Values" color="7" fill="1" visible="yes" active="yes"/>
<layer number="97" name="Info" color="7" fill="1" visible="yes" active="yes"/>
<layer number="98" name="Guide" color="6" fill="1" visible="yes" active="yes"/>
<layer number="99" name="Anatomie" color="7" fill="1" visible="yes" active="yes"/>
<layer number="100" name="Muster" color="7" fill="1" visible="no" active="no"/>
<layer number="101" name="Patch_Top" color="12" fill="4" visible="yes" active="yes"/>
<layer number="102" name="Vscore" color="7" fill="1" visible="yes" active="yes"/>
<layer number="103" name="tMap" color="7" fill="1" visible="yes" active="yes"/>
<layer number="104" name="Name" color="7" fill="1" visible="yes" active="yes"/>
<layer number="105" name="tPlate" color="7" fill="1" visible="yes" active="yes"/>
<layer number="106" name="bPlate" color="7" fill="1" visible="yes" active="yes"/>
<layer number="107" name="Crop" color="7" fill="1" visible="yes" active="yes"/>
<layer number="110" name="tdokum" color="7" fill="1" visible="yes" active="yes"/>
<layer number="111" name="bdokum" color="7" fill="1" visible="yes" active="yes"/>
<layer number="116" name="Patch_BOT" color="9" fill="4" visible="yes" active="yes"/>
<layer number="121" name="_tsilk" color="7" fill="1" visible="yes" active="yes"/>
<layer number="122" name="_bsilk" color="7" fill="1" visible="yes" active="yes"/>
<layer number="125" name="_tNames" color="7" fill="1" visible="yes" active="yes"/>
<layer number="126" name="_bNames" color="7" fill="1" visible="yes" active="yes"/>
<layer number="151" name="HeatSink" color="7" fill="1" visible="yes" active="yes"/>
<layer number="199" name="Contour" color="7" fill="1" visible="no" active="yes"/>
<layer number="200" name="200bmp" color="1" fill="10" visible="no" active="no"/>
<layer number="201" name="201bmp" color="2" fill="1" visible="no" active="no"/>
<layer number="202" name="202bmp" color="3" fill="1" visible="no" active="no"/>
<layer number="203" name="203bmp" color="4" fill="10" visible="yes" active="yes"/>
<layer number="204" name="204bmp" color="5" fill="10" visible="yes" active="yes"/>
<layer number="205" name="205bmp" color="6" fill="10" visible="yes" active="yes"/>
<layer number="206" name="206bmp" color="7" fill="10" visible="yes" active="yes"/>
<layer number="207" name="207bmp" color="8" fill="10" visible="yes" active="yes"/>
<layer number="208" name="208bmp" color="9" fill="10" visible="yes" active="yes"/>
<layer number="250" name="Descript" color="3" fill="1" visible="no" active="no"/>
<layer number="251" name="SMDround" color="12" fill="11" visible="no" active="no"/>
<layer number="254" name="cooling" color="7" fill="1" visible="yes" active="yes"/>
</layers>
<schematic xreflabel="%F%N/%S.%C%R" xrefpart="/%S.%C%R">
<libraries>
<library name="SparkFun2">
<packages>
</packages>
<symbols>
<symbol name="A3L-LOC">
<wire x1="0" y1="0" x2="50.8" y2="0" width="0.1016" layer="94"/>
<wire x1="50.8" y1="0" x2="98.425" y2="0" width="0.1016" layer="94"/>
<wire x1="98.425" y1="0" x2="146.05" y2="0" width="0.1016" layer="94"/>
<wire x1="146.05" y1="0" x2="193.675" y2="0" width="0.1016" layer="94"/>
<wire x1="193.675" y1="0" x2="241.3" y2="0" width="0.1016" layer="94"/>
<wire x1="241.3" y1="0" x2="288.925" y2="0" width="0.1016" layer="94"/>
<wire x1="288.925" y1="0" x2="336.55" y2="0" width="0.1016" layer="94"/>
<wire x1="336.55" y1="0" x2="387.35" y2="0" width="0.1016" layer="94"/>
<wire x1="387.35" y1="0" x2="387.35" y2="53.975" width="0.1016" layer="94"/>
<wire x1="387.35" y1="53.975" x2="387.35" y2="104.775" width="0.1016" layer="94"/>
<wire x1="387.35" y1="104.775" x2="387.35" y2="155.575" width="0.1016" layer="94"/>
<wire x1="387.35" y1="155.575" x2="387.35" y2="206.375" width="0.1016" layer="94"/>
<wire x1="387.35" y1="206.375" x2="387.35" y2="260.35" width="0.1016" layer="94"/>
<wire x1="146.05" y1="260.35" x2="98.425" y2="260.35" width="0.1016" layer="94"/>
<wire x1="98.425" y1="260.35" x2="50.8" y2="260.35" width="0.1016" layer="94"/>
<wire x1="50.8" y1="260.35" x2="0" y2="260.35" width="0.1016" layer="94"/>
<wire x1="0" y1="260.35" x2="0" y2="206.375" width="0.1016" layer="94"/>
<wire x1="0" y1="206.375" x2="0" y2="155.575" width="0.1016" layer="94"/>
<wire x1="0" y1="155.575" x2="0" y2="104.775" width="0.1016" layer="94"/>
<wire x1="0" y1="104.775" x2="0" y2="53.975" width="0.1016" layer="94"/>
<wire x1="0" y1="53.975" x2="0" y2="0" width="0.1016" layer="94"/>
<wire x1="3.175" y1="3.175" x2="50.8" y2="3.175" width="0.1016" layer="94"/>
<wire x1="50.8" y1="3.175" x2="98.425" y2="3.175" width="0.1016" layer="94"/>
<wire x1="98.425" y1="3.175" x2="146.05" y2="3.175" width="0.1016" layer="94"/>
<wire x1="146.05" y1="3.175" x2="193.675" y2="3.175" width="0.1016" layer="94"/>
<wire x1="193.675" y1="3.175" x2="241.3" y2="3.175" width="0.1016" layer="94"/>
<wire x1="241.3" y1="3.175" x2="288.925" y2="3.175" width="0.1016" layer="94"/>
<wire x1="288.925" y1="3.175" x2="307.34" y2="3.175" width="0.1016" layer="94"/>
<wire x1="336.55" y1="3.175" x2="307.34" y2="3.175" width="0.1016" layer="94"/>
<wire x1="307.34" y1="3.175" x2="366.395" y2="3.175" width="0.1016" layer="94"/>
<wire x1="366.395" y1="3.175" x2="384.175" y2="3.175" width="0.1016" layer="94"/>
<wire x1="384.175" y1="3.175" x2="384.175" y2="8.255" width="0.1016" layer="94"/>
<wire x1="384.175" y1="8.255" x2="384.175" y2="13.335" width="0.1016" layer="94"/>
<wire x1="384.175" y1="13.335" x2="384.175" y2="18.415" width="0.1016" layer="94"/>
<wire x1="384.175" y1="18.415" x2="384.175" y2="23.495" width="0.1016" layer="94"/>
<wire x1="384.175" y1="23.495" x2="384.175" y2="53.975" width="0.1016" layer="94"/>
<wire x1="384.175" y1="53.975" x2="384.175" y2="104.775" width="0.1016" layer="94"/>
<wire x1="384.175" y1="104.775" x2="384.175" y2="155.575" width="0.1016" layer="94"/>
<wire x1="384.175" y1="155.575" x2="384.175" y2="206.375" width="0.1016" layer="94"/>
<wire x1="384.175" y1="206.375" x2="384.175" y2="257.175" width="0.1016" layer="94"/>
<wire x1="384.175" y1="257.175" x2="336.55" y2="257.175" width="0.1016" layer="94"/>
<wire x1="336.55" y1="257.175" x2="288.925" y2="257.175" width="0.1016" layer="94"/>
<wire x1="288.925" y1="257.175" x2="241.3" y2="257.175" width="0.1016" layer="94"/>
<wire x1="241.3" y1="257.175" x2="193.675" y2="257.175" width="0.1016" layer="94"/>
<wire x1="193.675" y1="257.175" x2="146.05" y2="257.175" width="0.1016" layer="94"/>
<wire x1="146.05" y1="257.175" x2="98.425" y2="257.175" width="0.1016" layer="94"/>
<wire x1="98.425" y1="257.175" x2="50.8" y2="257.175" width="0.1016" layer="94"/>
<wire x1="50.8" y1="257.175" x2="3.175" y2="257.175" width="0.1016" layer="94"/>
<wire x1="3.175" y1="257.175" x2="3.175" y2="206.375" width="0.1016" layer="94"/>
<wire x1="3.175" y1="206.375" x2="3.175" y2="155.575" width="0.1016" layer="94"/>
<wire x1="3.175" y1="155.575" x2="3.175" y2="104.775" width="0.1016" layer="94"/>
<wire x1="3.175" y1="104.775" x2="3.175" y2="53.975" width="0.1016" layer="94"/>
<wire x1="3.175" y1="53.975" x2="3.175" y2="3.175" width="0.1016" layer="94"/>
<wire x1="387.35" y1="260.35" x2="336.55" y2="260.35" width="0.1016" layer="94"/>
<wire x1="336.55" y1="260.35" x2="288.925" y2="260.35" width="0.1016" layer="94"/>
<wire x1="288.925" y1="260.35" x2="241.3" y2="260.35" width="0.1016" layer="94"/>
<wire x1="241.3" y1="260.35" x2="193.675" y2="260.35" width="0.1016" layer="94"/>
<wire x1="193.675" y1="260.35" x2="146.05" y2="260.35" width="0.1016" layer="94"/>
<wire x1="193.675" y1="260.35" x2="193.675" y2="257.175" width="0.1016" layer="94"/>
<wire x1="193.675" y1="3.175" x2="193.675" y2="0" width="0.1016" layer="94"/>
<wire x1="0" y1="104.775" x2="3.175" y2="104.775" width="0.1016" layer="94"/>
<wire x1="384.175" y1="155.575" x2="387.35" y2="155.575" width="0.1016" layer="94"/>
<wire x1="98.425" y1="257.175" x2="98.425" y2="260.35" width="0.1016" layer="94"/>
<wire x1="98.425" y1="3.175" x2="98.425" y2="0" width="0.1016" layer="94"/>
<wire x1="288.925" y1="260.35" x2="288.925" y2="257.175" width="0.1016" layer="94"/>
<wire x1="288.925" y1="3.175" x2="288.925" y2="0" width="0.1016" layer="94"/>
<wire x1="0" y1="53.975" x2="3.175" y2="53.975" width="0.1016" layer="94"/>
<wire x1="384.175" y1="104.775" x2="387.35" y2="104.775" width="0.1016" layer="94"/>
<wire x1="0" y1="155.575" x2="3.175" y2="155.575" width="0.1016" layer="94"/>
<wire x1="384.175" y1="206.375" x2="387.35" y2="206.375" width="0.1016" layer="94"/>
<wire x1="50.8" y1="257.175" x2="50.8" y2="260.35" width="0.1016" layer="94"/>
<wire x1="0" y1="206.375" x2="3.175" y2="206.375" width="0.1016" layer="94"/>
<wire x1="384.175" y1="53.975" x2="387.35" y2="53.975" width="0.1016" layer="94"/>
<wire x1="146.05" y1="257.175" x2="146.05" y2="260.35" width="0.1016" layer="94"/>
<wire x1="241.3" y1="260.35" x2="241.3" y2="257.175" width="0.1016" layer="94"/>
<wire x1="336.55" y1="260.35" x2="336.55" y2="257.175" width="0.1016" layer="94"/>
<wire x1="336.55" y1="3.175" x2="336.55" y2="0" width="0.1016" layer="94"/>
<wire x1="241.3" y1="3.175" x2="241.3" y2="0" width="0.1016" layer="94"/>
<wire x1="146.05" y1="3.175" x2="146.05" y2="0" width="0.1016" layer="94"/>
<wire x1="50.8" y1="0" x2="50.8" y2="3.175" width="0.1016" layer="94"/>
<wire x1="288.925" y1="3.175" x2="288.925" y2="23.495" width="0.6096" layer="94"/>
<wire x1="288.925" y1="23.495" x2="307.34" y2="23.495" width="0.6096" layer="94"/>
<wire x1="307.34" y1="23.495" x2="384.175" y2="23.495" width="0.6096" layer="94"/>
<wire x1="366.395" y1="3.175" x2="366.395" y2="8.255" width="0.1016" layer="94"/>
<wire x1="366.395" y1="8.255" x2="384.175" y2="8.255" width="0.1016" layer="94"/>
<wire x1="366.395" y1="8.255" x2="307.34" y2="8.255" width="0.1016" layer="94"/>
<wire x1="307.34" y1="8.255" x2="307.34" y2="3.175" width="0.6096" layer="94"/>
<wire x1="307.34" y1="8.255" x2="307.34" y2="13.335" width="0.6096" layer="94"/>
<wire x1="307.34" y1="13.335" x2="384.175" y2="13.335" width="0.1016" layer="94"/>
<wire x1="307.34" y1="13.335" x2="307.34" y2="18.415" width="0.6096" layer="94"/>
<wire x1="307.34" y1="18.415" x2="384.175" y2="18.415" width="0.1016" layer="94"/>
<wire x1="307.34" y1="18.415" x2="307.34" y2="23.495" width="0.6096" layer="94"/>
<text x="24.384" y="0.254" size="2.54" layer="94" font="vector">A</text>
<text x="74.422" y="0.254" size="2.54" layer="94" font="vector">B</text>
<text x="121.158" y="0.254" size="2.54" layer="94" font="vector">C</text>
<text x="169.418" y="0.254" size="2.54" layer="94" font="vector">D</text>
<text x="216.916" y="0.254" size="2.54" layer="94" font="vector">E</text>
<text x="263.652" y="0.254" size="2.54" layer="94" font="vector">F</text>
<text x="310.642" y="0.254" size="2.54" layer="94" font="vector">G</text>
<text x="360.934" y="0.254" size="2.54" layer="94" font="vector">H</text>
<text x="385.064" y="28.702" size="2.54" layer="94" font="vector">1</text>
<text x="384.81" y="79.502" size="2.54" layer="94" font="vector">2</text>
<text x="384.81" y="130.302" size="2.54" layer="94" font="vector">3</text>
<text x="384.81" y="181.864" size="2.54" layer="94" font="vector">4</text>
<text x="384.81" y="231.14" size="2.54" layer="94" font="vector">5</text>
<text x="361.188" y="257.556" size="2.54" layer="94" font="vector">H</text>
<text x="311.404" y="257.556" size="2.54" layer="94" font="vector">G</text>
<text x="262.89" y="257.556" size="2.54" layer="94" font="vector">F</text>
<text x="215.9" y="257.556" size="2.54" layer="94" font="vector">E</text>
<text x="168.148" y="257.556" size="2.54" layer="94" font="vector">D</text>
<text x="120.904" y="257.556" size="2.54" layer="94" font="vector">C</text>
<text x="72.898" y="257.556" size="2.54" layer="94" font="vector">B</text>
<text x="24.384" y="257.556" size="2.54" layer="94" font="vector">A</text>
<text x="0.762" y="231.14" size="2.54" layer="94" font="vector">5</text>
<text x="0.762" y="181.61" size="2.54" layer="94" font="vector">4</text>
<text x="0.762" y="130.302" size="2.54" layer="94" font="vector">3</text>
<text x="0.762" y="79.248" size="2.54" layer="94" font="vector">2</text>
<text x="1.016" y="26.67" size="2.54" layer="94" font="vector">1</text>
<text x="319.151" y="19.431" size="2.54" layer="94" font="vector">&gt;DRAWING_NAME</text>
<text x="309.753" y="9.525" size="2.286" layer="94" font="vector">&gt;LAST_DATE_TIME</text>
<text x="368.3" y="4.445" size="2.54" layer="94" font="vector">&gt;SHEET</text>
<text x="309.626" y="4.318" size="2.54" layer="94">Drawn By:</text>
<text x="309.88" y="19.558" size="2.54" layer="94">Title:</text>
<text x="310.134" y="14.478" size="2.54" layer="94">Version:</text>
</symbol>
</symbols>
<devicesets>
<deviceset name="FRAME-A3" prefix="FRAME">
<description>&lt;b&gt;Schematic Frame&lt;/b&gt;&lt;p&gt;
A3 Larger Frame</description>
<gates>
<gate name="G$1" symbol="A3L-LOC" x="0" y="0"/>
</gates>
<devices>
<device name="">
<technologies>
<technology name=""/>
</technologies>
</device>
</devices>
</deviceset>
</devicesets>
</library>
<library name="SparkFun">
<packages>
</packages>
<symbols>
<symbol name="VCC2">
<wire x1="0.762" y1="1.27" x2="0" y2="2.54" width="0.254" layer="94"/>
<wire x1="0" y1="2.54" x2="-0.762" y2="1.27" width="0.254" layer="94"/>
<text x="-1.016" y="3.556" size="1.778" layer="96">&gt;VALUE</text>
<pin name="VCC" x="0" y="0" visible="off" length="short" direction="sup" rot="R90"/>
</symbol>
</symbols>
<devicesets>
<deviceset name="VCC" prefix="P+">
<description>&lt;b&gt;SUPPLY SYMBOL&lt;/b&gt;</description>
<gates>
<gate name="1" symbol="VCC2" x="0" y="0"/>
</gates>
<devices>
<device name="">
<technologies>
<technology name=""/>
</technologies>
</device>
</devices>
</deviceset>
</devicesets>
</library>
<library name="supply1" urn="urn:adsk.eagle:library:371">
<packages>
</packages>
<symbols>
<symbol name="GND" urn="urn:adsk.eagle:symbol:26925/1" library_version="1">
<wire x1="-1.905" y1="0" x2="1.905" y2="0" width="0.254" layer="94"/>
<text x="-2.54" y="-2.54" size="1.778" layer="96">&gt;VALUE</text>
<pin name="GND" x="0" y="2.54" visible="off" length="short" direction="sup" rot="R270"/>
</symbol>
</symbols>
<devicesets>
<deviceset name="GND" urn="urn:adsk.eagle:component:26954/1" prefix="GND" library_version="1">
<description>&lt;b&gt;SUPPLY SYMBOL&lt;/b&gt;</description>
<gates>
<gate name="1" symbol="GND" x="0" y="0"/>
</gates>
<devices>
<device name="">
<technologies>
<technology name=""/>
</technologies>
</device>
</devices>
</deviceset>
</devicesets>
</library>
<library name="supply2" urn="urn:adsk.eagle:library:372">
<description>&lt;b&gt;Supply Symbols&lt;/b&gt;&lt;p&gt;
GND, VCC, 0V, +5V, -5V, etc.&lt;p&gt;
Please keep in mind, that these devices are necessary for the
automatic wiring of the supply signals.&lt;p&gt;
The pin name defined in the symbol is identical to the net which is to be wired automatically.&lt;p&gt;
In this library the device names are the same as the pin names of the symbols, therefore the correct signal names appear next to the supply symbols in the schematic.&lt;p&gt;
&lt;author&gt;Created by librarian@cadsoft.de&lt;/author&gt;</description>
<packages>
</packages>
<symbols>
<symbol name="+05V" urn="urn:adsk.eagle:symbol:26987/1" library_version="2">
<wire x1="-0.635" y1="1.27" x2="0.635" y2="1.27" width="0.1524" layer="94"/>
<wire x1="0" y1="0.635" x2="0" y2="1.905" width="0.1524" layer="94"/>
<circle x="0" y="1.27" radius="1.27" width="0.254" layer="94"/>
<text x="-1.905" y="3.175" size="1.778" layer="96">&gt;VALUE</text>
<pin name="+5V" x="0" y="-2.54" visible="off" length="short" direction="sup" rot="R90"/>
</symbol>
</symbols>
<devicesets>
<deviceset name="+5V" urn="urn:adsk.eagle:component:27032/1" prefix="SUPPLY" library_version="2">
<description>&lt;b&gt;SUPPLY SYMBOL&lt;/b&gt;</description>
<gates>
<gate name="+5V" symbol="+05V" x="0" y="0"/>
</gates>
<devices>
<device name="">
<technologies>
<technology name=""/>
</technologies>
</device>
</devices>
</deviceset>
</devicesets>
</library>
<library name="pinhead" urn="urn:adsk.eagle:library:325">
<description>&lt;b&gt;Pin Header Connectors&lt;/b&gt;&lt;p&gt;
&lt;author&gt;Created by librarian@cadsoft.de&lt;/author&gt;</description>
<packages>
<package name="1X01" urn="urn:adsk.eagle:footprint:22382/1" library_version="3">
<description>&lt;b&gt;PIN HEADER&lt;/b&gt;</description>
<wire x1="-0.635" y1="1.27" x2="0.635" y2="1.27" width="0.1524" layer="21"/>
<wire x1="0.635" y1="1.27" x2="1.27" y2="0.635" width="0.1524" layer="21"/>
<wire x1="1.27" y1="0.635" x2="1.27" y2="-0.635" width="0.1524" layer="21"/>
<wire x1="1.27" y1="-0.635" x2="0.635" y2="-1.27" width="0.1524" layer="21"/>
<wire x1="-1.27" y1="0.635" x2="-1.27" y2="-0.635" width="0.1524" layer="21"/>
<wire x1="-0.635" y1="1.27" x2="-1.27" y2="0.635" width="0.1524" layer="21"/>
<wire x1="-1.27" y1="-0.635" x2="-0.635" y2="-1.27" width="0.1524" layer="21"/>
<wire x1="0.635" y1="-1.27" x2="-0.635" y2="-1.27" width="0.1524" layer="21"/>
<pad name="1" x="0" y="0" drill="1.016" shape="octagon"/>
<text x="-1.3462" y="1.8288" size="1.27" layer="25" ratio="10">&gt;NAME</text>
<text x="-1.27" y="-3.175" size="1.27" layer="27">&gt;VALUE</text>
<rectangle x1="-0.254" y1="-0.254" x2="0.254" y2="0.254" layer="51"/>
</package>
<package name="1X06" urn="urn:adsk.eagle:footprint:22361/1" library_version="3">
<description>&lt;b&gt;PIN HEADER&lt;/b&gt;</description>
<wire x1="0.635" y1="1.27" x2="1.905" y2="1.27" width="0.1524" layer="21"/>
<wire x1="1.905" y1="1.27" x2="2.54" y2="0.635" width="0.1524" layer="21"/>
<wire x1="2.54" y1="0.635" x2="2.54" y2="-0.635" width="0.1524" layer="21"/>
<wire x1="2.54" y1="-0.635" x2="1.905" y2="-1.27" width="0.1524" layer="21"/>
<wire x1="2.54" y1="0.635" x2="3.175" y2="1.27" width="0.1524" layer="21"/>
<wire x1="3.175" y1="1.27" x2="4.445" y2="1.27" width="0.1524" layer="21"/>
<wire x1="4.445" y1="1.27" x2="5.08" y2="0.635" width="0.1524" layer="21"/>
<wire x1="5.08" y1="0.635" x2="5.08" y2="-0.635" width="0.1524" layer="21"/>
<wire x1="5.08" y1="-0.635" x2="4.445" y2="-1.27" width="0.1524" layer="21"/>
<wire x1="4.445" y1="-1.27" x2="3.175" y2="-1.27" width="0.1524" layer="21"/>
<wire x1="3.175" y1="-1.27" x2="2.54" y2="-0.635" width="0.1524" layer="21"/>
<wire x1="-2.54" y1="0.635" x2="-1.905" y2="1.27" width="0.1524" layer="21"/>
<wire x1="-1.905" y1="1.27" x2="-0.635" y2="1.27" width="0.1524" layer="21"/>
<wire x1="-0.635" y1="1.27" x2="0" y2="0.635" width="0.1524" layer="21"/>
<wire x1="0" y1="0.635" x2="0" y2="-0.635" width="0.1524" layer="21"/>
<wire x1="0" y1="-0.635" x2="-0.635" y2="-1.27" width="0.1524" layer="21"/>
<wire x1="-0.635" y1="-1.27" x2="-1.905" y2="-1.27" width="0.1524" layer="21"/>
<wire x1="-1.905" y1="-1.27" x2="-2.54" y2="-0.635" width="0.1524" layer="21"/>
<wire x1="0.635" y1="1.27" x2="0" y2="0.635" width="0.1524" layer="21"/>
<wire x1="0" y1="-0.635" x2="0.635" y2="-1.27" width="0.1524" layer="21"/>
<wire x1="1.905" y1="-1.27" x2="0.635" y2="-1.27" width="0.1524" layer="21"/>
<wire x1="-6.985" y1="1.27" x2="-5.715" y2="1.27" width="0.1524" layer="21"/>
<wire x1="-5.715" y1="1.27" x2="-5.08" y2="0.635" width="0.1524" layer="21"/>
<wire x1="-5.08" y1="0.635" x2="-5.08" y2="-0.635" width="0.1524" layer="21"/>
<wire x1="-5.08" y1="-0.635" x2="-5.715" y2="-1.27" width="0.1524" layer="21"/>
<wire x1="-5.08" y1="0.635" x2="-4.445" y2="1.27" width="0.1524" layer="21"/>
<wire x1="-4.445" y1="1.27" x2="-3.175" y2="1.27" width="0.1524" layer="21"/>
<wire x1="-3.175" y1="1.27" x2="-2.54" y2="0.635" width="0.1524" layer="21"/>
<wire x1="-2.54" y1="0.635" x2="-2.54" y2="-0.635" width="0.1524" layer="21"/>
<wire x1="-2.54" y1="-0.635" x2="-3.175" y2="-1.27" width="0.1524" layer="21"/>
<wire x1="-3.175" y1="-1.27" x2="-4.445" y2="-1.27" width="0.1524" layer="21"/>
<wire x1="-4.445" y1="-1.27" x2="-5.08" y2="-0.635" width="0.1524" layer="21"/>
<wire x1="-7.62" y1="0.635" x2="-7.62" y2="-0.635" width="0.1524" layer="21"/>
<wire x1="-6.985" y1="1.27" x2="-7.62" y2="0.635" width="0.1524" layer="21"/>
<wire x1="-7.62" y1="-0.635" x2="-6.985" y2="-1.27" width="0.1524" layer="21"/>
<wire x1="-5.715" y1="-1.27" x2="-6.985" y2="-1.27" width="0.1524" layer="21"/>
<wire x1="5.715" y1="1.27" x2="6.985" y2="1.27" width="0.1524" layer="21"/>
<wire x1="6.985" y1="1.27" x2="7.62" y2="0.635" width="0.1524" layer="21"/>
<wire x1="7.62" y1="0.635" x2="7.62" y2="-0.635" width="0.1524" layer="21"/>
<wire x1="7.62" y1="-0.635" x2="6.985" y2="-1.27" width="0.1524" layer="21"/>
<wire x1="5.715" y1="1.27" x2="5.08" y2="0.635" width="0.1524" layer="21"/>
<wire x1="5.08" y1="-0.635" x2="5.715" y2="-1.27" width="0.1524" layer="21"/>
<wire x1="6.985" y1="-1.27" x2="5.715" y2="-1.27" width="0.1524" layer="21"/>
<pad name="1" x="-6.35" y="0" drill="1.016" shape="long" rot="R90"/>
<pad name="2" x="-3.81" y="0" drill="1.016" shape="long" rot="R90"/>
<pad name="3" x="-1.27" y="0" drill="1.016" shape="long" rot="R90"/>
<pad name="4" x="1.27" y="0" drill="1.016" shape="long" rot="R90"/>
<pad name="5" x="3.81" y="0" drill="1.016" shape="long" rot="R90"/>
<pad name="6" x="6.35" y="0" drill="1.016" shape="long" rot="R90"/>
<text x="-7.6962" y="1.8288" size="1.27" layer="25" ratio="10">&gt;NAME</text>
<text x="-7.62" y="-3.175" size="1.27" layer="27">&gt;VALUE</text>
<rectangle x1="3.556" y1="-0.254" x2="4.064" y2="0.254" layer="51"/>
<rectangle x1="1.016" y1="-0.254" x2="1.524" y2="0.254" layer="51"/>
<rectangle x1="-1.524" y1="-0.254" x2="-1.016" y2="0.254" layer="51"/>
<rectangle x1="-4.064" y1="-0.254" x2="-3.556" y2="0.254" layer="51"/>
<rectangle x1="-6.604" y1="-0.254" x2="-6.096" y2="0.254" layer="51"/>
<rectangle x1="6.096" y1="-0.254" x2="6.604" y2="0.254" layer="51"/>
</package>
<package name="1X06/90" urn="urn:adsk.eagle:footprint:22362/1" library_version="3">
<description>&lt;b&gt;PIN HEADER&lt;/b&gt;</description>
<wire x1="-7.62" y1="-1.905" x2="-5.08" y2="-1.905" width="0.1524" layer="21"/>
<wire x1="-5.08" y1="-1.905" x2="-5.08" y2="0.635" width="0.1524" layer="21"/>
<wire x1="-5.08" y1="0.635" x2="-7.62" y2="0.635" width="0.1524" layer="21"/>
<wire x1="-7.62" y1="0.635" x2="-7.62" y2="-1.905" width="0.1524" layer="21"/>
<wire x1="-6.35" y1="6.985" x2="-6.35" y2="1.27" width="0.762" layer="21"/>
<wire x1="-5.08" y1="-1.905" x2="-2.54" y2="-1.905" width="0.1524" layer="21"/>
<wire x1="-2.54" y1="-1.905" x2="-2.54" y2="0.635" width="0.1524" layer="21"/>
<wire x1="-2.54" y1="0.635" x2="-5.08" y2="0.635" width="0.1524" layer="21"/>
<wire x1="-3.81" y1="6.985" x2="-3.81" y2="1.27" width="0.762" layer="21"/>
<wire x1="-2.54" y1="-1.905" x2="0" y2="-1.905" width="0.1524" layer="21"/>
<wire x1="0" y1="-1.905" x2="0" y2="0.635" width="0.1524" layer="21"/>
<wire x1="0" y1="0.635" x2="-2.54" y2="0.635" width="0.1524" layer="21"/>
<wire x1="-1.27" y1="6.985" x2="-1.27" y2="1.27" width="0.762" layer="21"/>
<wire x1="0" y1="-1.905" x2="2.54" y2="-1.905" width="0.1524" layer="21"/>
<wire x1="2.54" y1="-1.905" x2="2.54" y2="0.635" width="0.1524" layer="21"/>
<wire x1="2.54" y1="0.635" x2="0" y2="0.635" width="0.1524" layer="21"/>
<wire x1="1.27" y1="6.985" x2="1.27" y2="1.27" width="0.762" layer="21"/>
<wire x1="2.54" y1="-1.905" x2="5.08" y2="-1.905" width="0.1524" layer="21"/>
<wire x1="5.08" y1="-1.905" x2="5.08" y2="0.635" width="0.1524" layer="21"/>
<wire x1="5.08" y1="0.635" x2="2.54" y2="0.635" width="0.1524" layer="21"/>
<wire x1="3.81" y1="6.985" x2="3.81" y2="1.27" width="0.762" layer="21"/>
<wire x1="5.08" y1="-1.905" x2="7.62" y2="-1.905" width="0.1524" layer="21"/>
<wire x1="7.62" y1="-1.905" x2="7.62" y2="0.635" width="0.1524" layer="21"/>
<wire x1="7.62" y1="0.635" x2="5.08" y2="0.635" width="0.1524" layer="21"/>
<wire x1="6.35" y1="6.985" x2="6.35" y2="1.27" width="0.762" layer="21"/>
<pad name="1" x="-6.35" y="-3.81" drill="1.016" shape="long" rot="R90"/>
<pad name="2" x="-3.81" y="-3.81" drill="1.016" shape="long" rot="R90"/>
<pad name="3" x="-1.27" y="-3.81" drill="1.016" shape="long" rot="R90"/>
<pad name="4" x="1.27" y="-3.81" drill="1.016" shape="long" rot="R90"/>
<pad name="5" x="3.81" y="-3.81" drill="1.016" shape="long" rot="R90"/>
<pad name="6" x="6.35" y="-3.81" drill="1.016" shape="long" rot="R90"/>
<text x="-8.255" y="-3.81" size="1.27" layer="25" ratio="10" rot="R90">&gt;NAME</text>
<text x="9.525" y="-3.81" size="1.27" layer="27" rot="R90">&gt;VALUE</text>
<rectangle x1="-6.731" y1="0.635" x2="-5.969" y2="1.143" layer="21"/>
<rectangle x1="-4.191" y1="0.635" x2="-3.429" y2="1.143" layer="21"/>
<rectangle x1="-1.651" y1="0.635" x2="-0.889" y2="1.143" layer="21"/>
<rectangle x1="0.889" y1="0.635" x2="1.651" y2="1.143" layer="21"/>
<rectangle x1="3.429" y1="0.635" x2="4.191" y2="1.143" layer="21"/>
<rectangle x1="5.969" y1="0.635" x2="6.731" y2="1.143" layer="21"/>
<rectangle x1="-6.731" y1="-2.921" x2="-5.969" y2="-1.905" layer="21"/>
<rectangle x1="-4.191" y1="-2.921" x2="-3.429" y2="-1.905" layer="21"/>
<rectangle x1="-1.651" y1="-2.921" x2="-0.889" y2="-1.905" layer="21"/>
<rectangle x1="0.889" y1="-2.921" x2="1.651" y2="-1.905" layer="21"/>
<rectangle x1="3.429" y1="-2.921" x2="4.191" y2="-1.905" layer="21"/>
<rectangle x1="5.969" y1="-2.921" x2="6.731" y2="-1.905" layer="21"/>
</package>
<package name="1X04" urn="urn:adsk.eagle:footprint:22258/1" library_version="3">
<description>&lt;b&gt;PIN HEADER&lt;/b&gt;</description>
<wire x1="0" y1="0.635" x2="0.635" y2="1.27" width="0.1524" layer="21"/>
<wire x1="0.635" y1="1.27" x2="1.905" y2="1.27" width="0.1524" layer="21"/>
<wire x1="1.905" y1="1.27" x2="2.54" y2="0.635" width="0.1524" layer="21"/>
<wire x1="2.54" y1="0.635" x2="2.54" y2="-0.635" width="0.1524" layer="21"/>
<wire x1="2.54" y1="-0.635" x2="1.905" y2="-1.27" width="0.1524" layer="21"/>
<wire x1="1.905" y1="-1.27" x2="0.635" y2="-1.27" width="0.1524" layer="21"/>
<wire x1="0.635" y1="-1.27" x2="0" y2="-0.635" width="0.1524" layer="21"/>
<wire x1="-4.445" y1="1.27" x2="-3.175" y2="1.27" width="0.1524" layer="21"/>
<wire x1="-3.175" y1="1.27" x2="-2.54" y2="0.635" width="0.1524" layer="21"/>
<wire x1="-2.54" y1="0.635" x2="-2.54" y2="-0.635" width="0.1524" layer="21"/>
<wire x1="-2.54" y1="-0.635" x2="-3.175" y2="-1.27" width="0.1524" layer="21"/>
<wire x1="-2.54" y1="0.635" x2="-1.905" y2="1.27" width="0.1524" layer="21"/>
<wire x1="-1.905" y1="1.27" x2="-0.635" y2="1.27" width="0.1524" layer="21"/>
<wire x1="-0.635" y1="1.27" x2="0" y2="0.635" width="0.1524" layer="21"/>
<wire x1="0" y1="0.635" x2="0" y2="-0.635" width="0.1524" layer="21"/>
<wire x1="0" y1="-0.635" x2="-0.635" y2="-1.27" width="0.1524" layer="21"/>
<wire x1="-0.635" y1="-1.27" x2="-1.905" y2="-1.27" width="0.1524" layer="21"/>
<wire x1="-1.905" y1="-1.27" x2="-2.54" y2="-0.635" width="0.1524" layer="21"/>
<wire x1="-5.08" y1="0.635" x2="-5.08" y2="-0.635" width="0.1524" layer="21"/>
<wire x1="-4.445" y1="1.27" x2="-5.08" y2="0.635" width="0.1524" layer="21"/>
<wire x1="-5.08" y1="-0.635" x2="-4.445" y2="-1.27" width="0.1524" layer="21"/>
<wire x1="-3.175" y1="-1.27" x2="-4.445" y2="-1.27" width="0.1524" layer="21"/>
<wire x1="3.175" y1="1.27" x2="4.445" y2="1.27" width="0.1524" layer="21"/>
<wire x1="4.445" y1="1.27" x2="5.08" y2="0.635" width="0.1524" layer="21"/>
<wire x1="5.08" y1="0.635" x2="5.08" y2="-0.635" width="0.1524" layer="21"/>
<wire x1="5.08" y1="-0.635" x2="4.445" y2="-1.27" width="0.1524" layer="21"/>
<wire x1="3.175" y1="1.27" x2="2.54" y2="0.635" width="0.1524" layer="21"/>
<wire x1="2.54" y1="-0.635" x2="3.175" y2="-1.27" width="0.1524" layer="21"/>
<wire x1="4.445" y1="-1.27" x2="3.175" y2="-1.27" width="0.1524" layer="21"/>
<pad name="1" x="-3.81" y="0" drill="1.016" shape="long" rot="R90"/>
<pad name="2" x="-1.27" y="0" drill="1.016" shape="long" rot="R90"/>
<pad name="3" x="1.27" y="0" drill="1.016" shape="long" rot="R90"/>
<pad name="4" x="3.81" y="0" drill="1.016" shape="long" rot="R90"/>
<text x="-5.1562" y="1.8288" size="1.27" layer="25" ratio="10">&gt;NAME</text>
<text x="-5.08" y="-3.175" size="1.27" layer="27">&gt;VALUE</text>
<rectangle x1="1.016" y1="-0.254" x2="1.524" y2="0.254" layer="51"/>
<rectangle x1="-1.524" y1="-0.254" x2="-1.016" y2="0.254" layer="51"/>
<rectangle x1="-4.064" y1="-0.254" x2="-3.556" y2="0.254" layer="51"/>
<rectangle x1="3.556" y1="-0.254" x2="4.064" y2="0.254" layer="51"/>
</package>
<package name="1X04/90" urn="urn:adsk.eagle:footprint:22259/1" library_version="3">
<description>&lt;b&gt;PIN HEADER&lt;/b&gt;</description>
<wire x1="-5.08" y1="-1.905" x2="-2.54" y2="-1.905" width="0.1524" layer="21"/>
<wire x1="-2.54" y1="-1.905" x2="-2.54" y2="0.635" width="0.1524" layer="21"/>
<wire x1="-2.54" y1="0.635" x2="-5.08" y2="0.635" width="0.1524" layer="21"/>
<wire x1="-5.08" y1="0.635" x2="-5.08" y2="-1.905" width="0.1524" layer="21"/>
<wire x1="-3.81" y1="6.985" x2="-3.81" y2="1.27" width="0.762" layer="21"/>
<wire x1="-2.54" y1="-1.905" x2="0" y2="-1.905" width="0.1524" layer="21"/>
<wire x1="0" y1="-1.905" x2="0" y2="0.635" width="0.1524" layer="21"/>
<wire x1="0" y1="0.635" x2="-2.54" y2="0.635" width="0.1524" layer="21"/>
<wire x1="-1.27" y1="6.985" x2="-1.27" y2="1.27" width="0.762" layer="21"/>
<wire x1="0" y1="-1.905" x2="2.54" y2="-1.905" width="0.1524" layer="21"/>
<wire x1="2.54" y1="-1.905" x2="2.54" y2="0.635" width="0.1524" layer="21"/>
<wire x1="2.54" y1="0.635" x2="0" y2="0.635" width="0.1524" layer="21"/>
<wire x1="1.27" y1="6.985" x2="1.27" y2="1.27" width="0.762" layer="21"/>
<wire x1="2.54" y1="-1.905" x2="5.08" y2="-1.905" width="0.1524" layer="21"/>
<wire x1="5.08" y1="-1.905" x2="5.08" y2="0.635" width="0.1524" layer="21"/>
<wire x1="5.08" y1="0.635" x2="2.54" y2="0.635" width="0.1524" layer="21"/>
<wire x1="3.81" y1="6.985" x2="3.81" y2="1.27" width="0.762" layer="21"/>
<pad name="1" x="-3.81" y="-3.81" drill="1.016" shape="long" rot="R90"/>
<pad name="2" x="-1.27" y="-3.81" drill="1.016" shape="long" rot="R90"/>
<pad name="3" x="1.27" y="-3.81" drill="1.016" shape="long" rot="R90"/>
<pad name="4" x="3.81" y="-3.81" drill="1.016" shape="long" rot="R90"/>
<text x="-5.715" y="-3.81" size="1.27" layer="25" ratio="10" rot="R90">&gt;NAME</text>
<text x="6.985" y="-4.445" size="1.27" layer="27" rot="R90">&gt;VALUE</text>
<rectangle x1="-4.191" y1="0.635" x2="-3.429" y2="1.143" layer="21"/>
<rectangle x1="-1.651" y1="0.635" x2="-0.889" y2="1.143" layer="21"/>
<rectangle x1="0.889" y1="0.635" x2="1.651" y2="1.143" layer="21"/>
<rectangle x1="3.429" y1="0.635" x2="4.191" y2="1.143" layer="21"/>
<rectangle x1="-4.191" y1="-2.921" x2="-3.429" y2="-1.905" layer="21"/>
<rectangle x1="-1.651" y1="-2.921" x2="-0.889" y2="-1.905" layer="21"/>
<rectangle x1="0.889" y1="-2.921" x2="1.651" y2="-1.905" layer="21"/>
<rectangle x1="3.429" y1="-2.921" x2="4.191" y2="-1.905" layer="21"/>
</package>
<package name="2X02" urn="urn:adsk.eagle:footprint:22337/1" library_version="3">
<description>&lt;b&gt;PIN HEADER&lt;/b&gt;</description>
<wire x1="-2.54" y1="-1.905" x2="-1.905" y2="-2.54" width="0.1524" layer="21"/>
<wire x1="-0.635" y1="-2.54" x2="0" y2="-1.905" width="0.1524" layer="21"/>
<wire x1="0" y1="-1.905" x2="0.635" y2="-2.54" width="0.1524" layer="21"/>
<wire x1="1.905" y1="-2.54" x2="2.54" y2="-1.905" width="0.1524" layer="21"/>
<wire x1="-2.54" y1="-1.905" x2="-2.54" y2="1.905" width="0.1524" layer="21"/>
<wire x1="-2.54" y1="1.905" x2="-1.905" y2="2.54" width="0.1524" layer="21"/>
<wire x1="-1.905" y1="2.54" x2="-0.635" y2="2.54" width="0.1524" layer="21"/>
<wire x1="-0.635" y1="2.54" x2="0" y2="1.905" width="0.1524" layer="21"/>
<wire x1="0" y1="1.905" x2="0.635" y2="2.54" width="0.1524" layer="21"/>
<wire x1="0.635" y1="2.54" x2="1.905" y2="2.54" width="0.1524" layer="21"/>
<wire x1="1.905" y1="2.54" x2="2.54" y2="1.905" width="0.1524" layer="21"/>
<wire x1="0" y1="1.905" x2="0" y2="-1.905" width="0.1524" layer="21"/>
<wire x1="2.54" y1="1.905" x2="2.54" y2="-1.905" width="0.1524" layer="21"/>
<wire x1="0.635" y1="-2.54" x2="1.905" y2="-2.54" width="0.1524" layer="21"/>
<wire x1="-1.905" y1="-2.54" x2="-0.635" y2="-2.54" width="0.1524" layer="21"/>
<pad name="1" x="-1.27" y="-1.27" drill="1.016" shape="octagon"/>
<pad name="2" x="-1.27" y="1.27" drill="1.016" shape="octagon"/>
<pad name="3" x="1.27" y="-1.27" drill="1.016" shape="octagon"/>
<pad name="4" x="1.27" y="1.27" drill="1.016" shape="octagon"/>
<text x="-2.54" y="3.175" size="1.27" layer="25" ratio="10">&gt;NAME</text>
<text x="-2.54" y="-4.445" size="1.27" layer="27">&gt;VALUE</text>
<rectangle x1="-1.524" y1="-1.524" x2="-1.016" y2="-1.016" layer="51"/>
<rectangle x1="-1.524" y1="1.016" x2="-1.016" y2="1.524" layer="51"/>
<rectangle x1="1.016" y1="1.016" x2="1.524" y2="1.524" layer="51"/>
<rectangle x1="1.016" y1="-1.524" x2="1.524" y2="-1.016" layer="51"/>
</package>
<package name="2X02/90" urn="urn:adsk.eagle:footprint:22338/1" library_version="3">
<description>&lt;b&gt;PIN HEADER&lt;/b&gt;</description>
<wire x1="-2.54" y1="-1.905" x2="0" y2="-1.905" width="0.1524" layer="21"/>
<wire x1="0" y1="-1.905" x2="0" y2="0.635" width="0.1524" layer="21"/>
<wire x1="0" y1="0.635" x2="-2.54" y2="0.635" width="0.1524" layer="21"/>
<wire x1="-2.54" y1="0.635" x2="-2.54" y2="-1.905" width="0.1524" layer="21"/>
<wire x1="-1.27" y1="6.985" x2="-1.27" y2="1.27" width="0.762" layer="21"/>
<wire x1="0" y1="-1.905" x2="2.54" y2="-1.905" width="0.1524" layer="21"/>
<wire x1="2.54" y1="-1.905" x2="2.54" y2="0.635" width="0.1524" layer="21"/>
<wire x1="2.54" y1="0.635" x2="0" y2="0.635" width="0.1524" layer="21"/>
<wire x1="1.27" y1="6.985" x2="1.27" y2="1.27" width="0.762" layer="21"/>
<pad name="2" x="-1.27" y="-3.81" drill="1.016" shape="octagon"/>
<pad name="4" x="1.27" y="-3.81" drill="1.016" shape="octagon"/>
<pad name="1" x="-1.27" y="-6.35" drill="1.016" shape="octagon"/>
<pad name="3" x="1.27" y="-6.35" drill="1.016" shape="octagon"/>
<text x="-3.175" y="-3.81" size="1.27" layer="25" ratio="10" rot="R90">&gt;NAME</text>
<text x="4.445" y="-3.81" size="1.27" layer="27" rot="R90">&gt;VALUE</text>
<rectangle x1="-1.651" y1="0.635" x2="-0.889" y2="1.143" layer="21"/>
<rectangle x1="0.889" y1="0.635" x2="1.651" y2="1.143" layer="21"/>
<rectangle x1="-1.651" y1="-2.921" x2="-0.889" y2="-1.905" layer="21"/>
<rectangle x1="0.889" y1="-2.921" x2="1.651" y2="-1.905" layer="21"/>
<rectangle x1="-1.651" y1="-5.461" x2="-0.889" y2="-4.699" layer="21"/>
<rectangle x1="-1.651" y1="-4.699" x2="-0.889" y2="-2.921" layer="51"/>
<rectangle x1="0.889" y1="-4.699" x2="1.651" y2="-2.921" layer="51"/>
<rectangle x1="0.889" y1="-5.461" x2="1.651" y2="-4.699" layer="21"/>
</package>
</packages>
<packages3d>
<package3d name="1X01" urn="urn:adsk.eagle:package:22485/2" type="model" library_version="3">
<description>PIN HEADER</description>
<packageinstances>
<packageinstance name="1X01"/>
</packageinstances>
</package3d>
<package3d name="1X06" urn="urn:adsk.eagle:package:22472/2" type="model" library_version="3">
<description>PIN HEADER</description>
<packageinstances>
<packageinstance name="1X06"/>
</packageinstances>
</package3d>
<package3d name="1X06/90" urn="urn:adsk.eagle:package:22475/2" type="model" library_version="3">
<description>PIN HEADER</description>
<packageinstances>
<packageinstance name="1X06/90"/>
</packageinstances>
</package3d>
<package3d name="1X04" urn="urn:adsk.eagle:package:22407/2" type="model" library_version="3">
<description>PIN HEADER</description>
<packageinstances>
<packageinstance name="1X04"/>
</packageinstances>
</package3d>
<package3d name="1X04/90" urn="urn:adsk.eagle:package:22404/2" type="model" library_version="3">
<description>PIN HEADER</description>
<packageinstances>
<packageinstance name="1X04/90"/>
</packageinstances>
</package3d>
<package3d name="2X02" urn="urn:adsk.eagle:package:22455/2" type="model" library_version="3">
<description>PIN HEADER</description>
<packageinstances>
<packageinstance name="2X02"/>
</packageinstances>
</package3d>
<package3d name="2X02/90" urn="urn:adsk.eagle:package:22456/2" type="model" library_version="3">
<description>PIN HEADER</description>
<packageinstances>
<packageinstance name="2X02/90"/>
</packageinstances>
</package3d>
</packages3d>
<symbols>
<symbol name="PINHD1" urn="urn:adsk.eagle:symbol:22381/1" library_version="3">
<wire x1="-6.35" y1="-2.54" x2="1.27" y2="-2.54" width="0.4064" layer="94"/>
<wire x1="1.27" y1="-2.54" x2="1.27" y2="2.54" width="0.4064" layer="94"/>
<wire x1="1.27" y1="2.54" x2="-6.35" y2="2.54" width="0.4064" layer="94"/>
<wire x1="-6.35" y1="2.54" x2="-6.35" y2="-2.54" width="0.4064" layer="94"/>
<text x="-6.35" y="3.175" size="1.778" layer="95">&gt;NAME</text>
<text x="-6.35" y="-5.08" size="1.778" layer="96">&gt;VALUE</text>
<pin name="1" x="-2.54" y="0" visible="pad" length="short" direction="pas" function="dot"/>
</symbol>
<symbol name="PINHD6" urn="urn:adsk.eagle:symbol:22360/1" library_version="3">
<wire x1="-6.35" y1="-7.62" x2="1.27" y2="-7.62" width="0.4064" layer="94"/>
<wire x1="1.27" y1="-7.62" x2="1.27" y2="10.16" width="0.4064" layer="94"/>
<wire x1="1.27" y1="10.16" x2="-6.35" y2="10.16" width="0.4064" layer="94"/>
<wire x1="-6.35" y1="10.16" x2="-6.35" y2="-7.62" width="0.4064" layer="94"/>
<text x="-6.35" y="10.795" size="1.778" layer="95">&gt;NAME</text>
<text x="-6.35" y="-10.16" size="1.778" layer="96">&gt;VALUE</text>
<pin name="1" x="-2.54" y="7.62" visible="pad" length="short" direction="pas" function="dot"/>
<pin name="2" x="-2.54" y="5.08" visible="pad" length="short" direction="pas" function="dot"/>
<pin name="3" x="-2.54" y="2.54" visible="pad" length="short" direction="pas" function="dot"/>
<pin name="4" x="-2.54" y="0" visible="pad" length="short" direction="pas" function="dot"/>
<pin name="5" x="-2.54" y="-2.54" visible="pad" length="short" direction="pas" function="dot"/>
<pin name="6" x="-2.54" y="-5.08" visible="pad" length="short" direction="pas" function="dot"/>
</symbol>
<symbol name="PINHD4" urn="urn:adsk.eagle:symbol:22257/1" library_version="3">
<wire x1="-6.35" y1="-5.08" x2="1.27" y2="-5.08" width="0.4064" layer="94"/>
<wire x1="1.27" y1="-5.08" x2="1.27" y2="7.62" width="0.4064" layer="94"/>
<wire x1="1.27" y1="7.62" x2="-6.35" y2="7.62" width="0.4064" layer="94"/>
<wire x1="-6.35" y1="7.62" x2="-6.35" y2="-5.08" width="0.4064" layer="94"/>
<text x="-6.35" y="8.255" size="1.778" layer="95">&gt;NAME</text>
<text x="-6.35" y="-7.62" size="1.778" layer="96">&gt;VALUE</text>
<pin name="1" x="-2.54" y="5.08" visible="pad" length="short" direction="pas" function="dot"/>
<pin name="2" x="-2.54" y="2.54" visible="pad" length="short" direction="pas" function="dot"/>
<pin name="3" x="-2.54" y="0" visible="pad" length="short" direction="pas" function="dot"/>
<pin name="4" x="-2.54" y="-2.54" visible="pad" length="short" direction="pas" function="dot"/>
</symbol>
<symbol name="PINH2X2" urn="urn:adsk.eagle:symbol:22336/1" library_version="3">
<wire x1="-8.89" y1="-2.54" x2="6.35" y2="-2.54" width="0.4064" layer="94"/>
<wire x1="6.35" y1="-2.54" x2="6.35" y2="5.08" width="0.4064" layer="94"/>
<wire x1="6.35" y1="5.08" x2="-8.89" y2="5.08" width="0.4064" layer="94"/>
<wire x1="-8.89" y1="5.08" x2="-8.89" y2="-2.54" width="0.4064" layer="94"/>
<text x="-8.89" y="5.715" size="1.778" layer="95">&gt;NAME</text>
<text x="-8.89" y="-5.08" size="1.778" layer="96">&gt;VALUE</text>
<pin name="1" x="-5.08" y="2.54" visible="pad" length="short" direction="pas" function="dot"/>
<pin name="2" x="2.54" y="2.54" visible="pad" length="short" direction="pas" function="dot" rot="R180"/>
<pin name="3" x="-5.08" y="0" visible="pad" length="short" direction="pas" function="dot"/>
<pin name="4" x="2.54" y="0" visible="pad" length="short" direction="pas" function="dot" rot="R180"/>
</symbol>
</symbols>
<devicesets>
<deviceset name="PINHD-1X1" urn="urn:adsk.eagle:component:22540/3" prefix="JP" uservalue="yes" library_version="4">
<description>&lt;b&gt;PIN HEADER&lt;/b&gt;</description>
<gates>
<gate name="G$1" symbol="PINHD1" x="0" y="0"/>
</gates>
<devices>
<device name="" package="1X01">
<connects>
<connect gate="G$1" pin="1" pad="1"/>
</connects>
<package3dinstances>
<package3dinstance package3d_urn="urn:adsk.eagle:package:22485/2"/>
</package3dinstances>
<technologies>
<technology name="">
<attribute name="POPULARITY" value="64" constant="no"/>
</technology>
</technologies>
</device>
</devices>
</deviceset>
<deviceset name="PINHD-1X6" urn="urn:adsk.eagle:component:22533/4" prefix="JP" uservalue="yes" library_version="4">
<description>&lt;b&gt;PIN HEADER&lt;/b&gt;</description>
<gates>
<gate name="A" symbol="PINHD6" x="0" y="-2.54"/>
</gates>
<devices>
<device name="" package="1X06">
<connects>
<connect gate="A" pin="1" pad="1"/>
<connect gate="A" pin="2" pad="2"/>
<connect gate="A" pin="3" pad="3"/>
<connect gate="A" pin="4" pad="4"/>
<connect gate="A" pin="5" pad="5"/>
<connect gate="A" pin="6" pad="6"/>
</connects>
<package3dinstances>
<package3dinstance package3d_urn="urn:adsk.eagle:package:22472/2"/>
</package3dinstances>
<technologies>
<technology name="">
<attribute name="POPULARITY" value="79" constant="no"/>
</technology>
</technologies>
</device>
<device name="/90" package="1X06/90">
<connects>
<connect gate="A" pin="1" pad="1"/>
<connect gate="A" pin="2" pad="2"/>
<connect gate="A" pin="3" pad="3"/>
<connect gate="A" pin="4" pad="4"/>
<connect gate="A" pin="5" pad="5"/>
<connect gate="A" pin="6" pad="6"/>
</connects>
<package3dinstances>
<package3dinstance package3d_urn="urn:adsk.eagle:package:22475/2"/>
</package3dinstances>
<technologies>
<technology name="">
<attribute name="POPULARITY" value="10" constant="no"/>
</technology>
</technologies>
</device>
</devices>
</deviceset>
<deviceset name="PINHD-1X4" urn="urn:adsk.eagle:component:22499/5" prefix="JP" uservalue="yes" library_version="4">
<description>&lt;b&gt;PIN HEADER&lt;/b&gt;</description>
<gates>
<gate name="A" symbol="PINHD4" x="0" y="0"/>
</gates>
<devices>
<device name="" package="1X04">
<connects>
<connect gate="A" pin="1" pad="1"/>
<connect gate="A" pin="2" pad="2"/>
<connect gate="A" pin="3" pad="3"/>
<connect gate="A" pin="4" pad="4"/>
</connects>
<package3dinstances>
<package3dinstance package3d_urn="urn:adsk.eagle:package:22407/2"/>
</package3dinstances>
<technologies>
<technology name="">
<attribute name="POPULARITY" value="91" constant="no"/>
</technology>
</technologies>
</device>
<device name="/90" package="1X04/90">
<connects>
<connect gate="A" pin="1" pad="1"/>
<connect gate="A" pin="2" pad="2"/>
<connect gate="A" pin="3" pad="3"/>
<connect gate="A" pin="4" pad="4"/>
</connects>
<package3dinstances>
<package3dinstance package3d_urn="urn:adsk.eagle:package:22404/2"/>
</package3dinstances>
<technologies>
<technology name="">
<attribute name="POPULARITY" value="9" constant="no"/>
</technology>
</technologies>
</device>
</devices>
</deviceset>
<deviceset name="PINHD-2X2" urn="urn:adsk.eagle:component:22526/4" prefix="JP" uservalue="yes" library_version="4">
<description>&lt;b&gt;PIN HEADER&lt;/b&gt;</description>
<gates>
<gate name="A" symbol="PINH2X2" x="0" y="0"/>
</gates>
<devices>
<device name="" package="2X02">
<connects>
<connect gate="A" pin="1" pad="1"/>
<connect gate="A" pin="2" pad="2"/>
<connect gate="A" pin="3" pad="3"/>
<connect gate="A" pin="4" pad="4"/>
</connects>
<package3dinstances>
<package3dinstance package3d_urn="urn:adsk.eagle:package:22455/2"/>
</package3dinstances>
<technologies>
<technology name="">
<attribute name="POPULARITY" value="0" constant="no"/>
</technology>
</technologies>
</device>
<device name="/90" package="2X02/90">
<connects>
<connect gate="A" pin="1" pad="1"/>
<connect gate="A" pin="2" pad="2"/>
<connect gate="A" pin="3" pad="3"/>
<connect gate="A" pin="4" pad="4"/>
</connects>
<package3dinstances>
<package3dinstance package3d_urn="urn:adsk.eagle:package:22456/2"/>
</package3dinstances>
<technologies>
<technology name="">
<attribute name="POPULARITY" value="0" constant="no"/>
</technology>
</technologies>
</device>
</devices>
</deviceset>
</devicesets>
</library>
</libraries>
<attributes>
</attributes>
<variantdefs>
</variantdefs>
<classes>
<class number="0" name="default" width="0.2032" drill="0">
</class>
<class number="1" name="vcc" width="0.254" drill="0">
</class>
<class number="2" name="gnd" width="0.3048" drill="0.508">
<clearance class="2" value="0.1524"/>
</class>
<class number="3" name="power" width="0.508" drill="0.508">
<clearance class="3" value="0.1524"/>
</class>
</classes>
<parts>
<part name="FRAME1" library="SparkFun2" deviceset="FRAME-A3" device=""/>
<part name="FRAME2" library="SparkFun2" deviceset="FRAME-A3" device=""/>
<part name="GND12" library="supply1" library_urn="urn:adsk.eagle:library:371" deviceset="GND" device=""/>
<part name="GND13" library="supply1" library_urn="urn:adsk.eagle:library:371" deviceset="GND" device=""/>
<part name="SUPPLY8" library="supply2" library_urn="urn:adsk.eagle:library:372" deviceset="+5V" device=""/>
<part name="P+5" library="SparkFun" deviceset="VCC" device=""/>
<part name="GND14" library="supply1" library_urn="urn:adsk.eagle:library:371" deviceset="GND" device=""/>
<part name="JP3" library="pinhead" library_urn="urn:adsk.eagle:library:325" deviceset="PINHD-1X1" device="" package3d_urn="urn:adsk.eagle:package:22485/2"/>
<part name="JP6" library="pinhead" library_urn="urn:adsk.eagle:library:325" deviceset="PINHD-1X6" device="" package3d_urn="urn:adsk.eagle:package:22472/2"/>
<part name="JP7" library="pinhead" library_urn="urn:adsk.eagle:library:325" deviceset="PINHD-1X4" device="" package3d_urn="urn:adsk.eagle:package:22407/2"/>
<part name="JP8" library="pinhead" library_urn="urn:adsk.eagle:library:325" deviceset="PINHD-2X2" device="" package3d_urn="urn:adsk.eagle:package:22455/2"/>
</parts>
<sheets>
<sheet>
<plain>
<text x="340.36" y="3.81" size="2.54" layer="94">okie</text>
</plain>
<instances>
<instance part="FRAME1" gate="G$1" x="0" y="0" smashed="yes">
<attribute name="DRAWING_NAME" x="319.151" y="19.431" size="2.54" layer="94" font="vector"/>
<attribute name="LAST_DATE_TIME" x="309.753" y="9.525" size="2.286" layer="94" font="vector"/>
<attribute name="SHEET" x="368.3" y="4.445" size="2.54" layer="94" font="vector"/>
</instance>
</instances>
<busses>
<bus name="+5V">
<segment>
<wire x1="200.66" y1="231.14" x2="200.66" y2="154.94" width="0.762" layer="92"/>
<wire x1="210.82" y1="154.94" x2="254" y2="154.94" width="0.762" layer="92"/>
<wire x1="266.7" y1="154.94" x2="266.7" y2="231.14" width="0.762" layer="92"/>
<wire x1="200.66" y1="154.94" x2="210.82" y2="154.94" width="0.762" layer="92"/>
<wire x1="210.82" y1="154.94" x2="210.82" y2="73.66" width="0.762" layer="92"/>
<wire x1="266.7" y1="154.94" x2="254" y2="154.94" width="0.762" layer="92"/>
<wire x1="254" y1="154.94" x2="254" y2="73.66" width="0.762" layer="92"/>
<wire x1="266.7" y1="154.94" x2="304.8" y2="154.94" width="0.762" layer="92"/>
<wire x1="304.8" y1="154.94" x2="304.8" y2="63.5" width="0.762" layer="92"/>
</segment>
</bus>
</busses>
<nets>
</nets>
</sheet>
<sheet>
<plain>
<text x="340.36" y="3.81" size="2.54" layer="94">okie</text>
<text x="314.96" y="25.4" size="2.54" layer="97">Released under GPL V3 or later.</text>
</plain>
<instances>
<instance part="FRAME2" gate="G$1" x="0" y="0" smashed="yes">
<attribute name="DRAWING_NAME" x="319.151" y="19.431" size="2.54" layer="94" font="vector"/>
<attribute name="LAST_DATE_TIME" x="309.753" y="9.525" size="2.286" layer="94" font="vector"/>
<attribute name="SHEET" x="368.3" y="4.445" size="2.54" layer="94" font="vector"/>
</instance>
<instance part="GND12" gate="1" x="213.36" y="127" smashed="yes">
<attribute name="VALUE" x="210.82" y="124.46" size="1.778" layer="96"/>
</instance>
<instance part="GND13" gate="1" x="226.06" y="45.72" smashed="yes"/>
<instance part="SUPPLY8" gate="+5V" x="220.98" y="127" smashed="yes">
<attribute name="VALUE" x="219.075" y="130.175" size="1.778" layer="96"/>
</instance>
<instance part="P+5" gate="1" x="261.62" y="134.62" smashed="yes">
<attribute name="VALUE" x="260.604" y="138.176" size="1.778" layer="96"/>
</instance>
<instance part="GND14" gate="1" x="302.26" y="124.46" smashed="yes">
<attribute name="VALUE" x="299.72" y="121.92" size="1.778" layer="96"/>
</instance>
<instance part="JP3" gate="G$1" x="238.76" y="139.7" smashed="yes">
<attribute name="NAME" x="232.41" y="142.875" size="1.778" layer="95"/>
<attribute name="VALUE" x="232.41" y="134.62" size="1.778" layer="96"/>
</instance>
<instance part="JP6" gate="A" x="284.48" y="137.16" smashed="yes" rot="R180">
<attribute name="NAME" x="290.83" y="126.365" size="1.778" layer="95" rot="R180"/>
<attribute name="VALUE" x="290.83" y="147.32" size="1.778" layer="96" rot="R180"/>
</instance>
<instance part="JP7" gate="A" x="241.3" y="53.34" smashed="yes">
<attribute name="NAME" x="234.95" y="61.595" size="1.778" layer="95"/>
<attribute name="VALUE" x="234.95" y="45.72" size="1.778" layer="96"/>
</instance>
<instance part="JP8" gate="A" x="238.76" y="134.62" smashed="yes" rot="R180">
<attribute name="NAME" x="247.65" y="128.905" size="1.778" layer="95" rot="R180"/>
<attribute name="VALUE" x="247.65" y="139.7" size="1.778" layer="96" rot="R180"/>
</instance>
</instances>
<busses>
<bus name="B$1">
<segment>
<wire x1="200.66" y1="231.14" x2="200.66" y2="154.94" width="0.762" layer="92"/>
<wire x1="210.82" y1="154.94" x2="254" y2="154.94" width="0.762" layer="92"/>
<wire x1="266.7" y1="154.94" x2="266.7" y2="231.14" width="0.762" layer="92"/>
<wire x1="200.66" y1="154.94" x2="210.82" y2="154.94" width="0.762" layer="92"/>
<wire x1="210.82" y1="154.94" x2="210.82" y2="73.66" width="0.762" layer="92"/>
<wire x1="266.7" y1="154.94" x2="254" y2="154.94" width="0.762" layer="92"/>
<wire x1="254" y1="154.94" x2="254" y2="73.66" width="0.762" layer="92"/>
<wire x1="266.7" y1="154.94" x2="304.8" y2="154.94" width="0.762" layer="92"/>
<wire x1="304.8" y1="154.94" x2="304.8" y2="63.5" width="0.762" layer="92"/>
</segment>
</bus>
</busses>
<nets>
<net name="GND" class="3">
<segment>
<pinref part="GND12" gate="1" pin="GND"/>
<wire x1="236.22" y1="134.62" x2="213.36" y2="134.62" width="0.1524" layer="91"/>
<wire x1="213.36" y1="134.62" x2="213.36" y2="129.54" width="0.1524" layer="91"/>
<pinref part="JP8" gate="A" pin="4"/>
</segment>
<segment>
<wire x1="238.76" y1="50.8" x2="226.06" y2="50.8" width="0.1524" layer="91"/>
<pinref part="GND13" gate="1" pin="GND"/>
<wire x1="226.06" y1="50.8" x2="226.06" y2="48.26" width="0.1524" layer="91"/>
<pinref part="JP7" gate="A" pin="4"/>
</segment>
<segment>
<wire x1="302.26" y1="129.54" x2="287.02" y2="129.54" width="0.1524" layer="91"/>
<pinref part="GND14" gate="1" pin="GND"/>
<wire x1="302.26" y1="127" x2="302.26" y2="129.54" width="0.1524" layer="91"/>
<pinref part="JP6" gate="A" pin="1"/>
</segment>
</net>
<net name="VCC" class="3">
<segment>
<pinref part="P+5" gate="1" pin="VCC"/>
<wire x1="243.84" y1="132.08" x2="261.62" y2="132.08" width="0.1524" layer="91"/>
<wire x1="261.62" y1="132.08" x2="261.62" y2="134.62" width="0.1524" layer="91"/>
<pinref part="JP8" gate="A" pin="1"/>
</segment>
</net>
<net name="GPIO-10" class="0">
<segment>
<wire x1="238.76" y1="55.88" x2="223.52" y2="55.88" width="0.1524" layer="91"/>
<label x="223.52" y="55.88" size="1.778" layer="95"/>
<pinref part="JP7" gate="A" pin="2"/>
</segment>
</net>
<net name="GPIO-9" class="0">
<segment>
<wire x1="223.52" y1="53.34" x2="238.76" y2="53.34" width="0.1524" layer="91"/>
<label x="223.52" y="53.34" size="1.778" layer="95"/>
<pinref part="JP7" gate="A" pin="3"/>
</segment>
</net>
<net name="SCL" class="0">
<segment>
<wire x1="236.22" y1="139.7" x2="226.06" y2="139.7" width="0.1524" layer="91"/>
<label x="226.06" y="139.7" size="1.778" layer="95"/>
<pinref part="JP3" gate="G$1" pin="1"/>
</segment>
</net>
<net name="SDA" class="0">
<segment>
<wire x1="243.84" y1="134.62" x2="256.54" y2="134.62" width="0.1524" layer="91"/>
<label x="248.92" y="134.62" size="1.778" layer="95"/>
<pinref part="JP8" gate="A" pin="3"/>
</segment>
</net>
<net name="RESET" class="0">
<segment>
<wire x1="302.26" y1="142.24" x2="287.02" y2="142.24" width="0.1524" layer="91"/>
<label x="294.64" y="142.24" size="1.778" layer="95"/>
<pinref part="JP6" gate="A" pin="6"/>
</segment>
</net>
<net name="+5V" class="3">
<segment>
<pinref part="SUPPLY8" gate="+5V" pin="+5V"/>
<wire x1="236.22" y1="132.08" x2="228.6" y2="132.08" width="0.1524" layer="91"/>
<wire x1="228.6" y1="132.08" x2="228.6" y2="124.46" width="0.1524" layer="91"/>
<wire x1="228.6" y1="124.46" x2="220.98" y2="124.46" width="0.1524" layer="91"/>
<pinref part="JP8" gate="A" pin="2"/>
</segment>
</net>
<net name="BOOT1" class="0">
<segment>
<wire x1="223.52" y1="58.42" x2="238.76" y2="58.42" width="0.1524" layer="91"/>
<label x="223.52" y="58.42" size="1.778" layer="95"/>
<pinref part="JP7" gate="A" pin="1"/>
</segment>
</net>
<net name="GPIO-2" class="0">
<segment>
<wire x1="302.26" y1="137.16" x2="287.02" y2="137.16" width="0.1524" layer="91"/>
<label x="294.64" y="137.16" size="1.778" layer="95"/>
<pinref part="JP6" gate="A" pin="4"/>
</segment>
</net>
<net name="GPIO-3" class="0">
<segment>
<wire x1="287.02" y1="134.62" x2="302.26" y2="134.62" width="0.1524" layer="91"/>
<label x="294.64" y="134.62" size="1.778" layer="95"/>
<pinref part="JP6" gate="A" pin="3"/>
</segment>
</net>
<net name="GPIO-4" class="0">
<segment>
<wire x1="287.02" y1="132.08" x2="302.26" y2="132.08" width="0.1524" layer="91"/>
<label x="294.64" y="132.08" size="1.778" layer="95"/>
<pinref part="JP6" gate="A" pin="2"/>
</segment>
</net>
<net name="AIN" class="0">
<segment>
<wire x1="287.02" y1="139.7" x2="302.26" y2="139.7" width="0.1524" layer="91"/>
<label x="294.64" y="139.7" size="1.778" layer="95"/>
<pinref part="JP6" gate="A" pin="5"/>
</segment>
</net>
</nets>
</sheet>
</sheets>
</schematic>
</drawing>
<compatibility>
<note version="8.2" severity="warning">
Since Version 8.2, EAGLE supports online libraries. The ids
of those online libraries will not be understood (or retained)
with this version.
</note>
<note version="8.3" severity="warning">
Since Version 8.3, EAGLE supports URNs for individual library
assets (packages, symbols, and devices). The URNs of those assets
will not be understood (or retained) with this version.
</note>
<note version="8.3" severity="warning">
Since Version 8.3, EAGLE supports the association of 3D packages
with devices in libraries, schematics, and board files. Those 3D
packages will not be understood (or retained) with this version.
</note>
</compatibility>
</eagle>
