Dcd file has 6720 atoms and 10001 frames
Calculating RDF for 10 frames
Input file reading is finished.
       0.007614  2273642.044170 |       0.022842        0.000000 |       0.038070        0.000000 |       0.053298        0.000000 |       0.068526        0.000000 |       0.083754        0.000000 |
       0.098982        0.000000 |       0.114210        0.000000 |       0.129438        0.000000 |       0.144666        0.000000 |       0.159894        0.000000 |       0.175122        0.000000 |
       0.190350        0.000000 |       0.205578        0.000000 |       0.220806        0.000000 |       0.236034        0.000000 |       0.251262        0.000000 |       0.266490        0.000000 |
       0.281718        0.000000 |       0.296946        0.000000 |       0.312174        0.000000 |       0.327402        0.000000 |       0.342630        0.000000 |       0.357858        0.000000 |
       0.373086        0.000000 |       0.388314        0.000000 |       0.403543        0.000000 |       0.418771        0.000000 |       0.433999        0.000000 |       0.449227        0.000000 |
       0.464455        0.000000 |       0.479683        0.000000 |       0.494911        0.000000 |       0.510139        0.000000 |       0.525367        0.000000 |       0.540595        0.000000 |
       0.555823        0.000000 |       0.571051        0.000000 |       0.586279        0.000000 |       0.601507        0.000000 |       0.616735        0.000000 |       0.631963        0.000000 |
       0.647191        0.000000 |       0.662419        0.000000 |       0.677647        0.000000 |       0.692875        0.000000 |       0.708103        0.000000 |       0.723331        0.000000 |
       0.738559        0.000000 |       0.753787        0.000000 |       0.769015        0.000000 |       0.784243        0.000000 |       0.799471        0.000000 |       0.814699        0.000000 |
       0.829927        0.000000 |       0.845155        0.000000 |       0.860383        0.000000 |       0.875611        0.000000 |       0.890839        0.000000 |       0.906067        0.000000 |
       0.921295        0.000000 |       0.936523        0.000000 |       0.951751        0.000000 |       0.966979        0.000000 |       0.982207        0.000000 |       0.997435        0.000000 |
       1.012663        0.000000 |       1.027891        0.000000 |       1.043119        0.000000 |       1.058347        0.000000 |       1.073575        0.000000 |       1.088803        0.000000 |
       1.104031        0.000000 |       1.119259        0.000000 |       1.134487        0.000000 |       1.149715        0.000000 |       1.164943        0.000000 |       1.180172        0.000000 |
       1.195400        0.000000 |       1.210628        0.000000 |       1.225856        0.000000 |       1.241084        0.000000 |       1.256312        0.000000 |       1.271540        0.000000 |
       1.286768        0.000000 |       1.301996        0.000000 |       1.317224        0.000000 |       1.332452        0.000000 |       1.347680        0.000000 |       1.362908        0.000000 |
       1.378136        0.000000 |       1.393364        0.000000 |       1.408592        0.015817 |       1.423820        0.049022 |       1.439048        0.272783 |       1.454276        0.976895 |
       1.469504        2.981680 |       1.484732        6.707711 |       1.499960       12.374904 |       1.515188       18.725384 |       1.530416       23.122459 |       1.545644       22.596842 |
       1.560872       18.748816 |       1.576100       12.248321 |       1.591328        6.826485 |       1.606556        2.889834 |       1.621784        1.030123 |       1.637012        0.322052 |
       1.652240        0.049816 |       1.667468        0.011287 |       1.682696        0.001847 |       1.697924        0.000000 |       1.713152        0.000000 |       1.728380        0.000000 |
       1.743608        0.000000 |       1.758836        0.000000 |       1.774064        0.000000 |       1.789292        0.000000 |       1.804520        0.000000 |       1.819748        0.000000 |
       1.834976        0.000000 |       1.850204        0.000000 |       1.865432        0.000000 |       1.880660        0.000000 |       1.895888        0.000000 |       1.911116        0.000000 |
       1.926344        0.000000 |       1.941572        0.000000 |       1.956801        0.000000 |       1.972029        0.000000 |       1.987257        0.000000 |       2.002485        0.000000 |
       2.017713        0.000000 |       2.032941        0.000000 |       2.048169        0.000000 |       2.063397        0.000000 |       2.078625        0.000000 |       2.093853        0.000000 |
       2.109081        0.000000 |       2.124309        0.000000 |       2.139537        0.000000 |       2.154765        0.000000 |       2.169993        0.000000 |       2.185221        0.000000 |
       2.200449        0.000000 |       2.215677        0.000000 |       2.230905        0.000000 |       2.246133        0.000000 |       2.261361        0.000000 |       2.276589        0.003028 |
       2.291817        0.001992 |       2.307045        0.002948 |       2.322273        0.009699 |       2.337501        0.012445 |       2.352729        0.034963 |       2.367957        0.052238 |
       2.383185        0.097620 |       2.398413        0.160034 |       2.413641        0.269354 |       2.428869        0.425579 |       2.444097        0.670716 |       2.459325        0.911498 |
       2.474553        1.211239 |       2.489781        1.650416 |       2.505009        2.033013 |       2.520237        2.559442 |       2.535465        2.962460 |       2.550693        3.342836 |
       2.565921        3.375571 |       2.581149        3.468539 |       2.596377        3.224683 |       2.611605        2.992398 |       2.626833        2.607598 |       2.642061        2.142277 |
       2.657289        1.757050 |       2.672517        1.313798 |       2.687745        0.920997 |       2.702973        0.615690 |       2.718201        0.445989 |       2.733430        0.277221 |
       2.748658        0.151618 |       2.763886        0.087643 |       2.779114        0.065014 |       2.794342        0.051580 |       2.809570        0.040420 |       2.824798        0.044574 |
       2.840026        0.046043 |       2.855254        0.056460 |       2.870482        0.062845 |       2.885710        0.072234 |       2.900938        0.079557 |       2.916166        0.089800 |
       2.931394        0.096782 |       2.946622        0.110243 |       2.961850        0.114478 |       2.977078        0.122753 |       2.992306        0.141952 |       3.007534        0.146879 |
       3.022762        0.174026 |       3.037990        0.179086 |       3.053218        0.177865 |       3.068446        0.187215 |       3.083674        0.187021 |       3.098902        0.199348 |
       3.114130        0.201179 |       3.129358        0.224864 |       3.144586        0.234857 |       3.159814        0.195928 |       3.175042        0.200279 |       3.190270        0.211220 |
       3.205498        0.206672 |       3.220726        0.186570 |       3.235954        0.185318 |       3.251182        0.179132 |       3.266410        0.175995 |       3.281638        0.165137 |
       3.296866        0.157359 |       3.312094        0.149240 |       3.327322        0.152602 |       3.342550        0.140915 |       3.357778        0.134073 |       3.373006        0.142060 |
       3.388234        0.123472 |       3.403462        0.136820 |       3.418690        0.128890 |       3.433918        0.132186 |       3.449146        0.128383 |       3.464374        0.140767 |
       3.479602        0.150338 |       3.494830        0.166589 |       3.510059        0.163873 |       3.525287        0.167090 |       3.540515        0.189440 |       3.555743        0.199404 |
       3.570971        0.220267 |       3.586199        0.226128 |       3.601427        0.256885 |       3.616655        0.285117 |       3.631883        0.294627 |       3.647111        0.314193 |
       3.662339        0.337714 |       3.677567        0.317906 |       3.692795        0.367454 |       3.708023        0.402104 |       3.723251        0.410141 |       3.738479        0.459575 |
       3.753707        0.471445 |       3.768935        0.532818 |       3.784163        0.551185 |       3.799391        0.612360 |       3.814619        0.708128 |       3.829847        0.820900 |
       3.845075        0.899673 |       3.860303        1.035094 |       3.875531        1.123092 |       3.890759        1.257710 |       3.905987        1.326432 |       3.921215        1.420244 |
       3.936443        1.448433 |       3.951671        1.432937 |       3.966899        1.437246 |       3.982127        1.391311 |       3.997355        1.289075 |       4.012583        1.212387 |
       4.027811        1.133274 |       4.043039        1.044117 |       4.058267        0.933079 |       4.073495        0.908779 |       4.088723        0.886065 |       4.103951        0.854347 |
       4.119179        0.791012 |       4.134407        0.809676 |       4.149635        0.824096 |       4.164863        0.817478 |       4.180091        0.852244 |       4.195319        0.826752 |
       4.210547        0.882149 |       4.225775        0.871116 |       4.241003        0.886682 |       4.256231        0.897962 |       4.271459        0.886124 |       4.286688        0.937907 |
       4.301916        0.938910 |       4.317144        0.948575 |       4.332372        0.958081 |       4.347600        0.954426 |       4.362828        1.019771 |       4.378056        1.007505 |
       4.393284        1.023567 |       4.408512        1.049073 |       4.423740        1.085430 |       4.438968        1.053840 |       4.454196        1.092783 |       4.469424        1.089539 |
       4.484652        1.106859 |       4.499880        1.151817 |       4.515108        1.142009 |       4.530336        1.159829 |       4.545564        1.210042 |       4.560792        1.164507 |
       4.576020        1.148527 |       4.591248        1.174915 |       4.606476        1.205120 |       4.621704        1.184214 |       4.636932        1.169394 |       4.652160        1.174559 |
       4.667388        1.204124 |       4.682616        1.209663 |       4.697844        1.192354 |       4.713072        1.161350 |       4.728300        1.206756 |       4.743528        1.184143 |
       4.758756        1.147474 |       4.773984        1.200065 |       4.789212        1.186516 |       4.804440        1.148869 |       4.819668        1.128560 |       4.834896        1.165766 |
       4.850124        1.172466 |       4.865352        1.182594 |       4.880580        1.166662 |       4.895808        1.182547 |       4.911036        1.155056 |       4.926264        1.177885 |
       4.941492        1.188844 |       4.956720        1.213484 |       4.971948        1.258325 |       4.987176        1.237193 |       5.002404        1.280046 |       5.017632        1.306568 |
       5.032860        1.301358 |       5.048088        1.322870 |       5.063317        1.359810 |       5.078545        1.379045 |       5.093773        1.377061 |       5.109001        1.376680 |
       5.124229        1.407951 |       5.139457        1.379026 |       5.154685        1.386835 |       5.169913        1.398051 |       5.185141        1.372537 |       5.200369        1.378049 |
       5.215597        1.312906 |       5.230825        1.336624 |       5.246053        1.291244 |       5.261281        1.264129 |       5.276509        1.246134 |       5.291737        1.228512 |
       5.306965        1.227415 |       5.322193        1.242006 |       5.337421        1.210693 |       5.352649        1.197607 |       5.367877        1.186102 |       5.383105        1.216224 |
       5.398333        1.213141 |       5.413561        1.178662 |       5.428789        1.205424 |       5.444017        1.200808 |       5.459245        1.171654 |       5.474473        1.180328 |
       5.489701        1.185071 |       5.504929        1.174726 |       5.520157        1.172545 |       5.535385        1.187270 |       5.550613        1.175672 |       5.565841        1.175157 |
       5.581069        1.166066 |       5.596297        1.151879 |       5.611525        1.157429 |       5.626753        1.159268 |       5.641981        1.156305 |       5.657209        1.135216 |
       5.672437        1.162616 |       5.687665        1.140392 |       5.702893        1.149588 |       5.718121        1.142353 |       5.733349        1.116880 |       5.748577        1.140094 |
       5.763805        1.125261 |       5.779033        1.121062 |       5.794261        1.099286 |       5.809489        1.114297 |       5.824717        1.096916 |       5.839946        1.116202 |
       5.855174        1.121541 |       5.870402        1.103739 |       5.885630        1.091391 |       5.900858        1.092826 |       5.916086        1.077045 |       5.931314        1.093080 |
       5.946542        1.081276 |       5.961770        1.080027 |       5.976998        1.069406 |       5.992226        1.090344 |       6.007454        1.055112 |       6.022682        1.033921 |
       6.037910        1.090694 |       6.053138        1.057804 |       6.068366        1.058325 |       6.083594        1.060666 |       6.098822        1.071406 |       6.114050        1.089443 |
       6.129278        1.019574 |       6.144506        1.037108 |       6.159734        1.037915 |       6.174962        1.042130 |       6.190190        1.033187 |       6.205418        1.037630 |
       6.220646        1.011335 |       6.235874        1.028326 |       6.251102        1.043267 |       6.266330        1.029011 |       6.281558        1.036754 |       6.296786        1.016971 |
       6.312014        1.003273 |       6.327242        1.027455 |       6.342470        1.015896 |       6.357698        1.025528 |       6.372926        1.031451 |       6.388154        1.034358 |
       6.403382        1.053809 |       6.418610        1.047164 |       6.433838        1.039054 |       6.449066        1.033398 |       6.464294        1.029412 |       6.479522        1.031555 |
       6.494750        1.031932 |       6.509978        1.026616 |       6.525206        1.020233 |       6.540434        1.017077 |       6.555662        0.998726 |       6.570890        0.990953 |
       6.586118        0.972268 |       6.601346        0.965387 |       6.616575        0.990100 |       6.631803        0.967006 |       6.647031        0.971459 |       6.662259        0.952646 |
       6.677487        0.956869 |       6.692715        0.941310 |       6.707943        0.947619 |       6.723171        0.957680 |       6.738399        0.950131 |       6.753627        0.956057 |
       6.768855        0.939089 |       6.784083        0.935446 |       6.799311        0.956264 |       6.814539        0.940506 |       6.829767        0.943382 |       6.844995        0.924565 |
       6.860223        0.948027 |       6.875451        0.930665 |       6.890679        0.965112 |       6.905907        0.932345 |       6.921135        0.933379 |       6.936363        0.917870 |
       6.951591        0.959205 |       6.966819        0.931632 |       6.982047        0.951177 |       6.997275        0.925249 |       7.012503        0.933041 |       7.027731        0.916823 |
       7.042959        0.936061 |       7.058187        0.929926 |       7.073415        0.911918 |       7.088643        0.910086 |       7.103871        0.916035 |       7.119099        0.892408 |
       7.134327        0.918404 |       7.149555        0.913575 |       7.164783        0.915096 |       7.180011        0.909697 |       7.195239        0.919288 |       7.210467        0.908366 |
       7.225695        0.906946 |       7.240923        0.909819 |       7.256151        0.892395 |       7.271379        0.900532 |       7.286607        0.900910 |       7.301835        0.881557 |
       7.317063        0.901241 |       7.332291        0.921629 |       7.347519        0.911516 |       7.362747        0.898872 |       7.377975        0.885941 |       7.393204        0.904305 |
       7.408432        0.904212 |       7.423660        0.890826 |       7.438888        0.898525 |       7.454116        0.908131 |       7.469344        0.893931 |       7.484572        0.902622 |
       7.499800        0.900913 |       7.515028        0.891802 |       7.530256        0.907200 |       7.545484        0.905380 |       7.560712        0.916834 |       7.575940        0.909780 |
       7.591168        0.902775 |       7.606396        0.915618 |       7.621624        0.921957 |       7.636852        0.930392 |       7.652080        0.914901 |       7.667308        0.928264 |
       7.682536        0.945414 |       7.697764        0.933115 |       7.712992        0.928379 |       7.728220        0.930241 |       7.743448        0.926761 |       7.758676        0.913742 |
       7.773904        0.920898 |       7.789132        0.918335 |       7.804360        0.918705 |       7.819588        0.926679 |       7.834816        0.918820 |       7.850044        0.924425 |
       7.865272        0.923470 |       7.880500        0.929338 |       7.895728        0.920387 |       7.910956        0.910245 |       7.926184        0.929063 |       7.941412        0.915551 |
       7.956640        0.929648 |       7.971868        0.909968 |       7.987096        0.924868 |       8.002324        0.938585 |       8.017552        0.938848 |       8.032780        0.928320 |
       8.048008        0.933774 |       8.063236        0.943364 |       8.078464        0.940132 |       8.093692        0.930210 |       8.108920        0.943742 |       8.124148        0.946944 |
       8.139376        0.948457 |       8.154604        0.950266 |       8.169833        0.951507 |       8.185061        0.940788 |       8.200289        0.951920 |       8.215517        0.951572 |
       8.230745        0.951606 |       8.245973        0.948094 |       8.261201        0.941690 |       8.276429        0.971444 |       8.291657        0.972215 |       8.306885        0.966304 |
       8.322113        0.961790 |       8.337341        0.953990 |       8.352569        0.967459 |       8.367797        0.956247 |       8.383025        0.973691 |       8.398253        0.967715 |
       8.413481        0.967023 |       8.428709        0.989375 |       8.443937        0.959033 |       8.459165        0.992278 |       8.474393        0.964024 |       8.489621        0.973777 |
       8.504849        0.973258 |       8.520077        0.971151 |       8.535305        0.984130 |       8.550533        0.978553 |       8.565761        1.003592 |       8.580989        0.997689 |
       8.596217        0.989557 |       8.611445        0.987965 |       8.626673        0.995936 |       8.641901        0.992990 |       8.657129        0.997037 |       8.672357        0.998128 |
       8.687585        0.990266 |       8.702813        0.995851 |       8.718041        1.008341 |       8.733269        1.012234 |       8.748497        1.002084 |       8.763725        0.998809 |
       8.778953        1.012314 |       8.794181        1.002927 |       8.809409        1.005259 |       8.824637        1.003002 |       8.839865        1.024449 |       8.855093        1.011590 |
       8.870321        1.014435 |       8.885549        1.016724 |       8.900777        1.013380 |       8.916005        1.026437 |       8.931233        1.009366 |       8.946462        1.020963 |
       8.961690        1.020232 |       8.976918        1.023913 |       8.992146        1.039919 |       9.007374        1.025962 |       9.022602        1.034131 |       9.037830        1.018739 |
       9.053058        1.015315 |       9.068286        1.030735 |       9.083514        1.036284 |       9.098742        1.027321 |       9.113970        1.046497 |       9.129198        1.027758 |
       9.144426        1.024463 |       9.159654        1.046496 |       9.174882        1.037246 |       9.190110        1.038394 |       9.205338        1.022123 |       9.220566        1.029331 |
       9.235794        1.042864 |       9.251022        1.038639 |       9.266250        1.034497 |       9.281478        1.039484 |       9.296706        1.039592 |       9.311934        1.034023 |
       9.327162        1.033896 |       9.342390        1.042214 |       9.357618        1.044858 |       9.372846        1.058732 |       9.388074        1.044380 |       9.403302        1.034020 |
       9.418530        1.048663 |       9.433758        1.042224 |       9.448986        1.044023 |       9.464214        1.045337 |       9.479442        1.035812 |       9.494670        1.040150 |
       9.509898        1.019818 |       9.525126        1.053341 |       9.540354        1.042281 |       9.555582        1.046408 |       9.570810        1.030519 |       9.586038        1.042047 |
       9.601266        1.037609 |       9.616494        1.052538 |       9.631722        1.045548 |       9.646950        1.042980 |       9.662178        1.046811 |       9.677406        1.040894 |
       9.692634        1.048148 |       9.707862        1.043808 |       9.723091        1.038328 |       9.738319        1.047713 |       9.753547        1.039606 |       9.768775        1.038176 |
       9.784003        1.041504 |       9.799231        1.045187 |       9.814459        1.041512 |       9.829687        1.038558 |       9.844915        1.039179 |       9.860143        1.050767 |
       9.875371        1.030634 |       9.890599        1.037943 |       9.905827        1.042323 |       9.921055        1.042102 |       9.936283        1.050619 |       9.951511        1.033462 |
       9.966739        1.033624 |       9.981967        1.038819 |       9.997195        1.027440 |      10.012423        1.027865 |      10.027651        1.029531 |      10.042879        1.022004 |
      10.058107        1.031165 |      10.073335        1.037380 |      10.088563        1.038413 |      10.103791        1.043329 |      10.119019        1.036105 |      10.134247        1.021483 |
      10.149475        1.020502 |      10.164703        1.041443 |      10.179931        1.031617 |      10.195159        1.033720 |      10.210387        1.031643 |      10.225615        1.040778 |
      10.240843        1.041974 |      10.256071        1.027644 |      10.271299        1.028863 |      10.286527        1.023842 |      10.301755        1.016923 |      10.316983        1.024145 |
      10.332211        1.021324 |      10.347439        1.015194 |      10.362667        1.021516 |      10.377895        1.025368 |      10.393123        1.039653 |      10.408351        1.026860 |
      10.423579        1.015341 |      10.438807        1.021453 |      10.454035        0.999813 |      10.469263        1.005449 |      10.484491        1.018804 |      10.499720        1.019599 |
      10.514948        1.017736 |      10.530176        1.017295 |      10.545404        1.017040 |      10.560632        1.004682 |      10.575860        1.004924 |      10.591088        1.010430 |
      10.606316        1.014226 |      10.621544        1.026527 |      10.636772        1.019568 |      10.652000        1.015502 |      10.667228        1.014995 |      10.682456        1.006832 |
      10.697684        1.011738 |      10.712912        1.016520 |      10.728140        1.009183 |      10.743368        1.005010 |      10.758596        1.005375 |      10.773824        1.006320 |
      10.789052        1.013322 |      10.804280        1.009930 |      10.819508        1.008296 |      10.834736        0.992809 |      10.849964        1.006509 |      10.865192        1.002006 |
      10.880420        1.010249 |      10.895648        1.016899 |      10.910876        1.003738 |      10.926104        1.000022 |      10.941332        0.997109 |      10.956560        1.015820 |
      10.971788        0.992798 |      10.987016        1.002830 |      11.002244        0.982988 |      11.017472        0.998629 |      11.032700        0.993983 |      11.047928        0.996130 |
      11.063156        1.001553 |      11.078384        0.994582 |      11.093612        0.990791 |      11.108840        1.011939 |      11.124068        0.992389 |      11.139296        0.989425 |
      11.154524        0.988659 |      11.169752        0.992673 |      11.184980        0.992648 |      11.200208        0.994037 |      11.215436        0.995913 |      11.230664        0.991514 |
      11.245892        0.988707 |      11.261120        0.997336 |      11.276349        0.996660 |      11.291577        0.993194 |      11.306805        0.987206 |      11.322033        0.994386 |
      11.337261        0.999408 |      11.352489        0.984634 |      11.367717        0.988231 |      11.382945        0.988132 |      11.398173        1.000108 |      11.413401        0.986720 |
      11.428629        0.983892 |      11.443857        0.984910 |      11.459085        0.982931 |      11.474313        0.986641 |      11.489541        0.980461 |      11.504769        0.968936 |
      11.519997        0.973432 |      11.535225        0.978253 |      11.550453        0.980106 |      11.565681        0.979677 |      11.580909        0.989192 |      11.596137        0.983523 |
      11.611365        0.984165 |      11.626593        0.986580 |      11.641821        0.975048 |      11.657049        0.971116 |      11.672277        0.979756 |      11.687505        0.977166 |
      11.702733        0.997960 |      11.717961        0.985845 |      11.733189        0.977474 |      11.748417        0.978997 |      11.763645        0.985800 |      11.778873        0.980538 |
      11.794101        0.986055 |      11.809329        0.978488 |      11.824557        0.979635 |      11.839785        0.990661 |      11.855013        0.967723 |      11.870241        0.987626 |
      11.885469        0.974989 |      11.900697        0.984461 |      11.915925        0.976494 |      11.931153        0.971652 |      11.946381        0.976983 |      11.961609        0.985866 |
      11.976837        0.976214 |      11.992065        0.976609 |      12.007293        0.971812 |      12.022521        0.982596 |      12.037749        0.974517 |      12.052978        0.979185 |
      12.068206        0.977757 |      12.083434        0.986757 |      12.098662        0.972054 |      12.113890        0.993208 |      12.129118        0.998182 |      12.144346        0.990041 |
      12.159574        0.983070 |      12.174802        0.979413 |      12.190030        0.981015 |      12.205258        0.980816 |      12.220486        0.989581 |      12.235714        0.978560 |
      12.250942        0.981112 |      12.266170        0.993313 |      12.281398        0.974518 |      12.296626        0.984698 |      12.311854        0.986853 |      12.327082        0.983314 |
      12.342310        0.984083 |      12.357538        0.979056 |      12.372766        0.977399 |      12.387994        0.992448 |      12.403222        0.982261 |      12.418450        0.981787 |
      12.433678        0.983105 |      12.448906        0.989612 |      12.464134        0.990494 |      12.479362        0.980085 |      12.494590        0.996661 |      12.509818        0.985045 |
      12.525046        0.986719 |      12.540274        0.990078 |      12.555502        0.990133 |      12.570730        1.001571 |      12.585958        0.987559 |      12.601186        0.984581 |
      12.616414        0.995218 |      12.631642        0.992296 |      12.646870        0.991052 |      12.662098        0.980677 |      12.677326        1.004294 |      12.692554        0.991009 |
      12.707782        0.992101 |      12.723010        0.991408 |      12.738238        0.983333 |      12.753466        0.998480 |      12.768694        0.985898 |      12.783922        0.987423 |
      12.799150        0.999890 |      12.814378        0.995572 |      12.829607        0.994036 |      12.844835        0.993298 |      12.860063        0.995881 |      12.875291        0.997597 |
      12.890519        0.983185 |      12.905747        0.984540 |      12.920975        0.982503 |      12.936203        1.002414 |      12.951431        0.998406 |      12.966659        0.999609 |
      12.981887        0.984912 |      12.997115        1.000750 |      13.012343        1.000201 |      13.027571        0.998851 |      13.042799        0.993752 |      13.058027        1.003491 |
      13.073255        1.000298 |      13.088483        0.994094 |      13.103711        0.995654 |      13.118939        1.004588 |      13.134167        1.005383 |      13.149395        1.003994 |
      13.164623        0.996270 |      13.179851        1.000684 |      13.195079        1.001590 |      13.210307        1.004407 |      13.225535        1.002933 |      13.240763        0.988753 |
      13.255991        1.001693 |      13.271219        0.993724 |      13.286447        1.014529 |      13.301675        1.003043 |      13.316903        0.995058 |      13.332131        1.000202 |
      13.347359        1.001503 |      13.362587        1.001213 |      13.377815        1.002735 |      13.393043        0.999260 |      13.408271        1.003247 |      13.423499        0.995718 |
      13.438727        1.023583 |      13.453955        0.999682 |      13.469183        0.999181 |      13.484411        1.006562 |      13.499639        1.010579 |      13.514867        1.000971 |
      13.530095        1.004405 |      13.545323        1.002633 |      13.560551        1.008859 |      13.575779        0.999558 |      13.591007        1.004597 |      13.606236        1.012465 |
      13.621464        1.006960 |      13.636692        1.010563 |      13.651920        1.014428 |      13.667148        1.005756 |      13.682376        1.007710 |      13.697604        1.015367 |
      13.712832        0.998899 |      13.728060        1.002041 |      13.743288        1.005609 |      13.758516        1.008358 |      13.773744        1.011478 |      13.788972        1.005449 |
      13.804200        1.011137 |      13.819428        1.001844 |      13.834656        1.012265 |      13.849884        1.011240 |      13.865112        1.003116 |      13.880340        1.007785 |
      13.895568        0.995527 |      13.910796        1.005810 |      13.926024        1.006497 |      13.941252        1.009251 |      13.956480        1.006056 |      13.971708        1.017021 |
      13.986936        1.008792 |      14.002164        1.002810 |      14.017392        1.010722 |      14.032620        1.010947 |      14.047848        1.017927 |      14.063076        1.003901 |
      14.078304        1.008540 |      14.093532        1.000357 |      14.108760        1.004400 |      14.123988        1.007637 |      14.139216        1.011904 |      14.154444        1.009362 |
      14.169672        1.008965 |      14.184900        1.000691 |      14.200128        1.009052 |      14.215356        1.007745 |      14.230584        1.013829 |      14.245812        1.006663 |
      14.261040        1.013181 |      14.276268        1.003091 |      14.291496        1.001057 |      14.306724        1.008867 |      14.321952        1.003230 |      14.337180        1.012805 |
      14.352408        1.008422 |      14.367636        1.002308 |      14.382865        1.007772 |      14.398093        1.005666 |      14.413321        1.002737 |      14.428549        1.004742 |
      14.443777        1.009870 |      14.459005        1.003691 |      14.474233        1.002504 |      14.489461        1.007075 |      14.504689        1.008715 |      14.519917        1.010521 |
      14.535145        1.008231 |      14.550373        1.008370 |      14.565601        1.005498 |      14.580829        1.004752 |      14.596057        1.011667 |      14.611285        0.998363 |
      14.626513        1.010882 |      14.641741        1.012269 |      14.656969        1.005224 |      14.672197        1.007318 |      14.687425        1.008624 |      14.702653        1.011714 |
      14.717881        1.005976 |      14.733109        1.001632 |      14.748337        1.004711 |      14.763565        1.002591 |      14.778793        1.003304 |      14.794021        1.005088 |
      14.809249        1.001996 |      14.824477        0.995416 |      14.839705        1.004894 |      14.854933        1.006153 |      14.870161        1.009865 |      14.885389        1.013867 |
      14.900617        1.010665 |      14.915845        1.005993 |      14.931073        1.003285 |      14.946301        1.000820 |      14.961529        0.999999 |      14.976757        1.002490 |
      14.991985        0.999873 |      15.007213        0.999657 |      15.022441        1.002892 |      15.037669        1.001718 |      15.052897        0.999600 |      15.068125        1.005390 |
      15.083353        1.003269 |      15.098581        1.004321 |      15.113809        1.007931 |      15.129037        1.007708 |      15.144265        1.005272 |      15.159494        0.998929 |
      15.174722        1.002718 |      15.189950        0.996197 |      15.205178        1.006555 |      15.220406        1.002420 |      15.235634        1.008799 |      15.250862        0.999342 |
      15.266090        1.000177 |      15.281318        1.006808 |      15.296546        1.002636 |      15.311774        1.005440 |      15.327002        1.005046 |      15.342230        0.994630 |
      15.357458        1.006896 |      15.372686        1.001317 |      15.387914        1.000352 |      15.403142        1.006223 |      15.418370        1.003621 |      15.433598        0.999379 |
      15.448826        1.003437 |      15.464054        1.004983 |      15.479282        1.002112 |      15.494510        0.993869 |      15.509738        1.007900 |      15.524966        1.002299 |
      15.540194        0.999838 |      15.555422        1.003804 |      15.570650        1.002467 |      15.585878        0.997689 |      15.601106        1.000856 |      15.616334        0.999270 |
      15.631562        0.995719 |      15.646790        0.999059 |      15.662018        1.001040 |      15.677246        0.995755 |      15.692474        0.992995 |      15.707702        0.990329 |
      15.722930        1.002355 |      15.738158        0.993933 |      15.753386        1.003921 |      15.768614        1.003308 |      15.783842        1.000659 |      15.799070        0.990642 |
      15.814298        0.995261 |      15.829526        1.000882 |      15.844754        0.996147 |      15.859982        1.003135 |      15.875210        0.999966 |      15.890438        0.997574 |
      15.905666        1.008132 |      15.920894        0.997475 |      15.936123        1.007619 |      15.951351        0.991799 |      15.966579        1.004763 |      15.981807        0.990112 |
      15.997035        1.003087 |      16.012263        0.999303 |      16.027491        0.988324 |      16.042719        0.996407 |      16.057947        0.988229 |      16.073175        0.993930 |
      16.088403        0.995404 |      16.103631        0.998645 |      16.118859        1.004007 |      16.134087        0.994678 |      16.149315        0.989233 |      16.164543        0.996978 |
      16.179771        0.998579 |      16.194999        0.990041 |      16.210227        0.998632 |      16.225455        0.995467 |      16.240683        0.995069 |      16.255911        0.993938 |
      16.271139        0.991545 |      16.286367        0.998999 |      16.301595        1.001484 |      16.316823        0.988161 |      16.332051        0.995281 |      16.347279        0.995091 |
      16.362507        0.992361 |      16.377735        0.992252 |      16.392963        0.988035 |      16.408191        1.000539 |      16.423419        0.998491 |      16.438647        0.993080 |
      16.453875        0.996208 |      16.469103        0.997626 |      16.484331        0.992839 |      16.499559        0.994888 |      16.514787        0.986361 |      16.530015        0.997887 |
      16.545243        0.998764 |      16.560471        1.001200 |      16.575699        0.994202 |      16.590927        0.999865 |      16.606155        1.004538 |      16.621383        0.994557 |
      16.636611        1.006949 |      16.651839        1.000939 |      16.667067        0.994949 |      16.682295        0.996254 |      16.697523        0.996389 |      16.712752        0.996278 |
      16.727980        0.996072 |      16.743208        0.995959 |      16.758436        0.994522 |      16.773664        0.991472 |      16.788892        1.000734 |      16.804120        1.003515 |
      16.819348        0.992454 |      16.834576        0.997322 |      16.849804        0.996165 |      16.865032        0.994900 |      16.880260        0.996043 |      16.895488        1.001577 |
      16.910716        0.998896 |      16.925944        1.008493 |      16.941172        1.001158 |      16.956400        0.997542 |      16.971628        0.998985 |      16.986856        1.001182 |
      17.002084        0.997707 |      17.017312        0.993592 |      17.032540        0.996901 |      17.047768        0.999206 |      17.062996        0.993668 |      17.078224        0.994641 |
      17.093452        0.999475 |      17.108680        1.000502 |      17.123908        1.001453 |      17.139136        0.990611 |      17.154364        0.999606 |      17.169592        0.996450 |
      17.184820        1.002691 |      17.200048        0.993685 |      17.215276        0.996516 |      17.230504        1.000428 |      17.245732        0.998152 |      17.260960        0.998165 |
      17.276188        0.998825 |      17.291416        0.994162 |      17.306644        0.996814 |      17.321872        0.995219 |      17.337100        1.009377 |      17.352328        1.000675 |
      17.367556        0.998782 |      17.382784        0.990905 |      17.398012        1.004032 |      17.413240        0.999689 |      17.428468        0.999786 |      17.443696        0.996597 |
      17.458924        0.996798 |      17.474152        0.999653 |      17.489381        0.999520 |      17.504609        0.994026 |      17.519837        0.994020 |      17.535065        0.991750 |
      17.550293        0.997179 |      17.565521        1.003622 |      17.580749        0.997315 |      17.595977        0.999813 |      17.611205        1.001390 |      17.626433        1.004963 |
      17.641661        0.994087 |      17.656889        0.997725 |      17.672117        0.989625 |      17.687345        1.005861 |      17.702573        0.993616 |      17.717801        0.997124 |
      17.733029        0.998224 |      17.748257        0.998886 |      17.763485        0.999942 |      17.778713        0.992025 |      17.793941        1.002684 |      17.809169        1.001679 |
      17.824397        0.994124 |      17.839625        0.998065 |      17.854853        0.999267 |      17.870081        1.002118 |      17.885309        0.994297 |      17.900537        0.998222 |
      17.915765        1.002278 |      17.930993        1.004920 |      17.946221        1.002988 |      17.961449        0.998531 |      17.976677        0.999786 |      17.991905        0.999468 |
      18.007133        1.006731 |      18.022361        1.003066 |      18.037589        1.009009 |      18.052817        1.007163 |      18.068045        1.004072 |      18.083273        0.998623 |
      18.098501        1.002836 |      18.113729        1.004992 |      18.128957        1.005151 |      18.144185        0.998237 |      18.159413        0.994327 |      18.174641        0.991965 |
      18.189869        0.991822 |      18.205097        0.998133 |      18.220325        1.000026 |      18.235553        1.001188 |      18.250781        0.999832 |      18.266009        1.002963 |
      18.281238        1.001997 |      18.296466        1.002627 |      18.311694        1.003783 |      18.326922        0.999873 |      18.342150        1.007744 |      18.357378        0.999073 |
      18.372606        0.997758 |      18.387834        1.003501 |      18.403062        0.999818 |      18.418290        1.009513 |      18.433518        1.002582 |      18.448746        1.000020 |
      18.463974        0.999983 |      18.479202        1.004508 |      18.494430        1.000866 |      18.509658        1.002182 |      18.524886        1.000703 |      18.540114        1.002103 |
      18.555342        0.995278 |      18.570570        1.005477 |      18.585798        0.997546 |      18.601026        1.004424 |      18.616254        0.999869 |      18.631482        1.002982 |
      18.646710        0.994695 |      18.661938        0.996902 |      18.677166        1.005953 |      18.692394        1.001141 |      18.707622        1.007583 |      18.722850        1.008928 |
      18.738078        1.007423 |      18.753306        1.009328 |      18.768534        0.999390 |      18.783762        0.997533 |      18.798990        0.998567 |      18.814218        1.003379 |
      18.829446        0.998850 |      18.844674        1.002657 |      18.859902        1.005288 |      18.875130        1.004372 |      18.890358        1.004189 |      18.905586        0.996470 |
      18.920814        1.001368 |      18.936042        1.000809 |      18.951270        1.000046 |      18.966498        0.995256 |      18.981726        1.000251 |      18.996954        1.005851 |
      19.012182        1.002142 |      19.027410        1.000466 |      19.042638        1.003598 |      19.057867        1.000612 |      19.073095        1.003444 |      19.088323        1.003207 |
      19.103551        0.997911 |      19.118779        0.996393 |      19.134007        0.999137 |      19.149235        1.001157 |      19.164463        1.001091 |      19.179691        1.008985 |
      19.194919        1.003637 |      19.210147        1.000800 |      19.225375        0.999186 |      19.240603        0.995161 |      19.255831        1.002884 |      19.271059        1.006652 |
      19.286287        1.005175 |      19.301515        1.005668 |      19.316743        0.999429 |      19.331971        1.002208 |      19.347199        1.002573 |      19.362427        1.004233 |
      19.377655        1.003422 |      19.392883        0.999955 |      19.408111        1.002275 |      19.423339        1.003421 |      19.438567        1.001586 |      19.453795        1.006708 |
      19.469023        0.999214 |      19.484251        0.998714 |      19.499479        1.002891 |      19.514707        0.996272 |      19.529935        0.997873 |      19.545163        1.004027 |
      19.560391        1.002984 |      19.575619        1.003267 |      19.590847        1.003112 |      19.606075        0.999254 |      19.621303        0.992405 |      19.636531        1.005205 |
      19.651759        0.999625 |      19.666987        0.999106 |      19.682215        0.999221 |      19.697443        1.008758 |      19.712671        0.997670 |      19.727899        1.000243 |
      19.743127        0.999935 |      19.758355        1.000927 |      19.773583        0.999372 |      19.788811        0.996780 |      19.804039        0.999702 |      19.819267        0.999524 |
      19.834496        1.002032 |      19.849724        1.008234 |      19.864952        0.998975 |      19.880180        0.998319 |      19.895408        1.000465 |      19.910636        1.002972 |
      19.925864        1.000939 |      19.941092        1.007316 |      19.956320        0.996415 |      19.971548        1.001899 |      19.986776        1.002730 |      20.002004        1.002341 |
      20.017232        1.001208 |      20.032460        1.004861 |      20.047688        1.000017 |      20.062916        0.999032 |      20.078144        0.998205 |      20.093372        0.997586 |
      20.108600        1.004536 |      20.123828        1.009022 |      20.139056        0.998134 |      20.154284        0.997283 |      20.169512        0.995032 |      20.184740        0.998024 |
      20.199968        1.003865 |      20.215196        0.998808 |      20.230424        1.000551 |      20.245652        0.999123 |      20.260880        1.000603 |      20.276108        1.003134 |
      20.291336        1.000181 |      20.306564        1.006228 |      20.321792        1.000047 |      20.337020        0.995490 |      20.352248        1.000213 |      20.367476        0.996335 |
      20.382704        0.999291 |      20.397932        0.997020 |      20.413160        0.994805 |      20.428388        0.999715 |      20.443616        1.004246 |      20.458844        0.993117 |
      20.474072        1.003182 |      20.489300        0.995200 |      20.504528        1.001996 |      20.519756        0.999938 |      20.534984        1.001271 |      20.550212        0.993471 |
      20.565440        1.001436 |      20.580668        0.997991 |      20.595896        1.000894 |      20.611125        0.998701 |      20.626353        0.999329 |      20.641581        0.997229 |
      20.656809        1.003102 |      20.672037        0.996631 |      20.687265        0.991754 |      20.702493        1.003183 |      20.717721        0.998443 |      20.732949        1.003244 |
      20.748177        0.996948 |      20.763405        0.997379 |      20.778633        0.996814 |      20.793861        0.993044 |      20.809089        0.996725 |      20.824317        0.995521 |
      20.839545        1.000137 |      20.854773        1.003740 |      20.870001        1.001819 |      20.885229        0.998500 |      20.900457        0.995106 |      20.915685        0.998739 |
      20.930913        0.997573 |      20.946141        1.000224 |      20.961369        0.998283 |      20.976597        0.994195 |      20.991825        0.990830 |      21.007053        0.991978 |
      21.022281        0.993855 |      21.037509        1.000761 |      21.052737        0.994345 |      21.067965        0.997493 |      21.083193        0.994287 |      21.098421        1.002805 |
      21.113649        1.000737 |      21.128877        0.994069 |      21.144105        0.998804 |      21.159333        1.000311 |      21.174561        1.001171 |      21.189789        0.996983 |
      21.205017        1.003415 |      21.220245        0.996365 |      21.235473        1.001664 |      21.250701        1.002673 |      21.265929        1.001388 |      21.281157        0.998731 |
      21.296385        1.002124 |      21.311613        0.995360 |      21.326841        1.000529 |      21.342069        1.001490 |      21.357297        0.999913 |      21.372525        0.990863 |
      21.387754        1.001447 |      21.402982        0.996825 |      21.418210        0.999125 |      21.433438        0.995099 |      21.448666        0.989809 |      21.463894        0.999203 |
      21.479122        1.003410 |      21.494350        1.005543 |      21.509578        0.998038 |      21.524806        0.999866 |      21.540034        0.998002 |      21.555262        0.998078 |
      21.570490        0.995973 |      21.585718        0.998171 |      21.600946        0.998334 |      21.616174        0.995652 |      21.631402        0.996363 |      21.646630        0.999092 |
      21.661858        0.996930 |      21.677086        1.001718 |      21.692314        0.998679 |      21.707542        0.992616 |      21.722770        1.003761 |      21.737998        1.000142 |
      21.753226        0.998620 |      21.768454        0.999707 |      21.783682        1.001859 |      21.798910        0.997257 |      21.814138        1.000625 |      21.829366        0.998933 |
      21.844594        1.000818 |      21.859822        0.999632 |      21.875050        0.995114 |      21.890278        0.994505 |      21.905506        0.996186 |      21.920734        1.000169 |
      21.935962        1.005531 |      21.951190        1.002063 |      21.966418        1.000121 |      21.981646        1.002677 |      21.996874        0.991884 |      22.012102        0.997788 |
      22.027330        0.995040 |      22.042558        0.996637 |      22.057786        0.997132 |      22.073014        1.006245 |      22.088242        1.002499 |      22.103470        1.000080 |
      22.118698        0.997431 |      22.133926        1.002775 |      22.149154        1.000501 |      22.164383        1.000276 |      22.179611        1.004496 |      22.194839        1.000304 |
      22.210067        0.998891 |      22.225295        0.993679 |      22.240523        0.996379 |      22.255751        0.999768 |      22.270979        1.005066 |      22.286207        0.995205 |
      22.301435        1.000672 |      22.316663        1.002079 |      22.331891        0.995291 |      22.347119        0.993997 |      22.362347        0.995531 |      22.377575        0.997707 |
      22.392803        1.001076 |      22.408031        1.001518 |      22.423259        0.989714 |      22.438487        1.003071 |      22.453715        1.003298 |      22.468943        1.001700 |
      22.484171        0.994860 |      22.499399        0.995890 |      22.514627        0.995885 |      22.529855        1.004184 |      22.545083        1.001614 |      22.560311        1.000118 |
      22.575539        0.999632 |      22.590767        0.999197 |      22.605995        0.997626 |      22.621223        1.009193 |      22.636451        0.999312 |      22.651679        0.999223 |
      22.666907        0.999326 |      22.682135        0.993461 |      22.697363        1.002687 |      22.712591        1.003361 |      22.727819        1.001754 |      22.743047        1.004801 |
      22.758275        0.999003 |      22.773503        0.999332 |      22.788731        1.003355 |      22.803959        1.000577 |      22.819187        1.004516 |      22.834415        1.005173 |
      22.849643        0.995398 |      22.864871        1.001106 |      22.880099        0.998855 |      22.895327        1.005669 |      22.910555        0.999649 |      22.925783        1.001147 |
      22.941012        1.001121 |      22.956240        1.003684 |      22.971468        1.008866 |      22.986696        1.002590 |      23.001924        1.005178 |      23.017152        1.002476 |
      23.032380        0.998291 |      23.047608        1.006937 |      23.062836        0.999678 |      23.078064        1.000707 |      23.093292        1.005321 |      23.108520        1.004486 |
      23.123748        1.002137 |      23.138976        1.002117 |      23.154204        0.999775 |      23.169432        0.997448 |      23.184660        0.998590 |      23.199888        1.005288 |
      23.215116        1.001126 |      23.230344        0.996896 |      23.245572        1.000508 |      23.260800        0.999121 |      23.276028        1.003346 |      23.291256        1.003490 |
      23.306484        0.998280 |      23.321712        1.003400 |      23.336940        0.999027 |      23.352168        1.004794 |      23.367396        1.002431 |      23.382624        1.001853 |
      23.397852        1.002833 |      23.413080        1.002158 |      23.428308        0.999770 |      23.443536        0.997196 |      23.458764        1.005711 |      23.473992        1.000581 |
      23.489220        0.995492 |      23.504448        1.002184 |      23.519676        1.000555 |      23.534904        1.004039 |      23.550132        1.005825 |      23.565360        1.003273 |
      23.580588        1.001592 |      23.595816        1.000938 |      23.611044        0.997837 |      23.626272        0.999812 |      23.641500        0.997139 |      23.656728        1.002632 |
      23.671956        1.000120 |      23.687184        0.994080 |      23.702412        1.002048 |      23.717641        0.991222 |      23.732869        0.999255 |      23.748097        0.998864 |
      23.763325        0.999196 |      23.778553        1.001950 |      23.793781        1.002544 |      23.809009        1.002461 |      23.824237        1.001309 |      23.839465        0.995023 |
      23.854693        0.998827 |      23.869921        0.999389 |      23.885149        0.998125 |      23.900377        0.996176 |      23.915605        1.004857 |      23.930833        1.002839 |
      23.946061        0.998025 |      23.961289        0.995171 |      23.976517        0.992233 |      23.991745        0.999198 |      24.006973        0.996588 |      24.022201        1.004570 |
      24.037429        0.997793 |      24.052657        0.996594 |      24.067885        1.000083 |      24.083113        1.001876 |      24.098341        0.999700 |      24.113569        1.001802 |
      24.128797        0.999109 |      24.144025        1.000263 |      24.159253        0.997703 |      24.174481        0.998935 |      24.189709        1.003068 |      24.204937        1.006448 |
      24.220165        0.995250 |      24.235393        0.996948 |      24.250621        1.001682 |      24.265849        1.001020 |      24.281077        1.005425 |      24.296305        0.995561 |
      24.311533        1.000961 |      24.326761        0.997224 |      24.341989        1.002139 |      24.357217        1.001265 |      24.372445        1.000948 |      24.387673        1.000885 |
      24.402901        0.999522 |      24.418129        0.998522 |      24.433357        0.999231 |      24.448585        0.998617 |      24.463813        1.006123 |      24.479041        0.996587 |
      24.494270        1.009986 |      24.509498        1.004482 |      24.524726        1.001174 |      24.539954        0.999463 |      24.555182        1.001321 |      24.570410        1.000340 |
      24.585638        1.005583 |      24.600866        1.003024 |      24.616094        0.995120 |      24.631322        0.993028 |      24.646550        1.001152 |      24.661778        0.997173 |
      24.677006        0.998631 |      24.692234        1.002959 |      24.707462        1.000000 |      24.722690        0.998358 |      24.737918        0.999976 |      24.753146        0.997337 |
      24.768374        0.998541 |      24.783602        1.001853 |      24.798830        0.994389 |      24.814058        0.995106 |      24.829286        0.998645 |      24.844514        0.997870 |
      24.859742        1.002065 |      24.874970        0.996485 |      24.890198        0.996423 |      24.905426        1.000467 |      24.920654        1.000718 |      24.935882        0.999698 |
      24.951110        1.003334 |      24.966338        0.996883 |      24.981566        0.996674 |      24.996794        1.003605 |      25.012022        0.995694 |      25.027250        1.000579 |
      25.042478        0.995443 |      25.057706        1.004879 |      25.072934        1.005473 |      25.088162        0.997571 |      25.103390        0.998793 |      25.118618        1.004795 |
      25.133846        0.995745 |      25.149074        0.998277 |      25.164302        1.001167 |      25.179530        1.003190 |      25.194758        0.995023 |      25.209986        0.998002 |
      25.225214        0.996658 |      25.240442        0.997960 |      25.255670        0.996297 |      25.270899        0.999635 |      25.286127        1.005303 |      25.301355        1.003652 |
      25.316583        0.999025 |      25.331811        0.996284 |      25.347039        1.004393 |      25.362267        1.001723 |      25.377495        0.997191 |      25.392723        0.997091 |
      25.407951        0.996893 |      25.423179        1.001056 |      25.438407        1.000674 |      25.453635        0.999308 |      25.468863        1.002605 |      25.484091        0.997460 |
      25.499319        0.998779 |      25.514547        0.999765 |      25.529775        1.003203 |      25.545003        0.999851 |      25.560231        0.996915 |      25.575459        0.999470 |
      25.590687        1.001420 |      25.605915        1.000724 |      25.621143        1.000037 |      25.636371        0.996358 |      25.651599        0.999460 |      25.666827        0.998759 |
      25.682055        0.996980 |      25.697283        1.006460 |      25.712511        0.996471 |      25.727739        0.999867 |      25.742967        1.001944 |      25.758195        0.994721 |
      25.773423        1.000475 |      25.788651        0.996856 |      25.803879        0.998782 |      25.819107        1.000108 |      25.834335        0.998490 |      25.849563        1.001784 |
      25.864791        0.999791 |      25.880019        0.997740 |      25.895247        1.000054 |      25.910475        1.000398 |      25.925703        0.999846 |      25.940931        0.998851 |
      25.956159        0.998269 |      25.971387        1.002124 |      25.986615        0.998200 |      26.001843        1.001758 |      26.017071        0.999898 |      26.032299        0.995255 |
      26.047528        0.995850 |      26.062756        0.998067 |      26.077984        0.996079 |      26.093212        1.001354 |      26.108440        1.002803 |      26.123668        0.996254 |
      26.138896        0.997658 |      26.154124        0.994967 |      26.169352        0.995345 |      26.184580        1.001778 |      26.199808        1.006474 |      26.215036        1.001088 |
      26.230264        1.000390 |      26.245492        0.998728 |      26.260720        0.997047 |      26.275948        1.001967 |      26.291176        0.999937 |      26.306404        0.998281 |
      26.321632        0.994619 |      26.336860        0.998552 |      26.352088        1.003808 |      26.367316        0.999926 |      26.382544        1.002356 |      26.397772        1.001515 |
      26.413000        1.001148 |      26.428228        1.001560 |      26.443456        0.999225 |      26.458684        0.999091 |      26.473912        0.999024 |      26.489140        0.999396 |
      26.504368        0.998598 |      26.519596        0.999244 |      26.534824        0.997080 |      26.550052        1.002756 |      26.565280        1.001517 |      26.580508        1.003524 |
      26.595736        1.003573 |      26.610964        1.005246 |      26.626192        0.997804 |      26.641420        0.998594 |      26.656648        0.995068 |      26.671876        0.999998 |
      26.687104        1.000209 |      26.702332        1.002700 |      26.717560        0.999300 |      26.732788        1.002253 |      26.748016        0.998992 |      26.763244        0.996468 |
      26.778472        1.006065 |      26.793700        1.000995 |      26.808928        0.998228 |      26.824157        0.998621 |      26.839385        1.004510 |      26.854613        0.996466 |
      26.869841        0.999503 |      26.885069        1.002098 |      26.900297        0.998470 |      26.915525        0.998510 |      26.930753        0.996003 |      26.945981        0.999200 |
      26.961209        0.998245 |      26.976437        0.998857 |      26.991665        1.000171 |      27.006893        1.005555 |      27.022121        1.001865 |      27.037349        1.002597 |
      27.052577        0.997995 |      27.067805        1.000200 |      27.083033        1.000252 |      27.098261        1.000260 |      27.113489        1.004488 |      27.128717        1.002323 |
      27.143945        1.001993 |      27.159173        0.997055 |      27.174401        0.999161 |      27.189629        1.006009 |      27.204857        0.996989 |      27.220085        1.000617 |
      27.235313        1.000930 |      27.250541        1.001467 |      27.265769        0.998069 |      27.280997        0.998241 |      27.296225        1.002161 |      27.311453        0.999270 |
      27.326681        0.998969 |      27.341909        1.004930 |      27.357137        0.998514 |      27.372365        0.998109 |      27.387593        1.002166 |      27.402821        1.000064 |
      27.418049        0.997144 |      27.433277        1.003696 |      27.448505        0.995328 |      27.463733        0.999169 |      27.478961        0.998242 |      27.494189        1.001060 |
      27.509417        1.002972 |      27.524645        0.999329 |      27.539873        1.003969 |      27.555101        0.996963 |      27.570329        1.002881 |      27.585557        0.997821 |
      27.600786        1.001767 |      27.616014        1.001102 |      27.631242        1.000499 |      27.646470        1.000793 |      27.661698        0.998980 |      27.676926        0.999213 |
      27.692154        1.000726 |      27.707382        0.995655 |      27.722610        1.003885 |      27.737838        1.000370 |      27.753066        1.001119 |      27.768294        1.006568 |
      27.783522        0.999549 |      27.798750        1.000390 |      27.813978        0.999822 |      27.829206        1.004003 |      27.844434        1.002021 |      27.859662        1.002193 |
      27.874890        0.998042 |      27.890118        1.001008 |      27.905346        1.003778 |      27.920574        0.999355 |      27.935802        0.996409 |      27.951030        0.998745 |
      27.966258        0.998534 |      27.981486        0.999825 |      27.996714        0.998525 |      28.011942        1.004465 |      28.027170        1.003241 |      28.042398        0.999877 |
      28.057626        1.004878 |      28.072854        1.003323 |      28.088082        1.000154 |      28.103310        1.001150 |      28.118538        1.003923 |      28.133766        1.002605 |
      28.148994        1.000114 |      28.164222        1.001268 |      28.179450        0.999719 |      28.194678        0.998751 |      28.209906        0.998337 |      28.225134        0.994791 |
      28.240362        0.998638 |      28.255590        0.998289 |      28.270818        1.001611 |      28.286046        0.997075 |      28.301274        1.000809 |      28.316502        1.000202 |
      28.331730        0.992318 |      28.346958        1.000769 |      28.362186        1.003153 |      28.377415        1.003428 |      28.392643        1.005713 |      28.407871        0.998393 |
      28.423099        0.998101 |      28.438327        0.999632 |      28.453555        1.000255 |      28.468783        0.999534 |      28.484011        0.998820 |      28.499239        1.006344 |
      28.514467        0.997968 |      28.529695        0.996157 |      28.544923        1.001334 |      28.560151        0.997157 |      28.575379        0.997503 |      28.590607        0.997900 |
      28.605835        0.998794 |      28.621063        0.998178 |      28.636291        1.002366 |      28.651519        0.999492 |      28.666747        1.000728 |      28.681975        0.996741 |
      28.697203        0.998567 |      28.712431        0.997349 |      28.727659        1.006255 |      28.742887        0.999865 |      28.758115        1.002367 |      28.773343        0.999891 |
      28.788571        0.996883 |      28.803799        1.000697 |      28.819027        1.003783 |      28.834255        1.001692 |      28.849483        0.999220 |      28.864711        0.999077 |
      28.879939        0.999014 |      28.895167        1.000906 |      28.910395        0.997305 |      28.925623        1.001050 |      28.940851        0.999335 |      28.956079        1.001035 |
      28.971307        1.000675 |      28.986535        1.000588 |      29.001763        0.994208 |      29.016991        0.995141 |      29.032219        0.999291 |      29.047447        1.001690 |
      29.062675        0.998696 |      29.077903        1.002030 |      29.093131        0.998819 |      29.108359        0.997990 |      29.123587        0.998192 |      29.138815        1.004326 |
      29.154044        1.001382 |      29.169272        0.997828 |      29.184500        0.997426 |      29.199728        0.997582 |      29.214956        1.000673 |      29.230184        0.999649 |
      29.245412        1.004436 |      29.260640        1.001045 |      29.275868        1.001341 |      29.291096        1.003336 |      29.306324        1.002239 |      29.321552        1.000760 |
      29.336780        1.004364 |      29.352008        0.997439 |      29.367236        1.003143 |      29.382464        0.995197 |      29.397692        0.999704 |      29.412920        0.997496 |
      29.428148        0.997932 |      29.443376        1.001341 |      29.458604        1.007900 |      29.473832        0.999905 |      29.489060        0.999492 |      29.504288        1.002919 |
      29.519516        0.997820 |      29.534744        0.999292 |      29.549972        0.999365 |      29.565200        1.001848 |      29.580428        1.003632 |      29.595656        1.001071 |
      29.610884        0.999141 |      29.626112        1.001392 |      29.641340        0.997065 |      29.656568        1.003392 |      29.671796        0.995910 |      29.687024        0.996254 |
      29.702252        0.997663 |      29.717480        1.000775 |      29.732708        0.997360 |      29.747936        0.997492 |      29.763164        1.001732 |      29.778392        0.998626 |
      29.793620        0.998902 |      29.808848        0.997452 |      29.824076        0.998709 |      29.839304        1.000486 |      29.854532        0.998527 |      29.869760        0.999086 |
      29.884988        0.998812 |      29.900216        1.000767 |      29.915444        0.999024 |      29.930673        1.000530 |      29.945901        0.994986 |      29.961129        0.996982 |
      29.976357        1.001708 |      29.991585        1.001005 |      30.006813        1.000303 |      30.022041        0.999753 |      30.037269        1.002015 |      30.052497        1.002558 |
      30.067725        1.007693 |      30.082953        1.002586 |      30.098181        0.996561 |      30.113409        1.002007 |      30.128637        0.999462 |      30.143865        0.996334 |
      30.159093        0.999031 |      30.174321        1.000178 |      30.189549        1.005023 |      30.204777        1.000524 |      30.220005        0.999378 |      30.235233        0.996158 |
      30.250461        1.004323 |      30.265689        0.999367 |      30.280917        1.002629 |      30.296145        1.002231 |      30.311373        1.001065 |      30.326601        1.002619 |
      30.341829        1.002039 |      30.357057        0.999411 |      30.372285        1.003331 |      30.387513        0.999748 |      30.402741        0.999109 |      30.417969        0.999573 |
      30.433197        0.996037 |      30.448425        0.998088 |
Freeing Host memory

s2 value    : -2.43191
s2bond value: -3.87014
Number of atoms processed: 6720
Number of confs processed: 10
Total Time: 0.369547secs
