{
	"info": {
		"_postman_id": "398e817d-2743-4fc4-b62c-b396de5d214f",
		"name": "Weather report",
		"schema": "https://schema.getpostman.com/json/collection/v2.1.0/collection.json",
		"_exporter_id": "13647938"
	},
	"item": [
		{
			"name": "Cities_api",
			"request": {
				"method": "GET",
				"header": [],
				"url": {
					"raw": "http://api.openweathermap.org/geo/1.0/direct?q=Cheboksary&limit=5&appid={{apikey}}",
					"protocol": "http",
					"host": [
						"api",
						"openweathermap",
						"org"
					],
					"path": [
						"geo",
						"1.0",
						"direct"
					],
					"query": [
						{
							"key": "q",
							"value": "Cheboksary"
						},
						{
							"key": "limit",
							"value": "5"
						},
						{
							"key": "appid",
							"value": "{{apikey}}"
						}
					]
				}
			},
			"response": []
		},
		{
			"name": "Weather reports_api",
			"request": {
				"method": "GET",
				"header": [],
				"url": {
					"raw": "api.openweathermap.org/data/2.5/forecast?lat=55.7504461&lon=37.6174943&appid={{apikey}}&units=metric",
					"host": [
						"api",
						"openweathermap",
						"org"
					],
					"path": [
						"data",
						"2.5",
						"forecast"
					],
					"query": [
						{
							"key": "lat",
							"value": "55.7504461"
						},
						{
							"key": "lon",
							"value": "37.6174943"
						},
						{
							"key": "appid",
							"value": "{{apikey}}"
						},
						{
							"key": "units",
							"value": "metric"
						}
					]
				}
			},
			"response": []
		},
		{
			"name": "New Request_api",
			"request": {
				"method": "GET",
				"header": [],
				"url": {
					"raw": "http://api.openweathermap.org/geo/1.0/reverse?lat=55&lon=-92&limit=20&appid={{apikey}}",
					"protocol": "http",
					"host": [
						"api",
						"openweathermap",
						"org"
					],
					"path": [
						"geo",
						"1.0",
						"reverse"
					],
					"query": [
						{
							"key": "lat",
							"value": "55"
						},
						{
							"key": "lon",
							"value": "-92"
						},
						{
							"key": "limit",
							"value": "20"
						},
						{
							"key": "appid",
							"value": "{{apikey}}"
						}
					]
				}
			},
			"response": []
		},
		{
			"name": "Get ordered cities",
			"request": {
				"method": "GET",
				"header": [],
				"url": {
					"raw": "localhost:3000/get_cities",
					"host": [
						"localhost"
					],
					"port": "3000",
					"path": [
						"get_cities"
					]
				}
			},
			"response": []
		},
		{
			"name": "Short forecast",
			"request": {
				"method": "POST",
				"header": [],
				"body": {
					"mode": "raw",
					"raw": "{\n    \"city\" : \"Ban Yaeng\"\n}",
					"options": {
						"raw": {
							"language": "json"
						}
					}
				},
				"url": {
					"raw": "localhost:3000/get_short_forecast",
					"host": [
						"localhost"
					],
					"port": "3000",
					"path": [
						"get_short_forecast"
					]
				}
			},
			"response": []
		},
		{
			"name": "Full forecast",
			"request": {
				"method": "GET",
				"header": []
			},
			"response": []
		}
	],
	"event": [
		{
			"listen": "prerequest",
			"script": {
				"type": "text/javascript",
				"exec": [
					""
				]
			}
		},
		{
			"listen": "test",
			"script": {
				"type": "text/javascript",
				"exec": [
					""
				]
			}
		}
	],
	"variable": [
		{
			"key": "apikey",
			"value": "1713d31268293b0c28017f00c0bfca66",
			"type": "string"
		}
	]
}