module gitlab.com/martyn.andrw/microlink

go 1.18

require (
	google.golang.org/grpc v1.47.0
	google.golang.org/protobuf v1.28.0
)

require (
	github.com/abhinav-TB/dantdb v0.0.0-20220522153004-c2602a1cc142 // indirect
	github.com/golang/protobuf v1.5.2 // indirect
	github.com/lib/pq v1.10.6 // indirect
	github.com/xlab/closer v0.0.0-20190328110542-03326addb7c2
	golang.org/x/net v0.0.0-20201021035429-f5854403a974 // indirect
	golang.org/x/sys v0.0.0-20210119212857-b64e53b001e4 // indirect
	golang.org/x/text v0.3.3 // indirect
	google.golang.org/genproto v0.0.0-20200526211855-cb27e3aa2013 // indirect
)
