{
    "id": 12,
    "name": "Tarte aux fraises",
    "description": "Lorem ipsum dolor sit amet consectetur adipisicing elit. Itaque natus aperiam sit ut modi voluptatem. Nulla at architecto nam similique, repellendus repudiandae, delectus odit placeat ea facere magnam quo dolore!",
    "steps": [
        "Lorem ipsum dolor sit amet consectetur",
        "Lorem ipsum dolor sit amet consectetur",
        "Lorem ipsum dolor sit amet consectetur"
    ],
    "ingredients": [
        {
            "id": 12,
            "quantity": "0.22"
        }
    ]
}