<?xml version="1.0" encoding="utf-8" standalone="no"?>
<!DOCTYPE svg PUBLIC "-//W3C//DTD SVG 1.1//EN"
  "http://www.w3.org/Graphics/SVG/1.1/DTD/svg11.dtd">
<svg xmlns:xlink="http://www.w3.org/1999/xlink" width="637.2pt" height="328.32pt" viewBox="0 0 637.2 328.32" xmlns="http://www.w3.org/2000/svg" version="1.1">
 <metadata>
  <rdf:RDF xmlns:dc="http://purl.org/dc/elements/1.1/" xmlns:cc="http://creativecommons.org/ns#" xmlns:rdf="http://www.w3.org/1999/02/22-rdf-syntax-ns#">
   <cc:Work>
    <dc:type rdf:resource="http://purl.org/dc/dcmitype/StillImage"/>
    <dc:date>2023-06-26T19:29:52.943832</dc:date>
    <dc:format>image/svg+xml</dc:format>
    <dc:creator>
     <cc:Agent>
      <dc:title>Matplotlib v3.6.2, https://matplotlib.org/</dc:title>
     </cc:Agent>
    </dc:creator>
   </cc:Work>
  </rdf:RDF>
 </metadata>
 <defs>
  <style type="text/css">*{stroke-linejoin: round; stroke-linecap: butt}</style>
 </defs>
 <g id="figure_1">
  <g id="patch_1">
   <path d="M 0 328.32 
L 637.2 328.32 
L 637.2 0 
L 0 0 
z
" style="fill: #ffffff"/>
  </g>
  <g id="axes_1">
   <g id="patch_2">
    <path d="M 79.65 292.2048 
L 573.48 292.2048 
L 573.48 39.3984 
L 79.65 39.3984 
z
" style="fill: #ffffff"/>
   </g>
   <g id="matplotlib.axis_1">
    <g id="xtick_1">
     <g id="line2d_1">
      <path d="M 102.096818 292.2048 
L 102.096818 39.3984 
" clip-path="url(#p450dd1745f)" style="fill: none; stroke-dasharray: 2.96,1.28; stroke-dashoffset: 0; stroke: #808080; stroke-width: 0.8"/>
     </g>
     <g id="line2d_2">
      <defs>
       <path id="m32095d5afc" d="M 0 0 
L 0 3.5 
" style="stroke: #000000; stroke-width: 0.8"/>
      </defs>
      <g>
       <use xlink:href="#m32095d5afc" x="102.096818" y="292.2048" style="stroke: #000000; stroke-width: 0.8"/>
      </g>
     </g>
     <g id="text_1">
      <!-- $\mathdefault{0.0}$ -->
      <g transform="translate(95.731779 306.123298) scale(0.1 -0.1)">
       <defs>
        <path id="CMR17-30" d="M 2688 2025 
C 2688 2416 2682 3080 2413 3591 
C 2176 4039 1798 4198 1466 4198 
C 1158 4198 768 4058 525 3597 
C 269 3118 243 2524 243 2025 
C 243 1661 250 1106 448 619 
C 723 -39 1216 -128 1466 -128 
C 1760 -128 2208 -7 2470 600 
C 2662 1042 2688 1559 2688 2025 
z
M 1466 -26 
C 1056 -26 813 325 723 812 
C 653 1188 653 1738 653 2096 
C 653 2588 653 2997 736 3387 
C 858 3929 1216 4096 1466 4096 
C 1728 4096 2067 3923 2189 3400 
C 2272 3036 2278 2607 2278 2096 
C 2278 1680 2278 1169 2202 792 
C 2067 95 1690 -26 1466 -26 
z
" transform="scale(0.015625)"/>
        <path id="CMMI12-3a" d="M 1178 307 
C 1178 492 1024 619 870 619 
C 685 619 557 466 557 313 
C 557 128 710 0 864 0 
C 1050 0 1178 153 1178 307 
z
" transform="scale(0.015625)"/>
       </defs>
       <use xlink:href="#CMR17-30" transform="scale(0.996264)"/>
       <use xlink:href="#CMMI12-3a" transform="translate(45.690477 0) scale(0.996264)"/>
       <use xlink:href="#CMR17-30" transform="translate(72.787654 0) scale(0.996264)"/>
      </g>
     </g>
    </g>
    <g id="xtick_2">
     <g id="line2d_3">
      <path d="M 191.884091 292.2048 
L 191.884091 39.3984 
" clip-path="url(#p450dd1745f)" style="fill: none; stroke-dasharray: 2.96,1.28; stroke-dashoffset: 0; stroke: #808080; stroke-width: 0.8"/>
     </g>
     <g id="line2d_4">
      <g>
       <use xlink:href="#m32095d5afc" x="191.884091" y="292.2048" style="stroke: #000000; stroke-width: 0.8"/>
      </g>
     </g>
     <g id="text_2">
      <!-- $\mathdefault{0.2}$ -->
      <g transform="translate(185.519051 306.123298) scale(0.1 -0.1)">
       <defs>
        <path id="CMR17-32" d="M 2669 989 
L 2554 989 
C 2490 536 2438 459 2413 420 
C 2381 369 1920 369 1830 369 
L 602 369 
C 832 619 1280 1072 1824 1597 
C 2214 1967 2669 2402 2669 3035 
C 2669 3790 2067 4224 1395 4224 
C 691 4224 262 3604 262 3030 
C 262 2780 448 2748 525 2748 
C 589 2748 781 2787 781 3010 
C 781 3207 614 3264 525 3264 
C 486 3264 448 3258 422 3245 
C 544 3790 915 4058 1306 4058 
C 1862 4058 2227 3617 2227 3035 
C 2227 2479 1901 2000 1536 1584 
L 262 146 
L 262 0 
L 2515 0 
L 2669 989 
z
" transform="scale(0.015625)"/>
       </defs>
       <use xlink:href="#CMR17-30" transform="scale(0.996264)"/>
       <use xlink:href="#CMMI12-3a" transform="translate(45.690477 0) scale(0.996264)"/>
       <use xlink:href="#CMR17-32" transform="translate(72.787654 0) scale(0.996264)"/>
      </g>
     </g>
    </g>
    <g id="xtick_3">
     <g id="line2d_5">
      <path d="M 281.671364 292.2048 
L 281.671364 39.3984 
" clip-path="url(#p450dd1745f)" style="fill: none; stroke-dasharray: 2.96,1.28; stroke-dashoffset: 0; stroke: #808080; stroke-width: 0.8"/>
     </g>
     <g id="line2d_6">
      <g>
       <use xlink:href="#m32095d5afc" x="281.671364" y="292.2048" style="stroke: #000000; stroke-width: 0.8"/>
      </g>
     </g>
     <g id="text_3">
      <!-- $\mathdefault{0.4}$ -->
      <g transform="translate(275.306324 306.123298) scale(0.1 -0.1)">
       <defs>
        <path id="CMR17-34" d="M 2150 4122 
C 2150 4256 2144 4256 2029 4256 
L 128 1254 
L 128 1088 
L 1779 1088 
L 1779 457 
C 1779 224 1766 160 1318 160 
L 1197 160 
L 1197 0 
C 1402 0 1747 0 1965 0 
C 2182 0 2528 0 2733 0 
L 2733 160 
L 2611 160 
C 2163 160 2150 224 2150 457 
L 2150 1088 
L 2803 1088 
L 2803 1254 
L 2150 1254 
L 2150 4122 
z
M 1798 3703 
L 1798 1254 
L 256 1254 
L 1798 3703 
z
" transform="scale(0.015625)"/>
       </defs>
       <use xlink:href="#CMR17-30" transform="scale(0.996264)"/>
       <use xlink:href="#CMMI12-3a" transform="translate(45.690477 0) scale(0.996264)"/>
       <use xlink:href="#CMR17-34" transform="translate(72.787654 0) scale(0.996264)"/>
      </g>
     </g>
    </g>
    <g id="xtick_4">
     <g id="line2d_7">
      <path d="M 371.458636 292.2048 
L 371.458636 39.3984 
" clip-path="url(#p450dd1745f)" style="fill: none; stroke-dasharray: 2.96,1.28; stroke-dashoffset: 0; stroke: #808080; stroke-width: 0.8"/>
     </g>
     <g id="line2d_8">
      <g>
       <use xlink:href="#m32095d5afc" x="371.458636" y="292.2048" style="stroke: #000000; stroke-width: 0.8"/>
      </g>
     </g>
     <g id="text_4">
      <!-- $\mathdefault{0.6}$ -->
      <g transform="translate(365.093597 306.123298) scale(0.1 -0.1)">
       <defs>
        <path id="CMR17-36" d="M 678 2176 
C 678 3690 1395 4032 1811 4032 
C 1946 4032 2272 4009 2400 3776 
C 2298 3776 2106 3776 2106 3553 
C 2106 3381 2246 3323 2336 3323 
C 2394 3323 2566 3348 2566 3560 
C 2566 3954 2246 4179 1805 4179 
C 1043 4179 243 3390 243 1984 
C 243 253 966 -128 1478 -128 
C 2099 -128 2688 427 2688 1283 
C 2688 2081 2170 2662 1517 2662 
C 1126 2662 838 2407 678 1960 
L 678 2176 
z
M 1478 25 
C 691 25 691 1200 691 1436 
C 691 1896 909 2560 1504 2560 
C 1613 2560 1926 2560 2138 2120 
C 2253 1870 2253 1609 2253 1289 
C 2253 944 2253 690 2118 434 
C 1978 171 1773 25 1478 25 
z
" transform="scale(0.015625)"/>
       </defs>
       <use xlink:href="#CMR17-30" transform="scale(0.996264)"/>
       <use xlink:href="#CMMI12-3a" transform="translate(45.690477 0) scale(0.996264)"/>
       <use xlink:href="#CMR17-36" transform="translate(72.787654 0) scale(0.996264)"/>
      </g>
     </g>
    </g>
    <g id="xtick_5">
     <g id="line2d_9">
      <path d="M 461.245909 292.2048 
L 461.245909 39.3984 
" clip-path="url(#p450dd1745f)" style="fill: none; stroke-dasharray: 2.96,1.28; stroke-dashoffset: 0; stroke: #808080; stroke-width: 0.8"/>
     </g>
     <g id="line2d_10">
      <g>
       <use xlink:href="#m32095d5afc" x="461.245909" y="292.2048" style="stroke: #000000; stroke-width: 0.8"/>
      </g>
     </g>
     <g id="text_5">
      <!-- $\mathdefault{0.8}$ -->
      <g transform="translate(454.88087 306.123298) scale(0.1 -0.1)">
       <defs>
        <path id="CMR17-38" d="M 1741 2264 
C 2144 2467 2554 2773 2554 3263 
C 2554 3841 1990 4179 1472 4179 
C 890 4179 378 3759 378 3180 
C 378 3021 416 2747 666 2505 
C 730 2442 998 2251 1171 2130 
C 883 1983 211 1634 211 934 
C 211 279 838 -128 1459 -128 
C 2144 -128 2720 362 2720 1010 
C 2720 1590 2330 1857 2074 2029 
L 1741 2264 
z
M 902 2822 
C 851 2854 595 3051 595 3351 
C 595 3739 998 4032 1459 4032 
C 1965 4032 2336 3676 2336 3262 
C 2336 2669 1670 2331 1638 2331 
C 1632 2331 1626 2331 1574 2370 
L 902 2822 
z
M 2080 1519 
C 2176 1449 2483 1240 2483 851 
C 2483 381 2010 25 1472 25 
C 890 25 448 438 448 940 
C 448 1443 838 1862 1280 2060 
L 2080 1519 
z
" transform="scale(0.015625)"/>
       </defs>
       <use xlink:href="#CMR17-30" transform="scale(0.996264)"/>
       <use xlink:href="#CMMI12-3a" transform="translate(45.690477 0) scale(0.996264)"/>
       <use xlink:href="#CMR17-38" transform="translate(72.787654 0) scale(0.996264)"/>
      </g>
     </g>
    </g>
    <g id="xtick_6">
     <g id="line2d_11">
      <path d="M 551.033182 292.2048 
L 551.033182 39.3984 
" clip-path="url(#p450dd1745f)" style="fill: none; stroke-dasharray: 2.96,1.28; stroke-dashoffset: 0; stroke: #808080; stroke-width: 0.8"/>
     </g>
     <g id="line2d_12">
      <g>
       <use xlink:href="#m32095d5afc" x="551.033182" y="292.2048" style="stroke: #000000; stroke-width: 0.8"/>
      </g>
     </g>
     <g id="text_6">
      <!-- $\mathdefault{1.0}$ -->
      <g transform="translate(544.668142 306.123298) scale(0.1 -0.1)">
       <defs>
        <path id="CMR17-31" d="M 1702 4058 
C 1702 4192 1696 4192 1606 4192 
C 1357 3916 979 3827 621 3827 
C 602 3827 570 3827 563 3808 
C 557 3795 557 3782 557 3648 
C 755 3648 1088 3686 1344 3839 
L 1344 461 
C 1344 236 1331 160 781 160 
L 589 160 
L 589 0 
C 896 0 1216 0 1523 0 
C 1830 0 2150 0 2458 0 
L 2458 160 
L 2266 160 
C 1715 160 1702 230 1702 458 
L 1702 4058 
z
" transform="scale(0.015625)"/>
       </defs>
       <use xlink:href="#CMR17-31" transform="scale(0.996264)"/>
       <use xlink:href="#CMMI12-3a" transform="translate(45.690477 0) scale(0.996264)"/>
       <use xlink:href="#CMR17-30" transform="translate(72.787654 0) scale(0.996264)"/>
      </g>
     </g>
    </g>
    <g id="text_7">
     <!-- $\theta\ [\pi]$ -->
     <g transform="translate(316.64212 319.532457) scale(0.1 -0.1)">
      <defs>
       <path id="CMMI12-12" d="M 2835 3200 
C 2835 3850 2630 4480 2106 4480 
C 1210 4480 256 2615 256 1216 
C 256 923 320 -64 992 -64 
C 1862 -64 2835 1756 2835 3200 
z
M 896 2304 
C 992 2679 1126 3214 1382 3665 
C 1594 4047 1818 4352 2099 4352 
C 2310 4352 2451 4174 2451 3564 
C 2451 3334 2432 3017 2246 2304 
L 896 2304 
z
M 2202 2113 
C 2042 1490 1907 1088 1677 687 
C 1491 363 1267 64 998 64 
C 800 64 640 217 640 846 
C 640 1260 742 1693 845 2113 
L 2202 2113 
z
" transform="scale(0.015625)"/>
       <path id="CMR17-5b" d="M 1504 -1600 
L 1504 -1377 
L 902 -1377 
L 902 4544 
L 1504 4544 
L 1504 4767 
L 678 4767 
L 678 -1600 
L 1504 -1600 
z
" transform="scale(0.015625)"/>
       <path id="CMMI12-19" d="M 1658 2408 
L 2381 2408 
C 2208 1692 2099 1226 2099 716 
C 2099 626 2099 -64 2362 -64 
C 2496 -64 2611 57 2611 166 
C 2611 197 2611 210 2566 306 
C 2394 747 2394 1296 2394 1341 
C 2394 1379 2394 1832 2528 2408 
L 3245 2408 
C 3328 2408 3539 2408 3539 2612 
C 3539 2752 3418 2752 3302 2752 
L 1197 2752 
C 1050 2752 832 2752 538 2440 
C 371 2254 166 1916 166 1878 
C 166 1840 198 1827 237 1827 
C 282 1827 288 1846 320 1884 
C 653 2408 986 2408 1146 2408 
L 1510 2408 
C 1370 1929 1210 1373 685 256 
C 634 154 634 140 634 102 
C 634 -32 749 -64 806 -64 
C 992 -64 1043 102 1120 370 
C 1222 696 1222 709 1286 964 
L 1658 2408 
z
" transform="scale(0.015625)"/>
       <path id="CMR17-5d" d="M 915 4767 
L 90 4767 
L 90 4544 
L 691 4544 
L 691 -1377 
L 90 -1377 
L 90 -1600 
L 915 -1600 
L 915 4767 
z
" transform="scale(0.015625)"/>
      </defs>
      <use xlink:href="#CMMI12-12" transform="scale(0.996264)"/>
      <use xlink:href="#CMR17-5b" transform="translate(79.398621 0) scale(0.996264)"/>
      <use xlink:href="#CMMI12-19" transform="translate(104.269679 0) scale(0.996264)"/>
      <use xlink:href="#CMR17-5d" transform="translate(163.18028 0) scale(0.996264)"/>
     </g>
    </g>
   </g>
   <g id="matplotlib.axis_2">
    <g id="ytick_1">
     <g id="line2d_13">
      <path d="M 79.65 292.2048 
L 573.48 292.2048 
" clip-path="url(#p450dd1745f)" style="fill: none; stroke-dasharray: 2.96,1.28; stroke-dashoffset: 0; stroke: #808080; stroke-width: 0.8"/>
     </g>
     <g id="line2d_14">
      <defs>
       <path id="me7cb77c3ad" d="M 0 0 
L -3.5 0 
" style="stroke: #000000; stroke-width: 0.8"/>
      </defs>
      <g>
       <use xlink:href="#me7cb77c3ad" x="79.65" y="292.2048" style="stroke: #000000; stroke-width: 0.8"/>
      </g>
     </g>
     <g id="text_8">
      <!-- $\mathdefault{10^{-4}}$ -->
      <g transform="translate(52.489427 295.664049) scale(0.1 -0.1)">
       <defs>
        <path id="CMSY10-0" d="M 4218 1472 
C 4326 1472 4442 1472 4442 1600 
C 4442 1728 4326 1728 4218 1728 
L 755 1728 
C 646 1728 531 1728 531 1600 
C 531 1472 646 1472 755 1472 
L 4218 1472 
z
" transform="scale(0.015625)"/>
       </defs>
       <use xlink:href="#CMR17-31" transform="scale(0.996264)"/>
       <use xlink:href="#CMR17-30" transform="translate(45.690477 0) scale(0.996264)"/>
       <use xlink:href="#CMSY10-0" transform="translate(91.380954 36.153639) scale(0.697382)"/>
       <use xlink:href="#CMR17-34" transform="translate(145.621947 36.153639) scale(0.697382)"/>
      </g>
     </g>
    </g>
    <g id="ytick_2">
     <g id="line2d_15">
      <path d="M 79.65 241.64352 
L 573.48 241.64352 
" clip-path="url(#p450dd1745f)" style="fill: none; stroke-dasharray: 2.96,1.28; stroke-dashoffset: 0; stroke: #808080; stroke-width: 0.8"/>
     </g>
     <g id="line2d_16">
      <g>
       <use xlink:href="#me7cb77c3ad" x="79.65" y="241.64352" style="stroke: #000000; stroke-width: 0.8"/>
      </g>
     </g>
     <g id="text_9">
      <!-- $\mathdefault{10^{-3}}$ -->
      <g transform="translate(52.489427 245.102769) scale(0.1 -0.1)">
       <defs>
        <path id="CMR17-33" d="M 1414 2157 
C 1984 2157 2234 1662 2234 1090 
C 2234 320 1824 25 1453 25 
C 1114 25 563 194 390 693 
C 422 680 454 680 486 680 
C 640 680 755 782 755 948 
C 755 1133 614 1216 486 1216 
C 378 1216 211 1165 211 926 
C 211 335 787 -128 1466 -128 
C 2176 -128 2720 430 2720 1085 
C 2720 1707 2208 2157 1600 2227 
C 2086 2328 2554 2756 2554 3329 
C 2554 3820 2048 4179 1472 4179 
C 890 4179 378 3829 378 3329 
C 378 3110 544 3072 627 3072 
C 762 3072 877 3155 877 3321 
C 877 3486 762 3569 627 3569 
C 602 3569 570 3569 544 3557 
C 730 3959 1235 4032 1459 4032 
C 1683 4032 2106 3925 2106 3320 
C 2106 3143 2080 2828 1862 2550 
C 1670 2304 1453 2304 1242 2284 
C 1210 2284 1062 2269 1037 2269 
C 992 2263 966 2257 966 2208 
C 966 2163 973 2157 1101 2157 
L 1414 2157 
z
" transform="scale(0.015625)"/>
       </defs>
       <use xlink:href="#CMR17-31" transform="scale(0.996264)"/>
       <use xlink:href="#CMR17-30" transform="translate(45.690477 0) scale(0.996264)"/>
       <use xlink:href="#CMSY10-0" transform="translate(91.380954 36.153639) scale(0.697382)"/>
       <use xlink:href="#CMR17-33" transform="translate(145.621947 36.153639) scale(0.697382)"/>
      </g>
     </g>
    </g>
    <g id="ytick_3">
     <g id="line2d_17">
      <path d="M 79.65 191.08224 
L 573.48 191.08224 
" clip-path="url(#p450dd1745f)" style="fill: none; stroke-dasharray: 2.96,1.28; stroke-dashoffset: 0; stroke: #808080; stroke-width: 0.8"/>
     </g>
     <g id="line2d_18">
      <g>
       <use xlink:href="#me7cb77c3ad" x="79.65" y="191.08224" style="stroke: #000000; stroke-width: 0.8"/>
      </g>
     </g>
     <g id="text_10">
      <!-- $\mathdefault{10^{-2}}$ -->
      <g transform="translate(52.489427 194.541489) scale(0.1 -0.1)">
       <use xlink:href="#CMR17-31" transform="scale(0.996264)"/>
       <use xlink:href="#CMR17-30" transform="translate(45.690477 0) scale(0.996264)"/>
       <use xlink:href="#CMSY10-0" transform="translate(91.380954 36.153639) scale(0.697382)"/>
       <use xlink:href="#CMR17-32" transform="translate(145.621947 36.153639) scale(0.697382)"/>
      </g>
     </g>
    </g>
    <g id="ytick_4">
     <g id="line2d_19">
      <path d="M 79.65 140.52096 
L 573.48 140.52096 
" clip-path="url(#p450dd1745f)" style="fill: none; stroke-dasharray: 2.96,1.28; stroke-dashoffset: 0; stroke: #808080; stroke-width: 0.8"/>
     </g>
     <g id="line2d_20">
      <g>
       <use xlink:href="#me7cb77c3ad" x="79.65" y="140.52096" style="stroke: #000000; stroke-width: 0.8"/>
      </g>
     </g>
     <g id="text_11">
      <!-- $\mathdefault{10^{-1}}$ -->
      <g transform="translate(52.489427 143.980209) scale(0.1 -0.1)">
       <use xlink:href="#CMR17-31" transform="scale(0.996264)"/>
       <use xlink:href="#CMR17-30" transform="translate(45.690477 0) scale(0.996264)"/>
       <use xlink:href="#CMSY10-0" transform="translate(91.380954 36.153639) scale(0.697382)"/>
       <use xlink:href="#CMR17-31" transform="translate(145.621947 36.153639) scale(0.697382)"/>
      </g>
     </g>
    </g>
    <g id="ytick_5">
     <g id="line2d_21">
      <path d="M 79.65 89.95968 
L 573.48 89.95968 
" clip-path="url(#p450dd1745f)" style="fill: none; stroke-dasharray: 2.96,1.28; stroke-dashoffset: 0; stroke: #808080; stroke-width: 0.8"/>
     </g>
     <g id="line2d_22">
      <g>
       <use xlink:href="#me7cb77c3ad" x="79.65" y="89.95968" style="stroke: #000000; stroke-width: 0.8"/>
      </g>
     </g>
     <g id="text_12">
      <!-- $\mathdefault{10^{0}}$ -->
      <g transform="translate(58.716092 93.418929) scale(0.1 -0.1)">
       <use xlink:href="#CMR17-31" transform="scale(0.996264)"/>
       <use xlink:href="#CMR17-30" transform="translate(45.690477 0) scale(0.996264)"/>
       <use xlink:href="#CMR17-30" transform="translate(91.380954 36.153639) scale(0.697382)"/>
      </g>
     </g>
    </g>
    <g id="ytick_6">
     <g id="line2d_23">
      <path d="M 79.65 39.3984 
L 573.48 39.3984 
" clip-path="url(#p450dd1745f)" style="fill: none; stroke-dasharray: 2.96,1.28; stroke-dashoffset: 0; stroke: #808080; stroke-width: 0.8"/>
     </g>
     <g id="line2d_24">
      <g>
       <use xlink:href="#me7cb77c3ad" x="79.65" y="39.3984" style="stroke: #000000; stroke-width: 0.8"/>
      </g>
     </g>
     <g id="text_13">
      <!-- $\mathdefault{10^{1}}$ -->
      <g transform="translate(58.716092 42.857649) scale(0.1 -0.1)">
       <use xlink:href="#CMR17-31" transform="scale(0.996264)"/>
       <use xlink:href="#CMR17-30" transform="translate(45.690477 0) scale(0.996264)"/>
       <use xlink:href="#CMR17-31" transform="translate(91.380954 36.153639) scale(0.697382)"/>
      </g>
     </g>
    </g>
    <g id="ytick_7">
     <g id="line2d_25">
      <path d="M 79.65 276.984338 
L 573.48 276.984338 
" clip-path="url(#p450dd1745f)" style="fill: none; stroke-dasharray: 2.96,1.28; stroke-dashoffset: 0; stroke: #808080; stroke-width: 0.8"/>
     </g>
     <g id="line2d_26">
      <defs>
       <path id="mc1e68f5bd8" d="M 0 0 
L -2 0 
" style="stroke: #000000; stroke-width: 0.6"/>
      </defs>
      <g>
       <use xlink:href="#mc1e68f5bd8" x="79.65" y="276.984338" style="stroke: #000000; stroke-width: 0.6"/>
      </g>
     </g>
    </g>
    <g id="ytick_8">
     <g id="line2d_27">
      <path d="M 79.65 268.080939 
L 573.48 268.080939 
" clip-path="url(#p450dd1745f)" style="fill: none; stroke-dasharray: 2.96,1.28; stroke-dashoffset: 0; stroke: #808080; stroke-width: 0.8"/>
     </g>
     <g id="line2d_28">
      <g>
       <use xlink:href="#mc1e68f5bd8" x="79.65" y="268.080939" style="stroke: #000000; stroke-width: 0.6"/>
      </g>
     </g>
    </g>
    <g id="ytick_9">
     <g id="line2d_29">
      <path d="M 79.65 261.763876 
L 573.48 261.763876 
" clip-path="url(#p450dd1745f)" style="fill: none; stroke-dasharray: 2.96,1.28; stroke-dashoffset: 0; stroke: #808080; stroke-width: 0.8"/>
     </g>
     <g id="line2d_30">
      <g>
       <use xlink:href="#mc1e68f5bd8" x="79.65" y="261.763876" style="stroke: #000000; stroke-width: 0.6"/>
      </g>
     </g>
    </g>
    <g id="ytick_10">
     <g id="line2d_31">
      <path d="M 79.65 256.863982 
L 573.48 256.863982 
" clip-path="url(#p450dd1745f)" style="fill: none; stroke-dasharray: 2.96,1.28; stroke-dashoffset: 0; stroke: #808080; stroke-width: 0.8"/>
     </g>
     <g id="line2d_32">
      <g>
       <use xlink:href="#mc1e68f5bd8" x="79.65" y="256.863982" style="stroke: #000000; stroke-width: 0.6"/>
      </g>
     </g>
    </g>
    <g id="ytick_11">
     <g id="line2d_33">
      <path d="M 79.65 252.860477 
L 573.48 252.860477 
" clip-path="url(#p450dd1745f)" style="fill: none; stroke-dasharray: 2.96,1.28; stroke-dashoffset: 0; stroke: #808080; stroke-width: 0.8"/>
     </g>
     <g id="line2d_34">
      <g>
       <use xlink:href="#mc1e68f5bd8" x="79.65" y="252.860477" style="stroke: #000000; stroke-width: 0.6"/>
      </g>
     </g>
    </g>
    <g id="ytick_12">
     <g id="line2d_35">
      <path d="M 79.65 249.475561 
L 573.48 249.475561 
" clip-path="url(#p450dd1745f)" style="fill: none; stroke-dasharray: 2.96,1.28; stroke-dashoffset: 0; stroke: #808080; stroke-width: 0.8"/>
     </g>
     <g id="line2d_36">
      <g>
       <use xlink:href="#mc1e68f5bd8" x="79.65" y="249.475561" style="stroke: #000000; stroke-width: 0.6"/>
      </g>
     </g>
    </g>
    <g id="ytick_13">
     <g id="line2d_37">
      <path d="M 79.65 246.543414 
L 573.48 246.543414 
" clip-path="url(#p450dd1745f)" style="fill: none; stroke-dasharray: 2.96,1.28; stroke-dashoffset: 0; stroke: #808080; stroke-width: 0.8"/>
     </g>
     <g id="line2d_38">
      <g>
       <use xlink:href="#mc1e68f5bd8" x="79.65" y="246.543414" style="stroke: #000000; stroke-width: 0.6"/>
      </g>
     </g>
    </g>
    <g id="ytick_14">
     <g id="line2d_39">
      <path d="M 79.65 243.957077 
L 573.48 243.957077 
" clip-path="url(#p450dd1745f)" style="fill: none; stroke-dasharray: 2.96,1.28; stroke-dashoffset: 0; stroke: #808080; stroke-width: 0.8"/>
     </g>
     <g id="line2d_40">
      <g>
       <use xlink:href="#mc1e68f5bd8" x="79.65" y="243.957077" style="stroke: #000000; stroke-width: 0.6"/>
      </g>
     </g>
    </g>
    <g id="ytick_15">
     <g id="line2d_41">
      <path d="M 79.65 226.423058 
L 573.48 226.423058 
" clip-path="url(#p450dd1745f)" style="fill: none; stroke-dasharray: 2.96,1.28; stroke-dashoffset: 0; stroke: #808080; stroke-width: 0.8"/>
     </g>
     <g id="line2d_42">
      <g>
       <use xlink:href="#mc1e68f5bd8" x="79.65" y="226.423058" style="stroke: #000000; stroke-width: 0.6"/>
      </g>
     </g>
    </g>
    <g id="ytick_16">
     <g id="line2d_43">
      <path d="M 79.65 217.519659 
L 573.48 217.519659 
" clip-path="url(#p450dd1745f)" style="fill: none; stroke-dasharray: 2.96,1.28; stroke-dashoffset: 0; stroke: #808080; stroke-width: 0.8"/>
     </g>
     <g id="line2d_44">
      <g>
       <use xlink:href="#mc1e68f5bd8" x="79.65" y="217.519659" style="stroke: #000000; stroke-width: 0.6"/>
      </g>
     </g>
    </g>
    <g id="ytick_17">
     <g id="line2d_45">
      <path d="M 79.65 211.202596 
L 573.48 211.202596 
" clip-path="url(#p450dd1745f)" style="fill: none; stroke-dasharray: 2.96,1.28; stroke-dashoffset: 0; stroke: #808080; stroke-width: 0.8"/>
     </g>
     <g id="line2d_46">
      <g>
       <use xlink:href="#mc1e68f5bd8" x="79.65" y="211.202596" style="stroke: #000000; stroke-width: 0.6"/>
      </g>
     </g>
    </g>
    <g id="ytick_18">
     <g id="line2d_47">
      <path d="M 79.65 206.302702 
L 573.48 206.302702 
" clip-path="url(#p450dd1745f)" style="fill: none; stroke-dasharray: 2.96,1.28; stroke-dashoffset: 0; stroke: #808080; stroke-width: 0.8"/>
     </g>
     <g id="line2d_48">
      <g>
       <use xlink:href="#mc1e68f5bd8" x="79.65" y="206.302702" style="stroke: #000000; stroke-width: 0.6"/>
      </g>
     </g>
    </g>
    <g id="ytick_19">
     <g id="line2d_49">
      <path d="M 79.65 202.299197 
L 573.48 202.299197 
" clip-path="url(#p450dd1745f)" style="fill: none; stroke-dasharray: 2.96,1.28; stroke-dashoffset: 0; stroke: #808080; stroke-width: 0.8"/>
     </g>
     <g id="line2d_50">
      <g>
       <use xlink:href="#mc1e68f5bd8" x="79.65" y="202.299197" style="stroke: #000000; stroke-width: 0.6"/>
      </g>
     </g>
    </g>
    <g id="ytick_20">
     <g id="line2d_51">
      <path d="M 79.65 198.914281 
L 573.48 198.914281 
" clip-path="url(#p450dd1745f)" style="fill: none; stroke-dasharray: 2.96,1.28; stroke-dashoffset: 0; stroke: #808080; stroke-width: 0.8"/>
     </g>
     <g id="line2d_52">
      <g>
       <use xlink:href="#mc1e68f5bd8" x="79.65" y="198.914281" style="stroke: #000000; stroke-width: 0.6"/>
      </g>
     </g>
    </g>
    <g id="ytick_21">
     <g id="line2d_53">
      <path d="M 79.65 195.982134 
L 573.48 195.982134 
" clip-path="url(#p450dd1745f)" style="fill: none; stroke-dasharray: 2.96,1.28; stroke-dashoffset: 0; stroke: #808080; stroke-width: 0.8"/>
     </g>
     <g id="line2d_54">
      <g>
       <use xlink:href="#mc1e68f5bd8" x="79.65" y="195.982134" style="stroke: #000000; stroke-width: 0.6"/>
      </g>
     </g>
    </g>
    <g id="ytick_22">
     <g id="line2d_55">
      <path d="M 79.65 193.395797 
L 573.48 193.395797 
" clip-path="url(#p450dd1745f)" style="fill: none; stroke-dasharray: 2.96,1.28; stroke-dashoffset: 0; stroke: #808080; stroke-width: 0.8"/>
     </g>
     <g id="line2d_56">
      <g>
       <use xlink:href="#mc1e68f5bd8" x="79.65" y="193.395797" style="stroke: #000000; stroke-width: 0.6"/>
      </g>
     </g>
    </g>
    <g id="ytick_23">
     <g id="line2d_57">
      <path d="M 79.65 175.861778 
L 573.48 175.861778 
" clip-path="url(#p450dd1745f)" style="fill: none; stroke-dasharray: 2.96,1.28; stroke-dashoffset: 0; stroke: #808080; stroke-width: 0.8"/>
     </g>
     <g id="line2d_58">
      <g>
       <use xlink:href="#mc1e68f5bd8" x="79.65" y="175.861778" style="stroke: #000000; stroke-width: 0.6"/>
      </g>
     </g>
    </g>
    <g id="ytick_24">
     <g id="line2d_59">
      <path d="M 79.65 166.958379 
L 573.48 166.958379 
" clip-path="url(#p450dd1745f)" style="fill: none; stroke-dasharray: 2.96,1.28; stroke-dashoffset: 0; stroke: #808080; stroke-width: 0.8"/>
     </g>
     <g id="line2d_60">
      <g>
       <use xlink:href="#mc1e68f5bd8" x="79.65" y="166.958379" style="stroke: #000000; stroke-width: 0.6"/>
      </g>
     </g>
    </g>
    <g id="ytick_25">
     <g id="line2d_61">
      <path d="M 79.65 160.641316 
L 573.48 160.641316 
" clip-path="url(#p450dd1745f)" style="fill: none; stroke-dasharray: 2.96,1.28; stroke-dashoffset: 0; stroke: #808080; stroke-width: 0.8"/>
     </g>
     <g id="line2d_62">
      <g>
       <use xlink:href="#mc1e68f5bd8" x="79.65" y="160.641316" style="stroke: #000000; stroke-width: 0.6"/>
      </g>
     </g>
    </g>
    <g id="ytick_26">
     <g id="line2d_63">
      <path d="M 79.65 155.741422 
L 573.48 155.741422 
" clip-path="url(#p450dd1745f)" style="fill: none; stroke-dasharray: 2.96,1.28; stroke-dashoffset: 0; stroke: #808080; stroke-width: 0.8"/>
     </g>
     <g id="line2d_64">
      <g>
       <use xlink:href="#mc1e68f5bd8" x="79.65" y="155.741422" style="stroke: #000000; stroke-width: 0.6"/>
      </g>
     </g>
    </g>
    <g id="ytick_27">
     <g id="line2d_65">
      <path d="M 79.65 151.737917 
L 573.48 151.737917 
" clip-path="url(#p450dd1745f)" style="fill: none; stroke-dasharray: 2.96,1.28; stroke-dashoffset: 0; stroke: #808080; stroke-width: 0.8"/>
     </g>
     <g id="line2d_66">
      <g>
       <use xlink:href="#mc1e68f5bd8" x="79.65" y="151.737917" style="stroke: #000000; stroke-width: 0.6"/>
      </g>
     </g>
    </g>
    <g id="ytick_28">
     <g id="line2d_67">
      <path d="M 79.65 148.353001 
L 573.48 148.353001 
" clip-path="url(#p450dd1745f)" style="fill: none; stroke-dasharray: 2.96,1.28; stroke-dashoffset: 0; stroke: #808080; stroke-width: 0.8"/>
     </g>
     <g id="line2d_68">
      <g>
       <use xlink:href="#mc1e68f5bd8" x="79.65" y="148.353001" style="stroke: #000000; stroke-width: 0.6"/>
      </g>
     </g>
    </g>
    <g id="ytick_29">
     <g id="line2d_69">
      <path d="M 79.65 145.420854 
L 573.48 145.420854 
" clip-path="url(#p450dd1745f)" style="fill: none; stroke-dasharray: 2.96,1.28; stroke-dashoffset: 0; stroke: #808080; stroke-width: 0.8"/>
     </g>
     <g id="line2d_70">
      <g>
       <use xlink:href="#mc1e68f5bd8" x="79.65" y="145.420854" style="stroke: #000000; stroke-width: 0.6"/>
      </g>
     </g>
    </g>
    <g id="ytick_30">
     <g id="line2d_71">
      <path d="M 79.65 142.834517 
L 573.48 142.834517 
" clip-path="url(#p450dd1745f)" style="fill: none; stroke-dasharray: 2.96,1.28; stroke-dashoffset: 0; stroke: #808080; stroke-width: 0.8"/>
     </g>
     <g id="line2d_72">
      <g>
       <use xlink:href="#mc1e68f5bd8" x="79.65" y="142.834517" style="stroke: #000000; stroke-width: 0.6"/>
      </g>
     </g>
    </g>
    <g id="ytick_31">
     <g id="line2d_73">
      <path d="M 79.65 125.300498 
L 573.48 125.300498 
" clip-path="url(#p450dd1745f)" style="fill: none; stroke-dasharray: 2.96,1.28; stroke-dashoffset: 0; stroke: #808080; stroke-width: 0.8"/>
     </g>
     <g id="line2d_74">
      <g>
       <use xlink:href="#mc1e68f5bd8" x="79.65" y="125.300498" style="stroke: #000000; stroke-width: 0.6"/>
      </g>
     </g>
    </g>
    <g id="ytick_32">
     <g id="line2d_75">
      <path d="M 79.65 116.397099 
L 573.48 116.397099 
" clip-path="url(#p450dd1745f)" style="fill: none; stroke-dasharray: 2.96,1.28; stroke-dashoffset: 0; stroke: #808080; stroke-width: 0.8"/>
     </g>
     <g id="line2d_76">
      <g>
       <use xlink:href="#mc1e68f5bd8" x="79.65" y="116.397099" style="stroke: #000000; stroke-width: 0.6"/>
      </g>
     </g>
    </g>
    <g id="ytick_33">
     <g id="line2d_77">
      <path d="M 79.65 110.080036 
L 573.48 110.080036 
" clip-path="url(#p450dd1745f)" style="fill: none; stroke-dasharray: 2.96,1.28; stroke-dashoffset: 0; stroke: #808080; stroke-width: 0.8"/>
     </g>
     <g id="line2d_78">
      <g>
       <use xlink:href="#mc1e68f5bd8" x="79.65" y="110.080036" style="stroke: #000000; stroke-width: 0.6"/>
      </g>
     </g>
    </g>
    <g id="ytick_34">
     <g id="line2d_79">
      <path d="M 79.65 105.180142 
L 573.48 105.180142 
" clip-path="url(#p450dd1745f)" style="fill: none; stroke-dasharray: 2.96,1.28; stroke-dashoffset: 0; stroke: #808080; stroke-width: 0.8"/>
     </g>
     <g id="line2d_80">
      <g>
       <use xlink:href="#mc1e68f5bd8" x="79.65" y="105.180142" style="stroke: #000000; stroke-width: 0.6"/>
      </g>
     </g>
    </g>
    <g id="ytick_35">
     <g id="line2d_81">
      <path d="M 79.65 101.176637 
L 573.48 101.176637 
" clip-path="url(#p450dd1745f)" style="fill: none; stroke-dasharray: 2.96,1.28; stroke-dashoffset: 0; stroke: #808080; stroke-width: 0.8"/>
     </g>
     <g id="line2d_82">
      <g>
       <use xlink:href="#mc1e68f5bd8" x="79.65" y="101.176637" style="stroke: #000000; stroke-width: 0.6"/>
      </g>
     </g>
    </g>
    <g id="ytick_36">
     <g id="line2d_83">
      <path d="M 79.65 97.791721 
L 573.48 97.791721 
" clip-path="url(#p450dd1745f)" style="fill: none; stroke-dasharray: 2.96,1.28; stroke-dashoffset: 0; stroke: #808080; stroke-width: 0.8"/>
     </g>
     <g id="line2d_84">
      <g>
       <use xlink:href="#mc1e68f5bd8" x="79.65" y="97.791721" style="stroke: #000000; stroke-width: 0.6"/>
      </g>
     </g>
    </g>
    <g id="ytick_37">
     <g id="line2d_85">
      <path d="M 79.65 94.859574 
L 573.48 94.859574 
" clip-path="url(#p450dd1745f)" style="fill: none; stroke-dasharray: 2.96,1.28; stroke-dashoffset: 0; stroke: #808080; stroke-width: 0.8"/>
     </g>
     <g id="line2d_86">
      <g>
       <use xlink:href="#mc1e68f5bd8" x="79.65" y="94.859574" style="stroke: #000000; stroke-width: 0.6"/>
      </g>
     </g>
    </g>
    <g id="ytick_38">
     <g id="line2d_87">
      <path d="M 79.65 92.273237 
L 573.48 92.273237 
" clip-path="url(#p450dd1745f)" style="fill: none; stroke-dasharray: 2.96,1.28; stroke-dashoffset: 0; stroke: #808080; stroke-width: 0.8"/>
     </g>
     <g id="line2d_88">
      <g>
       <use xlink:href="#mc1e68f5bd8" x="79.65" y="92.273237" style="stroke: #000000; stroke-width: 0.6"/>
      </g>
     </g>
    </g>
    <g id="ytick_39">
     <g id="line2d_89">
      <path d="M 79.65 74.739218 
L 573.48 74.739218 
" clip-path="url(#p450dd1745f)" style="fill: none; stroke-dasharray: 2.96,1.28; stroke-dashoffset: 0; stroke: #808080; stroke-width: 0.8"/>
     </g>
     <g id="line2d_90">
      <g>
       <use xlink:href="#mc1e68f5bd8" x="79.65" y="74.739218" style="stroke: #000000; stroke-width: 0.6"/>
      </g>
     </g>
    </g>
    <g id="ytick_40">
     <g id="line2d_91">
      <path d="M 79.65 65.835819 
L 573.48 65.835819 
" clip-path="url(#p450dd1745f)" style="fill: none; stroke-dasharray: 2.96,1.28; stroke-dashoffset: 0; stroke: #808080; stroke-width: 0.8"/>
     </g>
     <g id="line2d_92">
      <g>
       <use xlink:href="#mc1e68f5bd8" x="79.65" y="65.835819" style="stroke: #000000; stroke-width: 0.6"/>
      </g>
     </g>
    </g>
    <g id="ytick_41">
     <g id="line2d_93">
      <path d="M 79.65 59.518756 
L 573.48 59.518756 
" clip-path="url(#p450dd1745f)" style="fill: none; stroke-dasharray: 2.96,1.28; stroke-dashoffset: 0; stroke: #808080; stroke-width: 0.8"/>
     </g>
     <g id="line2d_94">
      <g>
       <use xlink:href="#mc1e68f5bd8" x="79.65" y="59.518756" style="stroke: #000000; stroke-width: 0.6"/>
      </g>
     </g>
    </g>
    <g id="ytick_42">
     <g id="line2d_95">
      <path d="M 79.65 54.618862 
L 573.48 54.618862 
" clip-path="url(#p450dd1745f)" style="fill: none; stroke-dasharray: 2.96,1.28; stroke-dashoffset: 0; stroke: #808080; stroke-width: 0.8"/>
     </g>
     <g id="line2d_96">
      <g>
       <use xlink:href="#mc1e68f5bd8" x="79.65" y="54.618862" style="stroke: #000000; stroke-width: 0.6"/>
      </g>
     </g>
    </g>
    <g id="ytick_43">
     <g id="line2d_97">
      <path d="M 79.65 50.615357 
L 573.48 50.615357 
" clip-path="url(#p450dd1745f)" style="fill: none; stroke-dasharray: 2.96,1.28; stroke-dashoffset: 0; stroke: #808080; stroke-width: 0.8"/>
     </g>
     <g id="line2d_98">
      <g>
       <use xlink:href="#mc1e68f5bd8" x="79.65" y="50.615357" style="stroke: #000000; stroke-width: 0.6"/>
      </g>
     </g>
    </g>
    <g id="ytick_44">
     <g id="line2d_99">
      <path d="M 79.65 47.230441 
L 573.48 47.230441 
" clip-path="url(#p450dd1745f)" style="fill: none; stroke-dasharray: 2.96,1.28; stroke-dashoffset: 0; stroke: #808080; stroke-width: 0.8"/>
     </g>
     <g id="line2d_100">
      <g>
       <use xlink:href="#mc1e68f5bd8" x="79.65" y="47.230441" style="stroke: #000000; stroke-width: 0.6"/>
      </g>
     </g>
    </g>
    <g id="ytick_45">
     <g id="line2d_101">
      <path d="M 79.65 44.298294 
L 573.48 44.298294 
" clip-path="url(#p450dd1745f)" style="fill: none; stroke-dasharray: 2.96,1.28; stroke-dashoffset: 0; stroke: #808080; stroke-width: 0.8"/>
     </g>
     <g id="line2d_102">
      <g>
       <use xlink:href="#mc1e68f5bd8" x="79.65" y="44.298294" style="stroke: #000000; stroke-width: 0.6"/>
      </g>
     </g>
    </g>
    <g id="ytick_46">
     <g id="line2d_103">
      <path d="M 79.65 41.711957 
L 573.48 41.711957 
" clip-path="url(#p450dd1745f)" style="fill: none; stroke-dasharray: 2.96,1.28; stroke-dashoffset: 0; stroke: #808080; stroke-width: 0.8"/>
     </g>
     <g id="line2d_104">
      <g>
       <use xlink:href="#mc1e68f5bd8" x="79.65" y="41.711957" style="stroke: #000000; stroke-width: 0.6"/>
      </g>
     </g>
    </g>
    <g id="text_14">
     <!-- d$\sigma$/d$\Omega\ [r_e^2]$ -->
     <g transform="translate(45.998767 189.110637) rotate(-90) scale(0.1 -0.1)">
      <defs>
       <path id="CMSS17-64" d="M 2611 4416 
L 2138 4416 
L 2138 2438 
C 1939 2603 1613 2756 1254 2756 
C 672 2756 211 2131 211 1347 
C 211 562 666 -64 1235 -64 
C 1677 -64 1971 172 2125 306 
L 2125 -13 
L 2611 -13 
L 2611 4416 
z
M 2125 836 
C 2125 747 2125 653 1926 482 
C 1798 375 1645 325 1498 325 
C 1152 325 698 576 698 1340 
C 698 2134 1210 2368 1562 2368 
C 1798 2368 1990 2254 2125 2065 
L 2125 836 
z
" transform="scale(0.015625)"/>
       <path id="CMMI12-1b" d="M 3251 2408 
C 3334 2408 3546 2408 3546 2612 
C 3546 2752 3424 2752 3309 2752 
L 1894 2752 
C 934 2752 243 1686 243 932 
C 243 390 595 -64 1171 -64 
C 1926 -64 2752 747 2752 1705 
C 2752 1954 2694 2196 2541 2408 
L 3251 2408 
z
M 1178 64 
C 851 64 614 313 614 754 
C 614 1137 845 2408 1786 2408 
C 2061 2408 2368 2274 2368 1781 
C 2368 1558 2266 1021 2042 652 
C 1811 275 1466 64 1178 64 
z
" transform="scale(0.015625)"/>
       <path id="CMSS17-2f" d="M 2637 4545 
C 2669 4627 2669 4640 2669 4653 
C 2669 4729 2611 4768 2560 4768 
C 2483 4768 2458 4717 2432 4640 
L 365 -1377 
C 333 -1460 333 -1473 333 -1486 
C 333 -1562 390 -1600 442 -1600 
C 518 -1600 544 -1549 570 -1473 
L 2637 4545 
z
" transform="scale(0.015625)"/>
       <path id="CMR17-a" d="M 4038 935 
L 3923 935 
C 3866 641 3846 563 3814 461 
C 3782 365 3763 314 3392 314 
L 2874 314 
C 2944 686 3098 961 3366 1391 
C 3699 1935 3974 2377 3974 2910 
C 3974 3775 3155 4480 2138 4480 
C 1094 4480 294 3768 294 2910 
C 294 2377 576 1922 890 1416 
C 1171 961 1325 686 1395 314 
L 877 314 
C 512 314 493 365 461 454 
C 422 557 410 641 346 935 
L 230 935 
L 416 0 
L 1382 0 
C 1517 0 1523 6 1523 102 
C 1523 558 1286 1154 1178 1429 
C 973 1929 781 2416 781 2916 
C 781 3871 1466 4377 2131 4377 
C 2829 4377 3488 3851 3488 2916 
C 3488 2422 3315 1981 3078 1397 
C 2976 1135 2746 551 2746 102 
C 2746 0 2752 0 2886 0 
L 3853 0 
L 4038 935 
z
" transform="scale(0.015625)"/>
       <path id="CMMI12-72" d="M 2490 2612 
C 2291 2574 2189 2433 2189 2293 
C 2189 2139 2310 2088 2400 2088 
C 2579 2088 2726 2242 2726 2433 
C 2726 2638 2528 2816 2208 2816 
C 1952 2816 1658 2701 1389 2312 
C 1344 2650 1088 2816 832 2816 
C 582 2816 454 2625 378 2484 
C 269 2254 173 1871 173 1839 
C 173 1814 198 1782 243 1782 
C 294 1782 301 1788 339 1935 
C 435 2318 557 2689 813 2689 
C 966 2689 1011 2580 1011 2395 
C 1011 2254 947 2005 902 1807 
L 723 1118 
C 698 996 627 709 595 594 
C 550 428 480 128 480 96 
C 480 6 550 -64 646 -64 
C 717 -64 838 -19 877 109 
C 896 160 1133 1124 1171 1271 
C 1203 1411 1242 1546 1274 1686 
C 1299 1775 1325 1878 1344 1961 
C 1363 2018 1536 2331 1696 2472 
C 1773 2542 1939 2689 2202 2689 
C 2304 2689 2406 2670 2490 2612 
z
" transform="scale(0.015625)"/>
       <path id="CMMI12-65" d="M 1146 1479 
C 1318 1479 1754 1479 2061 1595 
C 2547 1783 2592 2158 2592 2274 
C 2592 2558 2349 2816 1926 2816 
C 1254 2816 288 2210 288 1073 
C 288 402 672 -64 1254 -64 
C 2125 -64 2675 609 2675 692 
C 2675 730 2637 762 2611 762 
C 2592 762 2586 756 2528 699 
C 2118 159 1510 64 1267 64 
C 902 64 710 350 710 822 
C 710 911 710 1071 806 1479 
L 1146 1479 
z
M 838 1600 
C 1114 2592 1722 2689 1926 2689 
C 2208 2689 2400 2522 2400 2277 
C 2400 1600 1376 1600 1107 1600 
L 838 1600 
z
" transform="scale(0.015625)"/>
      </defs>
      <use xlink:href="#CMSS17-64" transform="scale(0.996264)"/>
      <use xlink:href="#CMMI12-1b" transform="translate(48.204943 0) scale(0.996264)"/>
      <use xlink:href="#CMSS17-2f" transform="translate(107.224997 0) scale(0.996264)"/>
      <use xlink:href="#CMSS17-64" transform="translate(154.06862 0) scale(0.996264)"/>
      <use xlink:href="#CMR17-a" transform="translate(202.273563 0) scale(0.996264)"/>
      <use xlink:href="#CMR17-5b" transform="translate(300.012557 0) scale(0.996264)"/>
      <use xlink:href="#CMMI12-72" transform="translate(324.883615 0) scale(0.996264)"/>
      <use xlink:href="#CMR17-32" transform="translate(371.554227 36.153639) scale(0.697382)"/>
      <use xlink:href="#CMMI12-65" transform="translate(368.844509 -24.62935) scale(0.697382)"/>
      <use xlink:href="#CMR17-5d" transform="translate(404.035541 0) scale(0.996264)"/>
     </g>
    </g>
   </g>
   <g id="line2d_105">
    <path d="M 102.096818 89.95968 
L 116.477162 90.070769 
L 130.857506 90.402885 
L 145.23785 90.952406 
L 160.06758 91.7398 
L 175.346695 92.773313 
L 191.524582 94.092251 
L 209.500012 95.787721 
L 232.418686 98.191023 
L 268.818931 102.02355 
L 283.648661 103.337942 
L 295.782076 104.199102 
L 307.01672 104.775537 
L 317.352592 105.089197 
L 327.688464 105.178785 
L 338.024337 105.039689 
L 348.360209 104.679047 
L 359.594853 104.056977 
L 371.728268 103.155183 
L 386.108612 101.849209 
L 405.432199 99.847166 
L 449.472002 95.213611 
L 467.447432 93.591106 
L 483.625319 92.352542 
L 498.904435 91.403478 
L 513.734165 90.70329 
L 528.114509 90.241478 
L 542.494853 89.998865 
L 551.033182 89.95968 
L 551.033182 89.95968 
" clip-path="url(#p450dd1745f)" style="fill: none; stroke: #1f77b4; stroke-width: 1.5; stroke-linecap: square"/>
   </g>
   <g id="line2d_106">
    <path d="M 102.096818 89.95968 
L 116.477162 90.072991 
L 130.857506 90.411748 
L 145.23785 90.972261 
L 160.06758 91.775422 
L 175.346695 92.8297 
L 191.524582 94.175351 
L 209.050627 95.859969 
L 231.519914 98.26141 
L 270.167088 102.421241 
L 284.547432 103.718946 
L 296.680848 104.598884 
L 307.915491 105.190124 
L 318.251364 105.515805 
L 328.587236 105.616651 
L 338.923108 105.488919 
L 349.25898 105.140593 
L 360.493624 104.533802 
L 372.627039 103.651365 
L 387.007383 102.37247 
L 406.780356 100.36576 
L 449.472002 95.974684 
L 467.447432 94.384864 
L 483.625319 93.170873 
L 498.904435 92.240506 
L 513.734165 91.55407 
L 528.563894 91.090613 
L 542.944238 90.859526 
L 551.033182 90.825046 
L 551.033182 90.825046 
" clip-path="url(#p450dd1745f)" style="fill: none; stroke: #ff7f0e; stroke-width: 1.5; stroke-linecap: square"/>
   </g>
   <g id="line2d_107">
    <path d="M 102.096818 89.95968 
L 115.578391 90.07063 
L 129.059963 90.402436 
L 142.541536 90.951862 
L 156.472494 91.742075 
L 170.852838 92.78455 
L 185.682568 94.084075 
L 201.860455 95.732171 
L 220.28527 97.843325 
L 250.394115 101.564984 
L 271.964631 104.125531 
L 286.344975 105.610792 
L 298.478391 106.642178 
L 309.263649 107.343883 
L 319.599521 107.799643 
L 329.935393 108.028912 
L 340.271265 108.029074 
L 350.607138 107.809175 
L 361.841781 107.343468 
L 373.975197 106.615533 
L 388.355541 105.521958 
L 407.679128 103.811513 
L 454.415246 99.59294 
L 472.840061 98.197753 
L 489.91672 97.127575 
L 506.094607 96.337671 
L 521.823108 95.793052 
L 537.102224 95.482703 
L 551.033182 95.390997 
L 551.033182 95.390997 
" clip-path="url(#p450dd1745f)" style="fill: none; stroke: #2ca02c; stroke-width: 1.5; stroke-linecap: square"/>
   </g>
   <g id="line2d_108">
    <path d="M 102.096818 89.95968 
L 112.43269 90.070341 
L 122.768563 90.401162 
L 133.104435 90.94865 
L 143.889693 91.7446 
L 154.674951 92.760693 
L 165.909595 94.03993 
L 177.593624 95.590836 
L 190.176425 97.485274 
L 204.107383 99.811057 
L 220.734656 102.820404 
L 274.21156 112.688056 
L 286.344975 114.592993 
L 297.579619 116.13381 
L 307.915491 117.331411 
L 318.251364 118.300768 
L 328.13785 119.008853 
L 338.473722 119.524681 
L 349.25898 119.833911 
L 360.493624 119.934356 
L 373.076425 119.821502 
L 387.906155 119.453271 
L 406.780356 118.743035 
L 446.775688 116.936651 
L 475.536376 115.773573 
L 498.904435 115.052046 
L 520.474951 114.606261 
L 541.596081 114.391874 
L 551.033182 114.369158 
L 551.033182 114.369158 
" clip-path="url(#p450dd1745f)" style="fill: none; stroke: #d62728; stroke-width: 1.5; stroke-linecap: square"/>
   </g>
   <g id="line2d_109">
    <path d="M 102.096818 89.95968 
L 107.489447 90.074021 
L 112.882076 90.414893 
L 118.274705 90.975951 
L 124.11672 91.820268 
L 129.958735 92.893373 
L 136.250135 94.280297 
L 142.990921 95.998659 
L 150.630479 98.186962 
L 159.618194 101.010784 
L 171.302224 104.93722 
L 205.455541 116.561658 
L 216.690184 120.07598 
L 227.026057 123.085917 
L 237.361929 125.862154 
L 247.248415 128.292997 
L 257.584287 130.602097 
L 267.92016 132.682998 
L 278.705418 134.625849 
L 289.940061 136.421049 
L 301.624091 138.064139 
L 314.206892 139.606483 
L 327.688464 141.030309 
L 342.068808 142.324658 
L 357.79731 143.51572 
L 375.323354 144.612642 
L 394.646941 145.591644 
L 416.217457 146.454195 
L 440.034902 147.181089 
L 466.998047 147.776521 
L 496.657506 148.206716 
L 529.01328 148.452084 
L 551.033182 148.499059 
L 551.033182 148.499059 
" clip-path="url(#p450dd1745f)" style="fill: none; stroke: #9467bd; stroke-width: 1.5; stroke-linecap: square"/>
   </g>
   <g id="line2d_110">
    <path d="M 102.096818 89.95968 
L 104.343747 90.079121 
L 106.590676 90.434639 
L 108.837604 91.017991 
L 111.084533 91.815983 
L 113.780848 93.032185 
L 116.477162 94.496262 
L 119.622862 96.46403 
L 123.217948 98.97459 
L 128.161192 102.716866 
L 145.23785 115.899443 
L 151.079865 120.011475 
L 156.92188 123.836852 
L 162.763894 127.382314 
L 168.605909 130.668423 
L 174.89731 133.946105 
L 181.638096 137.191758 
L 188.378882 140.195651 
L 195.569054 143.166376 
L 203.208612 146.091166 
L 211.746941 149.11267 
L 220.734656 152.045929 
L 230.171757 154.886161 
L 240.058243 157.629313 
L 250.394115 160.271897 
L 261.628759 162.912183 
L 273.312789 165.429537 
L 285.89559 167.907936 
L 298.927776 170.247147 
L 312.858735 172.517758 
L 327.239079 174.637151 
L 342.518194 176.66333 
L 358.696081 178.579013 
L 375.323354 180.323958 
L 392.849398 181.938664 
L 411.274214 183.407937 
L 430.148415 184.688929 
L 449.921388 185.804594 
L 470.143747 186.720853 
L 490.815491 187.434939 
L 511.936622 187.941995 
L 533.507138 188.234786 
L 551.033182 188.308138 
L 551.033182 188.308138 
" clip-path="url(#p450dd1745f)" style="fill: none; stroke: #8c564b; stroke-width: 1.5; stroke-linecap: square"/>
   </g>
   <g id="line2d_111">
    <path d="M 102.096818 89.95968 
L 102.99559 90.087333 
L 103.894361 90.466994 
L 104.793133 91.088984 
L 105.691904 91.937877 
L 107.040061 93.59145 
L 108.388219 95.62737 
L 110.185762 98.781004 
L 112.882076 104.039807 
L 118.274705 114.665869 
L 121.420405 120.308632 
L 124.11672 124.726491 
L 127.26242 129.423851 
L 130.40812 133.690994 
L 133.553821 137.592883 
L 137.148907 141.67587 
L 140.743993 145.420605 
L 144.788464 149.292829 
L 148.832936 152.858524 
L 153.326794 156.513885 
L 157.820651 159.891791 
L 162.763894 163.33118 
L 168.156523 166.797765 
L 173.549152 170.006136 
L 179.391167 173.228611 
L 185.682568 176.442197 
L 192.423354 179.627827 
L 199.613526 182.769861 
L 207.253084 185.855585 
L 215.342027 188.874726 
L 223.880356 191.819011 
L 232.868071 194.681784 
L 242.305172 197.457659 
L 252.641044 200.259264 
L 263.426302 202.947411 
L 274.660946 205.520985 
L 286.794361 208.069391 
L 299.377162 210.485864 
L 312.858735 212.845945 
L 326.789693 215.060794 
L 341.619423 217.19267 
L 357.347924 219.22281 
L 373.525811 221.084782 
L 390.602469 222.822007 
L 408.128514 224.379926 
L 426.103943 225.757569 
L 444.978145 226.979162 
L 464.301732 228.004326 
L 484.074705 228.828295 
L 504.297064 229.444559 
L 524.519423 229.838413 
L 545.191167 230.015444 
L 551.033182 230.024464 
L 551.033182 230.024464 
" clip-path="url(#p450dd1745f)" style="fill: none; stroke: #e377c2; stroke-width: 1.5; stroke-linecap: square"/>
   </g>
   <g id="line2d_112">
    <path d="M 102.096818 89.95968 
L 102.546204 90.176142 
L 102.99559 90.816044 
L 103.444975 91.851997 
L 104.343747 94.932129 
L 105.242518 98.979837 
L 110.185762 123.173422 
L 111.983305 130.201135 
L 113.780848 136.312758 
L 115.578391 141.707589 
L 117.825319 147.668775 
L 120.072248 152.948122 
L 122.319177 157.685467 
L 125.015491 162.793125 
L 127.711806 167.387274 
L 130.40812 171.55915 
L 133.553821 175.983681 
L 136.699521 180.010063 
L 139.845221 183.701939 
L 143.440307 187.574808 
L 147.035393 191.133351 
L 151.079865 194.817343 
L 155.124337 198.212104 
L 159.618194 201.693775 
L 164.561437 205.221113 
L 169.504681 208.476367 
L 174.89731 211.760456 
L 180.739324 215.046655 
L 187.030725 218.313049 
L 193.322125 221.334557 
L 200.062912 224.33552 
L 207.253084 227.301123 
L 214.892641 230.219152 
L 222.981585 233.079568 
L 231.9693 236.015331 
L 241.4064 238.856792 
L 251.292887 241.600678 
L 262.078145 244.354446 
L 273.312789 246.987925 
L 284.996818 249.501019 
L 297.579619 251.97813 
L 310.611806 254.319409 
L 324.542764 256.595529 
L 339.372494 258.786452 
L 354.651609 260.817014 
L 370.829496 262.738552 
L 387.456769 264.488941 
L 404.982813 266.106633 
L 422.958243 267.540566 
L 441.383059 268.788657 
L 460.25726 269.847397 
L 479.580848 270.711798 
L 499.353821 271.375283 
L 519.576179 271.829524 
L 539.798538 272.06156 
L 551.033182 272.095415 
L 551.033182 272.095415 
" clip-path="url(#p450dd1745f)" style="fill: none; stroke: #7f7f7f; stroke-width: 1.5; stroke-linecap: square"/>
   </g>
   <g id="patch_3">
    <path d="M 79.65 292.2048 
L 79.65 39.3984 
" style="fill: none; stroke: #000000; stroke-width: 0.8; stroke-linejoin: miter; stroke-linecap: square"/>
   </g>
   <g id="patch_4">
    <path d="M 573.48 292.2048 
L 573.48 39.3984 
" style="fill: none; stroke: #000000; stroke-width: 0.8; stroke-linejoin: miter; stroke-linecap: square"/>
   </g>
   <g id="patch_5">
    <path d="M 79.65 292.2048 
L 573.48 292.2048 
" style="fill: none; stroke: #000000; stroke-width: 0.8; stroke-linejoin: miter; stroke-linecap: square"/>
   </g>
   <g id="patch_6">
    <path d="M 79.65 39.3984 
L 573.48 39.3984 
" style="fill: none; stroke: #000000; stroke-width: 0.8; stroke-linejoin: miter; stroke-linecap: square"/>
   </g>
   <g id="legend_1">
    <g id="patch_7">
     <path d="M 86.65 287.2048 
L 193.178517 287.2048 
Q 195.178517 287.2048 195.178517 285.2048 
L 195.178517 166.503679 
Q 195.178517 164.503679 193.178517 164.503679 
L 86.65 164.503679 
Q 84.65 164.503679 84.65 166.503679 
L 84.65 285.2048 
Q 84.65 287.2048 86.65 287.2048 
z
" style="fill: #ffffff; opacity: 0.8; stroke: #cccccc; stroke-linejoin: miter"/>
    </g>
    <g id="line2d_113">
     <path d="M 88.65 172.475659 
L 98.65 172.475659 
L 108.65 172.475659 
" style="fill: none; stroke: #1f77b4; stroke-width: 1.5; stroke-linecap: square"/>
    </g>
    <g id="text_15">
     <!-- $\omega \left[m\right]$ = 0 -->
     <g transform="translate(116.65 175.975659) scale(0.1 -0.1)">
      <defs>
       <path id="CMMI12-21" d="M 3802 2395 
C 3802 2580 3750 2816 3526 2816 
C 3398 2816 3251 2657 3251 2529 
C 3251 2472 3277 2434 3328 2376 
C 3424 2268 3546 2096 3546 1797 
C 3546 1567 3405 1204 3302 1007 
C 3123 656 2829 357 2496 357 
C 2093 357 1939 615 1869 975 
C 1939 1143 2086 1560 2086 1728 
C 2086 1798 2061 1856 1978 1856 
C 1933 1856 1882 1831 1850 1779 
C 1760 1638 1677 1129 1683 994 
C 1562 756 1216 357 806 357 
C 378 357 262 733 262 1096 
C 262 1758 678 2338 794 2497 
C 858 2593 902 2657 902 2669 
C 902 2714 877 2784 819 2784 
C 717 2784 685 2701 634 2625 
C 307 2121 77 1414 77 803 
C 77 408 224 -64 704 -64 
C 1235 -64 1568 391 1702 634 
C 1754 275 1946 -64 2413 -64 
C 2899 -64 3206 363 3437 879 
C 3603 1249 3802 2045 3802 2395 
z
" transform="scale(0.015625)"/>
       <path id="CMMI12-6d" d="M 1318 1871 
C 1331 1910 1491 2229 1728 2433 
C 1894 2586 2112 2689 2362 2689 
C 2618 2689 2707 2497 2707 2242 
C 2707 2203 2707 2076 2630 1775 
L 2470 1118 
C 2419 926 2298 453 2285 383 
C 2259 287 2221 121 2221 96 
C 2221 6 2291 -64 2387 -64 
C 2579 -64 2611 83 2669 313 
L 3053 1839 
C 3066 1890 3398 2689 4102 2689 
C 4358 2689 4448 2497 4448 2242 
C 4448 1884 4198 1188 4058 805 
C 4000 651 3968 568 3968 453 
C 3968 166 4166 -64 4474 -64 
C 5069 -64 5293 875 5293 913 
C 5293 945 5267 971 5229 971 
C 5171 971 5165 952 5133 843 
C 4986 332 4749 64 4493 64 
C 4429 64 4326 64 4326 269 
C 4326 436 4403 640 4429 710 
C 4544 1018 4832 1773 4832 2145 
C 4832 2528 4608 2816 4122 2816 
C 3693 2816 3347 2574 3091 2197 
C 3072 2542 2861 2816 2381 2816 
C 1811 2816 1510 2415 1395 2255 
C 1376 2618 1114 2816 832 2816 
C 646 2816 499 2727 378 2484 
C 262 2254 173 1865 173 1839 
C 173 1814 198 1782 243 1782 
C 294 1782 301 1788 339 1935 
C 435 2312 557 2689 813 2689 
C 960 2689 1011 2586 1011 2395 
C 1011 2254 947 2005 902 1807 
L 723 1118 
C 698 996 627 709 595 594 
C 550 428 480 128 480 96 
C 480 6 550 -64 646 -64 
C 723 -64 813 -26 864 70 
C 877 102 934 326 966 453 
L 1107 1028 
L 1318 1871 
z
" transform="scale(0.015625)"/>
       <path id="CMSS17-3d" d="M 4147 2017 
C 4243 2017 4339 2017 4339 2125 
C 4339 2240 4230 2240 4122 2240 
L 550 2240 
C 442 2240 333 2240 333 2125 
C 333 2017 429 2017 525 2017 
L 4147 2017 
z
M 4122 896 
C 4230 896 4339 896 4339 1011 
C 4339 1119 4243 1119 4147 1119 
L 525 1119 
C 429 1119 333 1119 333 1011 
C 333 896 442 896 550 896 
L 4122 896 
z
" transform="scale(0.015625)"/>
       <path id="CMSS17-30" d="M 2758 2044 
C 2758 2405 2752 3077 2490 3596 
C 2227 4096 1805 4229 1504 4229 
C 1069 4229 698 3975 506 3570 
C 301 3146 243 2709 243 2044 
C 243 1589 262 1031 493 543 
C 755 5 1197 -128 1498 -128 
C 1894 -128 2278 81 2496 518 
C 2720 974 2758 1474 2758 2044 
z
M 1498 261 
C 1011 261 864 811 819 995 
C 742 1310 730 1614 730 2114 
C 730 2506 730 2948 851 3297 
C 998 3701 1254 3840 1498 3840 
C 1971 3840 2125 3372 2176 3208 
C 2272 2873 2272 2481 2272 2114 
C 2272 1526 2272 261 1498 261 
z
" transform="scale(0.015625)"/>
      </defs>
      <use xlink:href="#CMMI12-21" transform="scale(0.996264)"/>
      <use xlink:href="#CMR17-5b" transform="translate(80.922751 0.003177) scale(0.996264)"/>
      <use xlink:href="#CMMI12-6d" transform="translate(105.79381 0) scale(0.996264)"/>
      <use xlink:href="#CMR17-5d" transform="translate(191.121034 0.003177) scale(0.996264)"/>
      <use xlink:href="#CMSS17-3d" transform="translate(247.221205 0) scale(0.996264)"/>
      <use xlink:href="#CMSS17-30" transform="translate(351.318253 0) scale(0.996264)"/>
     </g>
    </g>
    <g id="line2d_114">
     <path d="M 88.65 187.438299 
L 98.65 187.438299 
L 108.65 187.438299 
" style="fill: none; stroke: #ff7f0e; stroke-width: 1.5; stroke-linecap: square"/>
    </g>
    <g id="text_16">
     <!-- $\omega \left[m\right]$ = 0.010 -->
     <g transform="translate(116.65 190.938299) scale(0.1 -0.1)">
      <defs>
       <path id="CMSS17-2e" d="M 1088 510 
L 576 510 
L 576 0 
L 1088 0 
L 1088 510 
z
" transform="scale(0.015625)"/>
       <path id="CMSS17-31" d="M 1818 4288 
L 1696 4288 
C 1350 3940 947 3890 538 3890 
L 538 3520 
C 723 3520 1024 3520 1325 3667 
L 1325 369 
L 570 369 
L 570 0 
L 2573 0 
L 2573 369 
L 1818 369 
L 1818 4288 
z
" transform="scale(0.015625)"/>
      </defs>
      <use xlink:href="#CMMI12-21" transform="scale(0.996264)"/>
      <use xlink:href="#CMR17-5b" transform="translate(80.922751 0.003177) scale(0.996264)"/>
      <use xlink:href="#CMMI12-6d" transform="translate(105.79381 0) scale(0.996264)"/>
      <use xlink:href="#CMR17-5d" transform="translate(191.121034 0.003177) scale(0.996264)"/>
      <use xlink:href="#CMSS17-3d" transform="translate(247.221205 0) scale(0.996264)"/>
      <use xlink:href="#CMSS17-30" transform="translate(351.318253 0) scale(0.996264)"/>
      <use xlink:href="#CMSS17-2e" transform="translate(398.161876 0) scale(0.996264)"/>
      <use xlink:href="#CMSS17-30" transform="translate(424.186081 0) scale(0.996264)"/>
      <use xlink:href="#CMSS17-31" transform="translate(471.029705 0) scale(0.996264)"/>
      <use xlink:href="#CMSS17-30" transform="translate(517.873328 0) scale(0.996264)"/>
     </g>
    </g>
    <g id="line2d_115">
     <path d="M 88.65 202.400939 
L 98.65 202.400939 
L 108.65 202.400939 
" style="fill: none; stroke: #2ca02c; stroke-width: 1.5; stroke-linecap: square"/>
    </g>
    <g id="text_17">
     <!-- $\omega \left[m\right]$ = 0.068 -->
     <g transform="translate(116.65 205.900939) scale(0.1 -0.1)">
      <defs>
       <path id="CMSS17-36" d="M 2496 4101 
C 2227 4210 2035 4229 1856 4229 
C 1024 4229 250 3368 250 2006 
C 250 265 986 -128 1510 -128 
C 1798 -128 2086 -39 2362 280 
C 2643 617 2752 898 2752 1389 
C 2752 2179 2362 2880 1779 2880 
C 1357 2880 992 2657 768 2376 
C 832 3258 1254 3840 1862 3840 
C 2029 3840 2246 3816 2496 3710 
L 2496 4101 
z
M 774 1369 
C 774 1420 774 1452 781 1548 
C 781 2045 1069 2491 1536 2491 
C 1837 2491 1990 2332 2106 2135 
C 2240 1886 2246 1650 2246 1388 
C 2246 1140 2246 891 2099 637 
C 1978 439 1818 267 1510 267 
C 902 267 800 1114 774 1369 
z
" transform="scale(0.015625)"/>
       <path id="CMSS17-38" d="M 1933 2222 
C 2419 2380 2669 2760 2669 3134 
C 2669 3722 2157 4229 1504 4229 
C 826 4229 333 3708 333 3144 
C 333 2780 576 2403 1069 2241 
C 442 1997 250 1512 250 1149 
C 250 446 819 -128 1498 -128 
C 2202 -128 2752 455 2752 1138 
C 2752 1557 2502 2000 1933 2222 
z
M 1504 2432 
C 1075 2432 787 2712 787 3136 
C 787 3566 1075 3840 1504 3840 
C 1901 3840 2214 3591 2214 3136 
C 2214 2687 1907 2432 1504 2432 
z
M 1504 267 
C 1139 267 749 517 749 1156 
C 749 1813 1184 2043 1498 2043 
C 1843 2043 2253 1800 2253 1156 
C 2253 491 1830 267 1504 267 
z
" transform="scale(0.015625)"/>
      </defs>
      <use xlink:href="#CMMI12-21" transform="scale(0.996264)"/>
      <use xlink:href="#CMR17-5b" transform="translate(80.922751 0.003177) scale(0.996264)"/>
      <use xlink:href="#CMMI12-6d" transform="translate(105.79381 0) scale(0.996264)"/>
      <use xlink:href="#CMR17-5d" transform="translate(191.121034 0.003177) scale(0.996264)"/>
      <use xlink:href="#CMSS17-3d" transform="translate(247.221205 0) scale(0.996264)"/>
      <use xlink:href="#CMSS17-30" transform="translate(351.318253 0) scale(0.996264)"/>
      <use xlink:href="#CMSS17-2e" transform="translate(398.161876 0) scale(0.996264)"/>
      <use xlink:href="#CMSS17-30" transform="translate(424.186081 0) scale(0.996264)"/>
      <use xlink:href="#CMSS17-36" transform="translate(471.029705 0) scale(0.996264)"/>
      <use xlink:href="#CMSS17-38" transform="translate(517.873328 0) scale(0.996264)"/>
     </g>
    </g>
    <g id="line2d_116">
     <path d="M 88.65 217.36358 
L 98.65 217.36358 
L 108.65 217.36358 
" style="fill: none; stroke: #d62728; stroke-width: 1.5; stroke-linecap: square"/>
    </g>
    <g id="text_18">
     <!-- $\omega \left[m\right]$ = 0.464 -->
     <g transform="translate(116.65 220.86358) scale(0.1 -0.1)">
      <defs>
       <path id="CMSS17-34" d="M 2253 1088 
L 2835 1088 
L 2835 1477 
L 2253 1477 
L 2253 4192 
L 1690 4192 
L 166 1477 
L 166 1088 
L 1747 1088 
L 1747 0 
L 2253 0 
L 2253 1088 
z
M 659 1477 
C 1030 2127 1766 3439 1766 3885 
L 1766 1477 
L 659 1477 
z
" transform="scale(0.015625)"/>
      </defs>
      <use xlink:href="#CMMI12-21" transform="scale(0.996264)"/>
      <use xlink:href="#CMR17-5b" transform="translate(80.922751 0.003177) scale(0.996264)"/>
      <use xlink:href="#CMMI12-6d" transform="translate(105.79381 0) scale(0.996264)"/>
      <use xlink:href="#CMR17-5d" transform="translate(191.121034 0.003177) scale(0.996264)"/>
      <use xlink:href="#CMSS17-3d" transform="translate(247.221205 0) scale(0.996264)"/>
      <use xlink:href="#CMSS17-30" transform="translate(351.318253 0) scale(0.996264)"/>
      <use xlink:href="#CMSS17-2e" transform="translate(398.161876 0) scale(0.996264)"/>
      <use xlink:href="#CMSS17-34" transform="translate(424.186081 0) scale(0.996264)"/>
      <use xlink:href="#CMSS17-36" transform="translate(471.029705 0) scale(0.996264)"/>
      <use xlink:href="#CMSS17-34" transform="translate(517.873328 0) scale(0.996264)"/>
     </g>
    </g>
    <g id="line2d_117">
     <path d="M 88.65 232.32622 
L 98.65 232.32622 
L 108.65 232.32622 
" style="fill: none; stroke: #9467bd; stroke-width: 1.5; stroke-linecap: square"/>
    </g>
    <g id="text_19">
     <!-- $\omega \left[m\right]$ = 3.162 -->
     <g transform="translate(116.65 235.82622) scale(0.1 -0.1)">
      <defs>
       <path id="CMSS17-33" d="M 1005 2025 
L 1440 2025 
C 2042 2025 2214 1507 2214 1146 
C 2214 653 1933 267 1472 267 
C 1114 267 608 444 320 912 
C 275 691 275 678 250 526 
C 550 88 1037 -128 1485 -128 
C 2214 -128 2752 473 2752 1138 
C 2752 1638 2400 2057 1920 2215 
C 2304 2424 2586 2816 2586 3273 
C 2586 3805 2093 4229 1491 4229 
C 941 4229 512 3892 333 3530 
C 378 3468 493 3284 550 3189 
C 691 3562 1056 3840 1485 3840 
C 1843 3840 2080 3607 2080 3271 
C 2080 2923 1856 2543 1478 2455 
C 1453 2455 1056 2417 1005 2411 
L 1005 2025 
z
" transform="scale(0.015625)"/>
       <path id="CMSS17-32" d="M 1651 1357 
C 1830 1541 2099 1764 2285 1987 
C 2464 2204 2701 2511 2701 2957 
C 2701 3657 2227 4288 1421 4288 
C 787 4288 422 3893 250 3274 
L 499 2929 
C 640 3510 838 3880 1338 3880 
C 1888 3880 2195 3433 2195 2942 
C 2195 2355 1747 1901 1408 1563 
C 1030 1187 659 804 301 408 
L 301 0 
L 2701 0 
L 2701 433 
L 1613 433 
C 1536 433 1459 433 1382 433 
L 742 433 
L 742 439 
L 1651 1357 
z
" transform="scale(0.015625)"/>
      </defs>
      <use xlink:href="#CMMI12-21" transform="scale(0.996264)"/>
      <use xlink:href="#CMR17-5b" transform="translate(80.922751 0.003177) scale(0.996264)"/>
      <use xlink:href="#CMMI12-6d" transform="translate(105.79381 0) scale(0.996264)"/>
      <use xlink:href="#CMR17-5d" transform="translate(191.121034 0.003177) scale(0.996264)"/>
      <use xlink:href="#CMSS17-3d" transform="translate(247.221205 0) scale(0.996264)"/>
      <use xlink:href="#CMSS17-33" transform="translate(351.318253 0) scale(0.996264)"/>
      <use xlink:href="#CMSS17-2e" transform="translate(398.161876 0) scale(0.996264)"/>
      <use xlink:href="#CMSS17-31" transform="translate(424.186081 0) scale(0.996264)"/>
      <use xlink:href="#CMSS17-36" transform="translate(471.029705 0) scale(0.996264)"/>
      <use xlink:href="#CMSS17-32" transform="translate(517.873328 0) scale(0.996264)"/>
     </g>
    </g>
    <g id="line2d_118">
     <path d="M 88.65 247.28886 
L 98.65 247.28886 
L 108.65 247.28886 
" style="fill: none; stroke: #8c564b; stroke-width: 1.5; stroke-linecap: square"/>
    </g>
    <g id="text_20">
     <!-- $\omega \left[m\right]$ = 21.544 -->
     <g transform="translate(116.65 250.78886) scale(0.1 -0.1)">
      <defs>
       <path id="CMSS17-35" d="M 934 3752 
L 2502 3752 
L 2502 4160 
L 467 4160 
L 467 1781 
L 896 1781 
C 1011 2046 1248 2240 1555 2240 
C 1843 2240 2163 1989 2163 1266 
C 2163 493 1709 267 1376 267 
C 966 267 589 512 422 851 
L 218 499 
C 512 49 992 -128 1376 -128 
C 2118 -128 2701 497 2701 1253 
C 2701 2030 2182 2629 1562 2629 
C 1338 2629 1120 2553 934 2399 
L 934 3752 
z
" transform="scale(0.015625)"/>
      </defs>
      <use xlink:href="#CMMI12-21" transform="scale(0.996264)"/>
      <use xlink:href="#CMR17-5b" transform="translate(80.922751 0.003177) scale(0.996264)"/>
      <use xlink:href="#CMMI12-6d" transform="translate(105.79381 0) scale(0.996264)"/>
      <use xlink:href="#CMR17-5d" transform="translate(191.121034 0.003177) scale(0.996264)"/>
      <use xlink:href="#CMSS17-3d" transform="translate(247.221205 0) scale(0.996264)"/>
      <use xlink:href="#CMSS17-32" transform="translate(351.318253 0) scale(0.996264)"/>
      <use xlink:href="#CMSS17-31" transform="translate(398.161876 0) scale(0.996264)"/>
      <use xlink:href="#CMSS17-2e" transform="translate(445.0055 0) scale(0.996264)"/>
      <use xlink:href="#CMSS17-35" transform="translate(471.029705 0) scale(0.996264)"/>
      <use xlink:href="#CMSS17-34" transform="translate(517.873328 0) scale(0.996264)"/>
      <use xlink:href="#CMSS17-34" transform="translate(564.716952 0) scale(0.996264)"/>
     </g>
    </g>
    <g id="line2d_119">
     <path d="M 88.65 262.2515 
L 98.65 262.2515 
L 108.65 262.2515 
" style="fill: none; stroke: #e377c2; stroke-width: 1.5; stroke-linecap: square"/>
    </g>
    <g id="text_21">
     <!-- $\omega \left[m\right]$ = 146.780 -->
     <g transform="translate(116.65 265.7515) scale(0.1 -0.1)">
      <defs>
       <path id="CMSS17-37" d="M 1389 3776 
C 1466 3776 1542 3776 1619 3776 
L 2355 3776 
C 1440 2711 915 1365 915 -32 
L 1427 -32 
C 1427 1323 1875 2696 2752 3795 
L 2752 4209 
L 250 4209 
L 250 3776 
L 1389 3776 
z
" transform="scale(0.015625)"/>
      </defs>
      <use xlink:href="#CMMI12-21" transform="scale(0.996264)"/>
      <use xlink:href="#CMR17-5b" transform="translate(80.922751 0.003177) scale(0.996264)"/>
      <use xlink:href="#CMMI12-6d" transform="translate(105.79381 0) scale(0.996264)"/>
      <use xlink:href="#CMR17-5d" transform="translate(191.121034 0.003177) scale(0.996264)"/>
      <use xlink:href="#CMSS17-3d" transform="translate(247.221205 0) scale(0.996264)"/>
      <use xlink:href="#CMSS17-31" transform="translate(351.318253 0) scale(0.996264)"/>
      <use xlink:href="#CMSS17-34" transform="translate(398.161876 0) scale(0.996264)"/>
      <use xlink:href="#CMSS17-36" transform="translate(445.0055 0) scale(0.996264)"/>
      <use xlink:href="#CMSS17-2e" transform="translate(491.849124 0) scale(0.996264)"/>
      <use xlink:href="#CMSS17-37" transform="translate(517.873328 0) scale(0.996264)"/>
      <use xlink:href="#CMSS17-38" transform="translate(564.716952 0) scale(0.996264)"/>
      <use xlink:href="#CMSS17-30" transform="translate(611.560575 0) scale(0.996264)"/>
     </g>
    </g>
    <g id="line2d_120">
     <path d="M 88.65 277.21414 
L 98.65 277.21414 
L 108.65 277.21414 
" style="fill: none; stroke: #7f7f7f; stroke-width: 1.5; stroke-linecap: square"/>
    </g>
    <g id="text_22">
     <!-- $\omega \left[m\right]$ = 1000.000 -->
     <g transform="translate(116.65 280.71414) scale(0.1 -0.1)">
      <use xlink:href="#CMMI12-21" transform="scale(0.996264)"/>
      <use xlink:href="#CMR17-5b" transform="translate(80.922751 0.003177) scale(0.996264)"/>
      <use xlink:href="#CMMI12-6d" transform="translate(105.79381 0) scale(0.996264)"/>
      <use xlink:href="#CMR17-5d" transform="translate(191.121034 0.003177) scale(0.996264)"/>
      <use xlink:href="#CMSS17-3d" transform="translate(247.221205 0) scale(0.996264)"/>
      <use xlink:href="#CMSS17-31" transform="translate(351.318253 0) scale(0.996264)"/>
      <use xlink:href="#CMSS17-30" transform="translate(398.161876 0) scale(0.996264)"/>
      <use xlink:href="#CMSS17-30" transform="translate(445.0055 0) scale(0.996264)"/>
      <use xlink:href="#CMSS17-30" transform="translate(491.849124 0) scale(0.996264)"/>
      <use xlink:href="#CMSS17-2e" transform="translate(538.692747 0) scale(0.996264)"/>
      <use xlink:href="#CMSS17-30" transform="translate(564.716952 0) scale(0.996264)"/>
      <use xlink:href="#CMSS17-30" transform="translate(611.560575 0) scale(0.996264)"/>
      <use xlink:href="#CMSS17-30" transform="translate(658.404199 0) scale(0.996264)"/>
     </g>
    </g>
   </g>
  </g>
 </g>
 <defs>
  <clipPath id="p450dd1745f">
   <rect x="79.65" y="39.3984" width="493.83" height="252.8064"/>
  </clipPath>
 </defs>
</svg>
