{
  "project_info": {
    "project_number": "276099439070",
    "firebase_url": "https://see-grades.firebaseio.com",
    "project_id": "see-grades",
    "storage_bucket": "see-grades.appspot.com"
  },
  "client": [
    {
      "client_info": {
        "mobilesdk_app_id": "1:276099439070:android:a0d26dc8773fb5e9a2e54f",
        "android_client_info": {
          "package_name": "com.example.mnmul.ikpmd_applicatie"
        }
      },
      "oauth_client": [
        {
          "client_id": "276099439070-9tk0l4hibctab5rglf254r1tg0cilism.apps.googleusercontent.com",
          "client_type": 1,
          "android_info": {
            "package_name": "com.example.mnmul.ikpmd_applicatie",
            "certificate_hash": "b514564bbc5a0f3022b22869c49ccaec5afd3ec2"
          }
        },
        {
          "client_id": "276099439070-ndmp6s3h65c4krrgl8mstp19g940q3cr.apps.googleusercontent.com",
          "client_type": 1,
          "android_info": {
            "package_name": "com.example.mnmul.ikpmd_applicatie",
            "certificate_hash": "fb25582f773b98ea8edbce53b77da28272504369"
          }
        },
        {
          "client_id": "276099439070-tso3kul4kndk16dgrh08s5o05idg2f9j.apps.googleusercontent.com",
          "client_type": 3
        }
      ],
      "api_key": [
        {
          "current_key": "AIzaSyDbCMQg_Vi6lBArtVyIbSmwunXaX7pz3xQ"
        }
      ],
      "services": {
        "appinvite_service": {
          "other_platform_oauth_client": [
            {
              "client_id": "276099439070-tso3kul4kndk16dgrh08s5o05idg2f9j.apps.googleusercontent.com",
              "client_type": 3
            }
          ]
        }
      }
    }
  ],
  "configuration_version": "1"
}