{
  "activities": [
    {
      "title": "Pole Dance",
      "duration": 60,
      "image": "pole"
    },
    {
      "title": "Zumba",
      "duration": 60,
      "image": "zumba"
    },
    {
      "title": "Kalanetika",
      "duration": 60,
      "image": "kalanetika"
    },
    {
      "title": "Body Shape",
      "duration": 60,
      "image": "bodyShape"
    }
  ]
}
