{
  "activities": [
    {
      "title": "Yoga",
      "duration": 60,
      "image": "yoga"
    },
    {
      "title": "Pilates",
      "duration": 30,
      "image": "pilates"
    },
    {
      "title": "Stretching",
      "duration": 60,
      "image": "stretching"
    }
  ]
}
