{
  "items": [
    {
      "title": "Yoga",
      "day": "Monday",
      "time": "2 p.m"
    },
    {
      "title": "Zumba",
      "day": "Monday",
      "time": "3 p.m"
    },
    {
      "title": "Pilates",
      "day": "Monday",
      "time": "5 p.m"
    },
    {
      "title": "Body Shape",
      "day": "Tuesday",
      "time": "1 p.m"
    },
    {
      "title": "Stretching",
      "day": "Tuesday",
      "time": "6 p.m"
    },
    {
      "title": "Zumba",
      "day": "Wednesday",
      "time": "2 p.m"
    },
    {
      "title": "Pilates",
      "day": "Wednesday",
      "time": "3 p.m"
    },
    {
      "title": "Yoga",
      "day": "Wednesday",
      "time": "5 p.m"
    },
    {
      "title": "Stretching",
      "day": "Tuesday",
      "time": "4 p.m"
    },
    {
      "title": "Body Shape",
      "day": "Tuesday",
      "time": "7 p.m"
    },
    {
      "title": "Pilates",
      "day": "Wednesday",
      "time": "2 p.m"
    },
    {
      "title": "Yoga",
      "day": "Wednesday",
      "time": "3 p.m"
    },
    {
      "title": "Zumba",
      "day": "Wednesday",
      "time": "5 p.m"
    }
  ]
}
