zmente prioritu procesu sshd 

pomocou ps -ef | grep sshd 

-- zistite cislo PID procesu 

-- top -p PID (sshd)

top -p 865

 PID USER      PR  NI    VIRT    RES    SHR S  %CPU  %MEM
    865 root      20   0   15860   9344   8192 S   0.0   0.1


-- chcem zvacsit prioritu procesu (NI) -- NICE 

renice 
<-20;19>

renice -15 865


    PID USER      PR  NI    VIRT    RES    SHR S  %CPU  %MEM
    865 root       5 -15   15860   9344   8192 S   0.0   0.1



-- zmente priroritu procesu sshd z 0 na -10(-11,12)










https://www.tecmint.com/12-top-command-examples-in-linux/ 