 38  last | grep rebo
   39  last | reboot
   40  uptime
   41  ls -l /etc | wc -l
   42  cat /var/log/cron | wc -l
   43  echo abc | tr ABC
   44  cat greekfile | tr [a-z] [A-Z]
   45  echo greekfile | tr [a-z] [A-Z]
   46  history
   47  history | grep sestatus
   48  history | grep SESTATUS
   49  history | grep -i SESTATUS
   50  sshd -T | grep -i root
   51  sshd -t
   52  vi /etc/ssh/sshd_config
   53  sshd -t
   54  vi /etc/ssh/sshd_config
   55  sshd -t
   56  uname

   67  uname -r
   68  rpm -qa | grep kernel
   69  uptime
   70  ip r s
   71  cat /etc/resolv.conf
