-rw-r--r--. 1 root root  27 Jun 23 09:43 data.txt


-rw-r--r--
-file

prava v linuxe: read, write, execute

vlastnik: read,write
group:    read 
ostatni:  read 


-rw-r--r--

read =  4 
write=  2 
execute=1

-rw-r--r--

vlastnik read+write= 4+2=6
group              = 4
ostatni            = 4

644



-rw-r--r--
644

---> chceme, aby skupina mohla pisat

chmod g+w nazov_suboru.txt

chmod 664

skupina 4+2



-rw-r--r--.

rw- vlastnik = citat + zapisovat

r-- group   = citat

r-- others  = citat 

chmod g-r

vlastnik (u)

skupina (g) 

others (o)


chmod 700 1.txt 
