  513  yum install cryptsetup -y
  514  cryptsetup luksFormat /dev/sde
  515  cryptsetup luksOpen /dev/sde jedi
  516  ls -l /dev/mapper/
  517  mkfs.ext4 /dev/mapper/jedi
  519  mkdir -p /tajne_data_z_banky
  520  mount /dev/mapper/jedi /tajne_data_z_banky
  521  echo "xxxyyyzzz" > /tajne_data_z_banky/necitaj.txt
  522  ls -l /tajne_data_z_banky/
  523  lsblk -p

