   55  date
   56  unlink /etc/localtime
   57  ln -s /usr/share/zoneinfo/Antarctica/South_Pole /etc/localtime
   58  date
   59  ln -s /usr/share/zoneinfo/Europe/Bratislava /etc/localtime
   60  unlink /etc/localtime
   61  ln -s /usr/share/zoneinfo/Europe/Bratislava /etc/localtime
   62  date
   63  wc -l /etc/fstab
   64  wc -l /etc/resolv.conf
   65  cat /etc/fstab | wc -l
   66  ls /var | wc -l
   67  tail -f /var/log/secure
   68  cd  /data
   69  ls
   70  cp data.txt data1.txt
   71  diff data data1.txt
   72  diff data.txt data1.txt
   73  vi data.txt
   74  diff data.txt data1.txt
   75  cat -n data.txt
   76  cat -n data1.txt
   77  cd /root
   78  df -hT
   79  pwd
   80  tar cfv data.tar /data
   81  ls -lh
   82  du -hs /data
   83  tar cf var.tar /var
   84  ls -lh
   85  du -hs /var
   86  tar cfz var.tar.gz /var
   87  ls -lh
   88  yum install zip unzip -y
   89  zip -r var.zip /var
   90  ls -lh
   91  alias
   92  ls -l /etc/localtime
   93  ls -lh .bash*
   94  pwd
   95  vi .bash_profile
   96  kill -l
   97  ps -ef | grep sshd
   98  systemctl restart sshd
   99  ps -ef | grep sshd
  100  systemctl status sshd
  101  kill -l
  102  kill PID
  103  kill -9 PID
  104  yes "ja som hladny"
  105  jobs -l
  106  ps -ef | grep 8376
  107  ps aux | grep 8376
  108  yes "nedal si mi vyplatu...." > 1.txt
  109  ls -lh 1.txt
  110  wc -l 1.txt
  111  find /etc/resolv.conf
  112  find /etc/resolv.conf97585
  113  find / -name "resolv.conf"
  114  find /etc "ta_co_javiem"
  115  find /etc -name "ta_co_javiem"
  116  find -jak_to_ze_to_nejde
  117  find /etc -name "motd"
  118  vi /etc/motd
  119  cat /etc/motd
  120  whereis yum
  121  which yum
  122  history | grep tar
  123  ls -lh
  124  tar cf usr.tar /usr
  125  ls -lh
  126  history
  127  free -h
  128  reboot
  129  ps -ef | grep -i sshd
  130  ps -ef | head -n 3
  131  yum install psmisc -y
  132  pstree
  133  top
  134  systemctl stop postfix
  135  systemctl status postfix
  136  history | grep tar
  137  free -h
  138  top -o %MEM
  139  free -h
  140  yum install sysstat -y
  141  iostat
  142  iostat -c
  143  iostat -c 1 5
  144  sar 1 3
  145  sar 10 3
  146  sar -r 1 3
  147  yum install iotop -y
  148  iotop
  149  df -h .
  150  df -ih .
  151  df -h
  152  df -h .
  153  pwd
  154  cd /data
  155  df -h .
  156  useradd jurosik
  157  passwd jurosik
  158  chage -l jurosik
  159  head -n /etc/passwd
  160  head -n 2 /etc/passwd
  161  su bin
  162  cat /etc/default/useradd
  163  ls -la /etc/skel/
  164  vi /etc/skel/readme.txt
  165  useradd piatok
  166  ls -lh /home/piatok/
  167  groupadd super_admini
  168  usermod -aG super_admini jurosik
  169  id jurosik
  170  usermod -g super_admini jurosik
  171  id jurosik
  172  pwd
  173  ls -lh
  174  chown jurosik data1.txt
  175  ls -lh
  176  groupadd rozpravky
  177  chgrp rozpravky data1.txt
  178  ls -lh
  179  chown root:root data1.txt
  180  ls -lh data1.txt
  181  ls -lh
  182  halt
  183  ip a s
  184  ip r s
  185  cat /etc/resolv.conf
  186  yum install bind-utils net-tools-y
  187  yum install bind-utils net-tools -y
  188  nslookup google.com
  189  cat /etc/sysconfig/network-scripts/ifcfg-enp0s3
  190  netstat -alnput
  191  history
