
  513  yum install cryptsetup
  514  cryptsetup luksFormat /dev/sde
  515  cryptsetup luksOpen /dev/sde tajne1
  516  ls -l /dev/mapper/
  517  mkfs.ext4 /dev/mapper/tajne1
  518  mount /dev/mapper/tajne1 /tajne_data_z_banky
  519  mkdir -p /tajne_data_z_banky
  520  mount /dev/mapper/tajne1 /tajne_data_z_banky
  521  echo "sifrovana sprava" > /tajne_data_z_banky/necitaj.txt
  522  ls -l /tajne_data_z_banky/
  523  lsblk -p

