vytvorme si "farmu virtualboxu" -- network farm 

--> siet 

--> vm ---> siete

---> clone --> sieti 

---> z 1 stroja prihlasit na druhy stroj: 

---> zistit IP: 

---> jeden stroj: --> 

ping -c 3 IP_druheho_stroja 

---> tunel ---> do tej NAT_Siete

---> file-->preferences-->network---> edit NAT_Network ---> port forwarding 

host IP --> 127.0.0.1 

host_port ---> 2222

guest IP ---> ip_prveho_stroja

guest_port ---> 22

putty: ---> 127.0.0.1 -- port 2222
