

1. uloha: 

1. uzivatel
vytvorite uzivatela (meno nejakej postavy) 

2. vytvorite mu heslo

3. nainstalujete ksh

4. toho uzivatela ---> bash ---> ksh

5. /etc/passd -- grep ---> ksh


---> ksh je normalne v balickoch (yum install ....) 

[root@server1 ~]# usermod -s /bin/ksh prvy_kolega
[root@server1 ~]# cat /etc/passwd | grep -i prvy
prvy_kolega:x:1002:1003::/home/prvy_kolega:/bin/ksh
[root@server1 ~]#
