zakaznik chce /app 

--> lVM 

1. PVS -- create 

2. vgs -- create 

3. lvs --- create 


/dev/sdc ----> pvs 

--vgs ---> app_vg 

---> logical volume -- > 1 GB

---> mkfs.logical volume ---> XFS ---> mount adresara /app 

technicke riesenie: 

1. pvs 

pvcreate /dev/sdc


2. vgs 

vgcreate vg_app /dev/sdc


3. lvs 

lvs 

lvcreate -L +1G --name lv_app vg_app
 

4. create file system 

ls -l /dev/mapper/


mkfs.xfs /dev/mapper/vg_app-lv_app

 
5. create directory 

mkdir /app 

6. mount 

vi /etc/fstab 

/dev/mapper/vg_app-lv_app /app xfs defaults 0 0



mount -a 

#pokial mate RHEL8 a vyssie -- treba systemctl daemon-reload

df -hT /app 



https://opensource.com/business/16/9/linux-users-guide-lvm
 