[root@kirkkubernetes ~]# ansible all --list-hosts
  hosts (2):
    server2
    server3
[root@kirkkubernetes ~]


ansible-console

root@all (2)[f:5]$ uptime
server2 | CHANGED | rc=0 >>
 20:23:04 up 12 min,  1 user,  load average: 0.00, 0.00, 0.00
server3 | CHANGED | rc=0 >>
 20:23:04 up 13 min,  1 user,  load average: 0.00, 0.00, 0.00
root@all (2)[f:5]$ history
server2 | CHANGED | rc=0 >>

server3 | CHANGED | rc=0 >>


f:5 - 5 prikazov 
"%{host}:%{module}:%{play} [%{f}] " 

ANSIBLE_PROMPT="%{host}:%{module}:%{play} [%{f}] "

Meno hostiteľa (%{host})
Názov modulu (%{module})
Názov playbooku (%{play})
Aktuálne číslo príkazu ([%{f}])



# vytvorit uzivatela - ale bez hashe - inac, nefunguje to ani v os linuxe 
ansible all -m user -a 'name=linux password=heslo'


https://docs.ansible.com/ansible/latest/command_guide/cheatsheet.html 
