last

- ukaze, kto bol kedy prihlaseny: 

[root@server1 ~]# ls -l /var/log/wtmp
-rw-rw-r--. 1 root utmp 7296 Dec  7 09:23 /var/log/wtmp
[root@server1 ~]#


[root@server1 ~]# lastb

btmp begins Thu Dec  7 09:17:45 2023
[root@server1 ~]# ls -l /var/log/btmp
-rw-------. 1 root utmp 0 Dec  6 13:09 /var/log/btmp
[root@server1 ~]#


---> lastb je prikaz, ktory ukaze, kto sa chcel prihlasit a neprihlasil sa (nevedel heslo, atd)
