playbook 

1) nainstalujeme zip 

2) vytvorime adresar /backup 

3) archive : zip ---> adresar /etc ---> zalohujeme do /backup


adresar: 

 - name: create directory
    file: 
      path: '/data/'
      state: directory
      owner: root
      group: root
      mode: '0755'
 

   - name: install apache web server
      yum:
        name: httpd
        update_cache: yes


-- alebo pouzijete moudul command 

