
uloha: 

upravit /etc/motd 

- pridat do cronu nech to posiela kazdu polnoc 

ansible all -m copy -a "src=/etc/motd dest=/etc/motd"


[root@ansible1 ~]# crontab -l

34 21 * * * crontab -l > /root/zalohacronu.txt

0 0 * * * ansible all -m copy -a "src=/etc/motd dest=/etc/motd"
[root@ansible1 ~]#


