EESchema Schematic File Version 4
EELAYER 30 0
EELAYER END
$Descr A4 11693 8268
encoding utf-8
Sheet 1 1
Title ""
Date ""
Rev ""
Comp ""
Comment1 ""
Comment2 ""
Comment3 ""
Comment4 ""
$EndDescr
$Comp
L MCU_Microchip_ATmega:ATmega8A-PU U1
U 1 1 617846E7
P 4850 3700
F 0 "U1" H 5150 5050 50  0000 C CNN
F 1 "ATmega8A-PU" H 4450 5050 50  0000 C CNN
F 2 "Package_DIP:DIP-28_W7.62mm" H 4850 3700 50  0001 C CIN
F 3 "http://ww1.microchip.com/downloads/en/DeviceDoc/Microchip%208bit%20mcu%20AVR%20ATmega8A%20data%20sheet%2040001974A.pdf" H 4850 3700 50  0001 C CNN
	1    4850 3700
	1    0    0    -1  
$EndComp
$Comp
L Device:R R6
U 1 1 61787814
P 5650 3500
F 0 "R6" V 4650 3500 50  0000 C CNN
F 1 "220R" V 5650 3500 50  0000 C CNN
F 2 "" V 5580 3500 50  0001 C CNN
F 3 "~" H 5650 3500 50  0001 C CNN
	1    5650 3500
	0    1    1    0   
$EndComp
$Comp
L Device:R R9
U 1 1 61788A8D
P 5950 3400
F 0 "R9" V 5050 3400 50  0000 C CNN
F 1 "220R" V 5950 3400 50  0000 C CNN
F 2 "" V 5880 3400 50  0001 C CNN
F 3 "~" H 5950 3400 50  0001 C CNN
	1    5950 3400
	0    1    1    0   
$EndComp
$Comp
L Device:R R5
U 1 1 61789F47
P 5650 3300
F 0 "R5" V 4750 3300 50  0000 C CNN
F 1 "220R" V 5650 3300 50  0000 C CNN
F 2 "" V 5580 3300 50  0001 C CNN
F 3 "~" H 5650 3300 50  0001 C CNN
	1    5650 3300
	0    1    1    0   
$EndComp
$Comp
L Device:R R4
U 1 1 6178B0AA
P 5650 3100
F 0 "R4" V 4850 3100 50  0000 C CNN
F 1 "220R" V 5650 3100 50  0000 C CNN
F 2 "" V 5580 3100 50  0001 C CNN
F 3 "~" H 5650 3100 50  0001 C CNN
	1    5650 3100
	0    1    1    0   
$EndComp
$Comp
L Device:R R8
U 1 1 6178B6F2
P 5950 3000
F 0 "R8" V 5350 3000 50  0000 C CNN
F 1 "220R" V 5950 3000 50  0000 C CNN
F 2 "" V 5880 3000 50  0001 C CNN
F 3 "~" H 5950 3000 50  0001 C CNN
	1    5950 3000
	0    1    1    0   
$EndComp
$Comp
L Device:R R3
U 1 1 6178B9DB
P 5650 2900
F 0 "R3" V 4950 2900 50  0000 C CNN
F 1 "220R" V 5650 2900 50  0000 C CNN
F 2 "" V 5580 2900 50  0001 C CNN
F 3 "~" H 5650 2900 50  0001 C CNN
	1    5650 2900
	0    1    1    0   
$EndComp
$Comp
L Device:R R7
U 1 1 6178BDD2
P 5950 2800
F 0 "R7" V 5450 2800 50  0000 C CNN
F 1 "220R" V 5950 2800 50  0000 C CNN
F 2 "" V 5880 2800 50  0001 C CNN
F 3 "~" H 5950 2800 50  0001 C CNN
	1    5950 2800
	0    1    1    0   
$EndComp
$Comp
L Device:R R2
U 1 1 6178C18A
P 5650 2700
F 0 "R2" V 5050 2700 50  0000 C CNN
F 1 "220R" V 5650 2700 50  0000 C CNN
F 2 "" V 5580 2700 50  0001 C CNN
F 3 "~" H 5650 2700 50  0001 C CNN
	1    5650 2700
	0    1    1    0   
$EndComp
$Comp
L Device:LED D2
U 1 1 6178E441
P 6250 2900
F 0 "D2" H 6250 2200 50  0000 C CNN
F 1 "LED" H 5450 2900 50  0001 C CNN
F 2 "" H 6250 2900 50  0001 C CNN
F 3 "~" H 6250 2900 50  0001 C CNN
	1    6250 2900
	-1   0    0    1   
$EndComp
$Comp
L Device:LED D1
U 1 1 61791762
P 6250 2700
F 0 "D1" H 6250 2100 50  0000 C CNN
F 1 "LED" H 6243 2536 50  0001 C CNN
F 2 "" H 6250 2700 50  0001 C CNN
F 3 "~" H 6250 2700 50  0001 C CNN
	1    6250 2700
	-1   0    0    1   
$EndComp
$Comp
L power:GND #PWR09
U 1 1 6179233E
P 7050 3150
F 0 "#PWR09" H 7050 2900 50  0001 C CNN
F 1 "GND" H 7055 2977 50  0000 C CNN
F 2 "" H 7050 3150 50  0001 C CNN
F 3 "" H 7050 3150 50  0001 C CNN
	1    7050 3150
	1    0    0    -1  
$EndComp
Wire Wire Line
	7050 3150 7050 3100
$Comp
L Device:LED D6
U 1 1 6179F857
P 6600 2800
F 0 "D6" H 6600 2300 50  0000 C CNN
F 1 "LED" H 5800 2800 50  0001 C CNN
F 2 "" H 6600 2800 50  0001 C CNN
F 3 "~" H 6600 2800 50  0001 C CNN
	1    6600 2800
	-1   0    0    1   
$EndComp
$Comp
L Device:LED D7
U 1 1 617A056F
P 6600 3000
F 0 "D7" H 6600 2400 50  0000 C CNN
F 1 "LED" H 5800 3000 50  0001 C CNN
F 2 "" H 6600 3000 50  0001 C CNN
F 3 "~" H 6600 3000 50  0001 C CNN
	1    6600 3000
	-1   0    0    1   
$EndComp
$Comp
L Device:LED D3
U 1 1 617A0901
P 6250 3100
F 0 "D3" H 6250 2300 50  0000 C CNN
F 1 "LED" H 5450 3100 50  0001 C CNN
F 2 "" H 6250 3100 50  0001 C CNN
F 3 "~" H 6250 3100 50  0001 C CNN
	1    6250 3100
	-1   0    0    1   
$EndComp
$Comp
L Device:LED D4
U 1 1 617A1495
P 6250 3300
F 0 "D4" H 6250 2400 50  0000 C CNN
F 1 "LED" H 5450 3300 50  0001 C CNN
F 2 "" H 6250 3300 50  0001 C CNN
F 3 "~" H 6250 3300 50  0001 C CNN
	1    6250 3300
	-1   0    0    1   
$EndComp
$Comp
L Device:LED D5
U 1 1 617A1A6E
P 6250 3500
F 0 "D5" H 6250 2500 50  0000 C CNN
F 1 "LED" H 5450 3500 50  0001 C CNN
F 2 "" H 6250 3500 50  0001 C CNN
F 3 "~" H 6250 3500 50  0001 C CNN
	1    6250 3500
	-1   0    0    1   
$EndComp
$Comp
L Device:LED D8
U 1 1 617A2FF5
P 6600 3400
F 0 "D8" H 6600 2500 50  0000 C CNN
F 1 "LED" H 5800 3400 50  0001 C CNN
F 2 "" H 6600 3400 50  0001 C CNN
F 3 "~" H 6600 3400 50  0001 C CNN
	1    6600 3400
	-1   0    0    1   
$EndComp
Wire Wire Line
	6400 3100 6900 3100
Wire Wire Line
	6900 2700 6900 2800
Wire Wire Line
	6400 2700 6900 2700
Connection ~ 6900 3100
Wire Wire Line
	6900 3100 7050 3100
Wire Wire Line
	6900 3100 6900 3300
Wire Wire Line
	6900 3500 6400 3500
Wire Wire Line
	6750 3400 6900 3400
Connection ~ 6900 3400
Wire Wire Line
	6900 3400 6900 3500
Wire Wire Line
	6400 3300 6900 3300
Connection ~ 6900 3300
Wire Wire Line
	6900 3300 6900 3400
Wire Wire Line
	6750 3000 6900 3000
Connection ~ 6900 3000
Wire Wire Line
	6900 3000 6900 3100
Wire Wire Line
	6750 2800 6900 2800
Connection ~ 6900 2800
Wire Wire Line
	6900 2800 6900 2900
Wire Wire Line
	6100 2700 5800 2700
Wire Wire Line
	5500 2700 5450 2700
Wire Wire Line
	5450 2800 5800 2800
Wire Wire Line
	6100 2800 6450 2800
Wire Wire Line
	6100 2900 5800 2900
Wire Wire Line
	5500 2900 5450 2900
Wire Wire Line
	5450 3000 5800 3000
Wire Wire Line
	6100 3000 6450 3000
Wire Wire Line
	6400 2900 6900 2900
Connection ~ 6900 2900
Wire Wire Line
	6900 2900 6900 3000
Wire Wire Line
	6100 3100 5800 3100
Wire Wire Line
	5500 3100 5450 3100
Wire Wire Line
	5450 3300 5500 3300
Wire Wire Line
	5800 3300 6100 3300
Wire Wire Line
	5800 3400 5450 3400
Wire Wire Line
	5450 3500 5500 3500
Wire Wire Line
	5800 3500 6100 3500
Wire Wire Line
	6100 3400 6450 3400
$Comp
L power:+5V #PWR07
U 1 1 617AE852
P 4850 1950
F 0 "#PWR07" H 4850 1800 50  0001 C CNN
F 1 "+5V" H 4865 2123 50  0000 C CNN
F 2 "" H 4850 1950 50  0001 C CNN
F 3 "" H 4850 1950 50  0001 C CNN
	1    4850 1950
	1    0    0    -1  
$EndComp
Wire Wire Line
	4850 1950 4850 2050
Wire Wire Line
	4950 2300 4950 2200
Wire Wire Line
	4950 2200 4850 2200
Connection ~ 4850 2200
Wire Wire Line
	4850 2200 4850 2300
$Comp
L Device:C C2
U 1 1 617B095A
P 4650 2050
F 0 "C2" V 4398 2050 50  0000 C CNN
F 1 "100n" V 4489 2050 50  0000 C CNN
F 2 "" H 4688 1900 50  0001 C CNN
F 3 "~" H 4650 2050 50  0001 C CNN
	1    4650 2050
	0    1    1    0   
$EndComp
Wire Wire Line
	4800 2050 4850 2050
Connection ~ 4850 2050
Wire Wire Line
	4850 2050 4850 2200
$Comp
L power:GND #PWR06
U 1 1 617B24D2
P 4400 2050
F 0 "#PWR06" H 4400 1800 50  0001 C CNN
F 1 "GND" H 4405 1877 50  0000 C CNN
F 2 "" H 4400 2050 50  0001 C CNN
F 3 "" H 4400 2050 50  0001 C CNN
	1    4400 2050
	1    0    0    -1  
$EndComp
Wire Wire Line
	4400 2050 4500 2050
$Comp
L Device:C C1
U 1 1 617B4651
P 3850 2800
F 0 "C1" H 3735 2754 50  0000 R CNN
F 1 "100n" H 3735 2845 50  0000 R CNN
F 2 "" H 3888 2650 50  0001 C CNN
F 3 "~" H 3850 2800 50  0001 C CNN
	1    3850 2800
	-1   0    0    1   
$EndComp
$Comp
L Device:R R1
U 1 1 617B5A41
P 3850 2400
F 0 "R1" H 3920 2446 50  0000 L CNN
F 1 "10k" H 3920 2355 50  0000 L CNN
F 2 "" V 3780 2400 50  0001 C CNN
F 3 "~" H 3850 2400 50  0001 C CNN
	1    3850 2400
	1    0    0    -1  
$EndComp
$Comp
L power:+5V #PWR04
U 1 1 617B60C9
P 3850 1950
F 0 "#PWR04" H 3850 1800 50  0001 C CNN
F 1 "+5V" H 3865 2123 50  0000 C CNN
F 2 "" H 3850 1950 50  0001 C CNN
F 3 "" H 3850 1950 50  0001 C CNN
	1    3850 1950
	1    0    0    -1  
$EndComp
Wire Wire Line
	3850 2250 3850 1950
Wire Wire Line
	4250 2600 3850 2600
Wire Wire Line
	3850 2600 3850 2550
Wire Wire Line
	3850 2600 3850 2650
Connection ~ 3850 2600
$Comp
L power:GND #PWR05
U 1 1 617B9010
P 3850 3150
F 0 "#PWR05" H 3850 2900 50  0001 C CNN
F 1 "GND" H 3855 2977 50  0000 C CNN
F 2 "" H 3850 3150 50  0001 C CNN
F 3 "" H 3850 3150 50  0001 C CNN
	1    3850 3150
	1    0    0    -1  
$EndComp
Wire Wire Line
	3850 2950 3850 3150
Wire Wire Line
	3850 2600 3300 2600
Wire Wire Line
	3300 2600 3300 2650
$Comp
L power:GND #PWR02
U 1 1 617C0C2D
P 3300 3150
F 0 "#PWR02" H 3300 2900 50  0001 C CNN
F 1 "GND" H 3305 2977 50  0000 C CNN
F 2 "" H 3300 3150 50  0001 C CNN
F 3 "" H 3300 3150 50  0001 C CNN
	1    3300 3150
	1    0    0    -1  
$EndComp
Wire Wire Line
	3300 3050 3300 3150
$Comp
L Switch:SW_Push SW1
U 1 1 617C2370
P 2650 2850
F 0 "SW1" H 2650 3135 50  0000 C CNN
F 1 "RESET_DRIVER" H 2650 3044 50  0000 C CNN
F 2 "" H 2650 3050 50  0001 C CNN
F 3 "~" H 2650 3050 50  0001 C CNN
	1    2650 2850
	1    0    0    -1  
$EndComp
Wire Wire Line
	2950 2850 2850 2850
$Comp
L power:+5V #PWR01
U 1 1 617C3B12
P 2350 1950
F 0 "#PWR01" H 2350 1800 50  0001 C CNN
F 1 "+5V" H 2365 2123 50  0000 C CNN
F 2 "" H 2350 1950 50  0001 C CNN
F 3 "" H 2350 1950 50  0001 C CNN
	1    2350 1950
	1    0    0    -1  
$EndComp
Wire Wire Line
	2350 1950 2350 2850
Wire Wire Line
	2350 2850 2450 2850
$Comp
L Transistor_BJT:DTD114E Q1
U 1 1 617C97F4
P 3200 2850
F 0 "Q1" H 3388 2896 50  0000 L CNN
F 1 "KRC402E" H 3388 2805 50  0000 L CNN
F 2 "" H 3200 2850 50  0001 L CNN
F 3 "" H 3200 2850 50  0001 L CNN
	1    3200 2850
	1    0    0    -1  
$EndComp
$Comp
L Transistor_FET:AO3401A Q3
U 1 1 617CDC96
P 7500 2600
F 0 "Q3" H 7704 2554 50  0000 L CNN
F 1 "AO3407" H 7704 2645 50  0000 L CNN
F 2 "Package_TO_SOT_SMD:SOT-23" H 7700 2525 50  0001 L CIN
F 3 "http://www.aosmd.com/pdfs/datasheet/AO3401A.pdf" H 7500 2600 50  0001 L CNN
	1    7500 2600
	1    0    0    1   
$EndComp
$Comp
L Transistor_FET:AO3401A Q2
U 1 1 617D97F3
P 3700 3850
F 0 "Q2" H 3905 3804 50  0000 L CNN
F 1 "AO3407" H 3905 3895 50  0000 L CNN
F 2 "Package_TO_SOT_SMD:SOT-23" H 3900 3775 50  0001 L CIN
F 3 "http://www.aosmd.com/pdfs/datasheet/AO3401A.pdf" H 3700 3850 50  0001 L CNN
	1    3700 3850
	-1   0    0    1   
$EndComp
Wire Wire Line
	5450 2600 7300 2600
$Comp
L power:+5V #PWR010
U 1 1 617DCB84
P 7600 2400
F 0 "#PWR010" H 7600 2250 50  0001 C CNN
F 1 "+5V" H 7615 2573 50  0000 C CNN
F 2 "" H 7600 2400 50  0001 C CNN
F 3 "" H 7600 2400 50  0001 C CNN
	1    7600 2400
	1    0    0    -1  
$EndComp
$Comp
L power:+5V #PWR03
U 1 1 617DD0DF
P 3600 3650
F 0 "#PWR03" H 3600 3500 50  0001 C CNN
F 1 "+5V" H 3615 3823 50  0000 C CNN
F 2 "" H 3600 3650 50  0001 C CNN
F 3 "" H 3600 3650 50  0001 C CNN
	1    3600 3650
	1    0    0    -1  
$EndComp
Wire Wire Line
	3900 3850 4200 3850
Wire Wire Line
	4200 3850 4200 3000
Wire Wire Line
	4200 3000 4250 3000
Wire Wire Line
	3600 4050 3600 4100
Wire Wire Line
	3600 4100 3500 4100
Text Label 3500 4100 2    50   ~ 0
IO_OUT_3
Wire Wire Line
	7600 2800 7600 2850
Text Label 7600 2850 0    50   ~ 0
IO_OUT_7
$Comp
L Transistor_FET:AO3401A Q4
U 1 1 617E3837
P 7500 3550
F 0 "Q4" H 7704 3504 50  0000 L CNN
F 1 "AO3407" H 7704 3595 50  0000 L CNN
F 2 "Package_TO_SOT_SMD:SOT-23" H 7700 3475 50  0001 L CIN
F 3 "http://www.aosmd.com/pdfs/datasheet/AO3401A.pdf" H 7500 3550 50  0001 L CNN
	1    7500 3550
	1    0    0    1   
$EndComp
Wire Wire Line
	7600 3750 7600 3800
$Comp
L power:+5V #PWR011
U 1 1 617E882A
P 7600 3350
F 0 "#PWR011" H 7600 3200 50  0001 C CNN
F 1 "+5V" H 7750 3400 50  0000 C CNN
F 2 "" H 7600 3350 50  0001 C CNN
F 3 "" H 7600 3350 50  0001 C CNN
	1    7600 3350
	1    0    0    -1  
$EndComp
Wire Wire Line
	7300 3550 7000 3550
Wire Wire Line
	7000 3550 7000 4200
Wire Wire Line
	7000 4200 5450 4200
Text Label 7600 3800 0    50   ~ 0
IO_OUT_0
$Comp
L Transistor_FET:AO3401A Q7
U 1 1 617F549C
P 8250 3900
F 0 "Q7" H 8454 3854 50  0000 L CNN
F 1 "AO3407" H 8454 3945 50  0000 L CNN
F 2 "Package_TO_SOT_SMD:SOT-23" H 8450 3825 50  0001 L CIN
F 3 "http://www.aosmd.com/pdfs/datasheet/AO3401A.pdf" H 8250 3900 50  0001 L CNN
	1    8250 3900
	1    0    0    1   
$EndComp
Wire Wire Line
	8350 4100 8350 4150
$Comp
L power:+5V #PWR014
U 1 1 617F54A3
P 8350 3700
F 0 "#PWR014" H 8350 3550 50  0001 C CNN
F 1 "+5V" H 8500 3750 50  0000 C CNN
F 2 "" H 8350 3700 50  0001 C CNN
F 3 "" H 8350 3700 50  0001 C CNN
	1    8350 3700
	1    0    0    -1  
$EndComp
Text Label 8350 4150 0    50   ~ 0
IO_OUT_1
$Comp
L Transistor_FET:AO3401A Q5
U 1 1 617F7481
P 7500 4300
F 0 "Q5" H 7704 4254 50  0000 L CNN
F 1 "AO3407" H 7704 4345 50  0000 L CNN
F 2 "Package_TO_SOT_SMD:SOT-23" H 7700 4225 50  0001 L CIN
F 3 "http://www.aosmd.com/pdfs/datasheet/AO3401A.pdf" H 7500 4300 50  0001 L CNN
	1    7500 4300
	1    0    0    1   
$EndComp
Wire Wire Line
	7600 4500 7600 4550
$Comp
L power:+5V #PWR012
U 1 1 617F7488
P 7600 4100
F 0 "#PWR012" H 7600 3950 50  0001 C CNN
F 1 "+5V" H 7750 4150 50  0000 C CNN
F 2 "" H 7600 4100 50  0001 C CNN
F 3 "" H 7600 4100 50  0001 C CNN
	1    7600 4100
	1    0    0    -1  
$EndComp
Text Label 7600 4550 0    50   ~ 0
IO_OUT_2
Wire Wire Line
	5450 4300 7100 4300
Wire Wire Line
	7100 4300 7100 3900
Wire Wire Line
	7100 3900 8050 3900
Wire Wire Line
	7300 4300 7200 4300
Wire Wire Line
	7200 4300 7200 4400
Wire Wire Line
	7200 4400 5450 4400
$Comp
L Transistor_FET:AO3401A Q8
U 1 1 618010B9
P 8250 4650
F 0 "Q8" H 8454 4604 50  0000 L CNN
F 1 "AO3407" H 8454 4695 50  0000 L CNN
F 2 "Package_TO_SOT_SMD:SOT-23" H 8450 4575 50  0001 L CIN
F 3 "http://www.aosmd.com/pdfs/datasheet/AO3401A.pdf" H 8250 4650 50  0001 L CNN
	1    8250 4650
	1    0    0    1   
$EndComp
Wire Wire Line
	8350 4850 8350 4900
$Comp
L power:+5V #PWR015
U 1 1 618010C0
P 8350 4450
F 0 "#PWR015" H 8350 4300 50  0001 C CNN
F 1 "+5V" H 8500 4500 50  0000 C CNN
F 2 "" H 8350 4450 50  0001 C CNN
F 3 "" H 8350 4450 50  0001 C CNN
	1    8350 4450
	1    0    0    -1  
$EndComp
Text Label 8350 4900 0    50   ~ 0
IO_OUT_4
Wire Wire Line
	8050 4650 7200 4650
Wire Wire Line
	7200 4650 7200 4500
Wire Wire Line
	7200 4500 5450 4500
$Comp
L power:GND #PWR08
U 1 1 61808464
P 4850 5250
F 0 "#PWR08" H 4850 5000 50  0001 C CNN
F 1 "GND" H 4855 5077 50  0000 C CNN
F 2 "" H 4850 5250 50  0001 C CNN
F 3 "" H 4850 5250 50  0001 C CNN
	1    4850 5250
	1    0    0    -1  
$EndComp
Wire Wire Line
	4950 5100 4950 5200
Wire Wire Line
	4950 5200 4850 5200
Wire Wire Line
	4850 5200 4850 5250
Wire Wire Line
	4850 5100 4850 5200
Connection ~ 4850 5200
$Comp
L Transistor_FET:AO3401A Q6
U 1 1 61812203
P 7500 5000
F 0 "Q6" H 7704 4954 50  0000 L CNN
F 1 "AO3407" H 7704 5045 50  0000 L CNN
F 2 "Package_TO_SOT_SMD:SOT-23" H 7700 4925 50  0001 L CIN
F 3 "http://www.aosmd.com/pdfs/datasheet/AO3401A.pdf" H 7500 5000 50  0001 L CNN
	1    7500 5000
	1    0    0    1   
$EndComp
$Comp
L power:+5V #PWR013
U 1 1 61812209
P 7600 4800
F 0 "#PWR013" H 7600 4650 50  0001 C CNN
F 1 "+5V" H 7750 4850 50  0000 C CNN
F 2 "" H 7600 4800 50  0001 C CNN
F 3 "" H 7600 4800 50  0001 C CNN
	1    7600 4800
	1    0    0    -1  
$EndComp
$Comp
L Transistor_FET:AO3401A Q9
U 1 1 618154F1
P 8250 5400
F 0 "Q9" H 8454 5354 50  0000 L CNN
F 1 "AO3407" H 8454 5445 50  0000 L CNN
F 2 "Package_TO_SOT_SMD:SOT-23" H 8450 5325 50  0001 L CIN
F 3 "http://www.aosmd.com/pdfs/datasheet/AO3401A.pdf" H 8250 5400 50  0001 L CNN
	1    8250 5400
	1    0    0    1   
$EndComp
$Comp
L power:+5V #PWR016
U 1 1 618154F7
P 8350 5200
F 0 "#PWR016" H 8350 5050 50  0001 C CNN
F 1 "+5V" H 8500 5250 50  0000 C CNN
F 2 "" H 8350 5200 50  0001 C CNN
F 3 "" H 8350 5200 50  0001 C CNN
	1    8350 5200
	1    0    0    -1  
$EndComp
Wire Wire Line
	8350 5600 8350 5650
Wire Wire Line
	7600 5200 7600 5250
Wire Wire Line
	7300 5000 7100 5000
Wire Wire Line
	7100 5000 7100 4600
Wire Wire Line
	7100 4600 5450 4600
Wire Wire Line
	8050 5400 7000 5400
Wire Wire Line
	7000 5400 7000 4700
Wire Wire Line
	7000 4700 5450 4700
Text Label 7600 5250 0    50   ~ 0
IO_OUT_5
Text Label 8350 5650 0    50   ~ 0
IO_OUT_6
NoConn ~ 4250 3200
NoConn ~ 5450 3600
NoConn ~ 5450 3700
NoConn ~ 5450 3800
NoConn ~ 5450 4000
NoConn ~ 5450 4100
$EndSCHEMATC
