EESchema Schematic File Version 4
EELAYER 30 0
EELAYER END
$Descr A4 11693 8268
encoding utf-8
Sheet 1 1
Title ""
Date ""
Rev ""
Comp ""
Comment1 ""
Comment2 ""
Comment3 ""
Comment4 ""
$EndDescr
$Comp
L RF_Module:ESP32-WROOM-32 U2
U 1 1 5E0F60FF
P 5250 6150
F 0 "U2" H 5350 7600 50  0000 C CNN
F 1 "ESP32-WROOM-32" H 5650 7500 50  0000 C CNN
F 2 "RF_Module:ESP32-WROOM-32" H 5250 4650 50  0001 C CNN
F 3 "https://www.espressif.com/sites/default/files/documentation/esp32-wroom-32_datasheet_en.pdf" H 4950 6200 50  0001 C CNN
	1    5250 6150
	1    0    0    -1  
$EndComp
Wire Wire Line
	5850 6350 5900 6350
Text Label 5900 6350 0    50   ~ 0
IO_I2C_SDA
Wire Wire Line
	5850 6450 5900 6450
Text Label 5900 6450 0    50   ~ 0
IO_I2C_SCL
Wire Wire Line
	5850 6250 5900 6250
Text Label 5900 6250 0    50   ~ 0
IO_PWR_LED_PWM
Wire Wire Line
	5850 6650 5900 6650
Text Label 5900 6650 0    50   ~ 0
IO_IR_PWR_LED_INC
Wire Wire Line
	5850 6750 5900 6750
Text Label 5900 6750 0    50   ~ 0
IO_IR_PWR_LED_DEC
$Comp
L Regulator_Linear:AMS1117-3.3 U1
U 1 1 603F1251
P 2300 1400
F 0 "U1" H 2300 1642 50  0000 C CNN
F 1 "AMS1117-3.3" H 2300 1551 50  0000 C CNN
F 2 "Package_TO_SOT_SMD:SOT-223-3_TabPin2" H 2300 1600 50  0001 C CNN
F 3 "http://www.advanced-monolithic.com/pdf/ds1117.pdf" H 2400 1150 50  0001 C CNN
	1    2300 1400
	1    0    0    -1  
$EndComp
$Comp
L power:+5V #PWR09
U 1 1 603F26A4
P 1650 1150
F 0 "#PWR09" H 1650 1000 50  0001 C CNN
F 1 "+5V" H 1665 1323 50  0000 C CNN
F 2 "" H 1650 1150 50  0001 C CNN
F 3 "" H 1650 1150 50  0001 C CNN
	1    1650 1150
	1    0    0    -1  
$EndComp
Wire Wire Line
	1650 1150 1650 1400
$Comp
L power:GND #PWR011
U 1 1 603F2FCB
P 2300 1900
F 0 "#PWR011" H 2300 1650 50  0001 C CNN
F 1 "GND" H 2305 1727 50  0000 C CNN
F 2 "" H 2300 1900 50  0001 C CNN
F 3 "" H 2300 1900 50  0001 C CNN
	1    2300 1900
	1    0    0    -1  
$EndComp
Wire Wire Line
	2300 1900 2300 1700
$Comp
L power:+3.3V #PWR013
U 1 1 603F33C9
P 3000 1300
F 0 "#PWR013" H 3000 1150 50  0001 C CNN
F 1 "+3.3V" H 3015 1473 50  0000 C CNN
F 2 "" H 3000 1300 50  0001 C CNN
F 3 "" H 3000 1300 50  0001 C CNN
	1    3000 1300
	1    0    0    -1  
$EndComp
Wire Wire Line
	3000 1300 3000 1400
$Comp
L Device:C C5
U 1 1 603F537B
P 5050 4650
F 0 "C5" V 4950 4500 50  0000 L CNN
F 1 "47uF" V 5100 4400 50  0000 L CNN
F 2 "Capacitor_SMD:C_1206_3216Metric_Pad1.42x1.75mm_HandSolder" H 5088 4500 50  0001 C CNN
F 3 "~" H 5050 4650 50  0001 C CNN
	1    5050 4650
	0    1    1    0   
$EndComp
$Comp
L Device:C C3
U 1 1 603F6003
P 2900 1650
F 0 "C3" H 2900 1750 50  0000 L CNN
F 1 "47uF" H 2900 1550 50  0000 L CNN
F 2 "Capacitor_SMD:C_1206_3216Metric_Pad1.42x1.75mm_HandSolder" H 2938 1500 50  0001 C CNN
F 3 "~" H 2900 1650 50  0001 C CNN
	1    2900 1650
	1    0    0    -1  
$EndComp
$Comp
L power:GND #PWR012
U 1 1 603F621C
P 2900 1900
F 0 "#PWR012" H 2900 1650 50  0001 C CNN
F 1 "GND" H 2905 1727 50  0000 C CNN
F 2 "" H 2900 1900 50  0001 C CNN
F 3 "" H 2900 1900 50  0001 C CNN
	1    2900 1900
	1    0    0    -1  
$EndComp
$Comp
L power:GND #PWR010
U 1 1 603F66B4
P 1750 1900
F 0 "#PWR010" H 1750 1650 50  0001 C CNN
F 1 "GND" H 1755 1727 50  0000 C CNN
F 2 "" H 1750 1900 50  0001 C CNN
F 3 "" H 1750 1900 50  0001 C CNN
	1    1750 1900
	1    0    0    -1  
$EndComp
Wire Wire Line
	1750 1400 1750 1500
Wire Wire Line
	2900 1500 2900 1400
Connection ~ 2900 1400
Wire Wire Line
	2900 1400 3000 1400
Wire Wire Line
	1650 1400 1750 1400
Connection ~ 1750 1400
Wire Wire Line
	5850 6950 5900 6950
Wire Wire Line
	5850 7050 5900 7050
Text Label 5900 6950 0    50   ~ 0
IO_IR_MOD_OUT_INC
Text Label 5900 7050 0    50   ~ 0
IO_IR_MOD_OUT_DEC
Wire Wire Line
	4650 5150 4600 5150
Wire Wire Line
	4650 5250 4600 5250
Text Label 4600 5150 2    50   ~ 0
IO_IR_IN_INC
Text Label 4600 5250 2    50   ~ 0
IO_IR_IN_DEC
$Comp
L power:+3.3V #PWR022
U 1 1 61AB7F46
P 5250 4500
F 0 "#PWR022" H 5250 4350 50  0001 C CNN
F 1 "+3.3V" H 5265 4673 50  0000 C CNN
F 2 "" H 5250 4500 50  0001 C CNN
F 3 "" H 5250 4500 50  0001 C CNN
	1    5250 4500
	1    0    0    -1  
$EndComp
$Comp
L power:GND #PWR023
U 1 1 61AB89B1
P 5250 7550
F 0 "#PWR023" H 5250 7300 50  0001 C CNN
F 1 "GND" H 5255 7377 50  0000 C CNN
F 2 "" H 5250 7550 50  0001 C CNN
F 3 "" H 5250 7550 50  0001 C CNN
	1    5250 7550
	1    0    0    -1  
$EndComp
Wire Wire Line
	5850 5150 5900 5150
Wire Wire Line
	2600 1400 2900 1400
Wire Wire Line
	1750 1800 1750 1900
Wire Wire Line
	5250 4500 5250 4650
Wire Wire Line
	2900 1800 2900 1900
Wire Wire Line
	5200 4650 5250 4650
Connection ~ 5250 4650
Wire Wire Line
	5250 4650 5250 4750
$Comp
L power:GND #PWR020
U 1 1 61ABCE78
P 4750 4650
F 0 "#PWR020" H 4750 4400 50  0001 C CNN
F 1 "GND" V 4755 4522 50  0000 R CNN
F 2 "" H 4750 4650 50  0001 C CNN
F 3 "" H 4750 4650 50  0001 C CNN
	1    4750 4650
	0    1    1    0   
$EndComp
Wire Wire Line
	4750 4650 4900 4650
$Comp
L Device:C C2
U 1 1 61ABD9DB
P 1750 1650
F 0 "C2" H 1865 1696 50  0000 L CNN
F 1 "100n" H 1865 1605 50  0000 L CNN
F 2 "Capacitor_SMD:C_0603_1608Metric_Pad1.05x0.95mm_HandSolder" H 1788 1500 50  0001 C CNN
F 3 "~" H 1750 1650 50  0001 C CNN
	1    1750 1650
	1    0    0    -1  
$EndComp
$Comp
L Device:LED D2
U 1 1 61ABF492
P 4600 1200
F 0 "D2" V 4639 1083 50  0000 R CNN
F 1 "Red" V 4548 1083 50  0000 R CNN
F 2 "Diode_SMD:D_0603_1608Metric_Pad1.05x0.95mm_HandSolder" H 4600 1200 50  0001 C CNN
F 3 "~" H 4600 1200 50  0001 C CNN
	1    4600 1200
	0    -1   -1   0   
$EndComp
$Comp
L Device:R R9
U 1 1 61AC0CA9
P 4600 900
F 0 "R9" H 4670 946 50  0000 L CNN
F 1 "330R" H 4670 855 50  0000 L CNN
F 2 "Resistor_SMD:R_0603_1608Metric_Pad1.05x0.95mm_HandSolder" V 4530 900 50  0001 C CNN
F 3 "~" H 4600 900 50  0001 C CNN
	1    4600 900 
	1    0    0    -1  
$EndComp
Wire Wire Line
	4600 750  4600 700 
$Comp
L power:GND #PWR019
U 1 1 61AC1B5A
P 4600 1350
F 0 "#PWR019" H 4600 1100 50  0001 C CNN
F 1 "GND" H 4605 1177 50  0000 C CNN
F 2 "" H 4600 1350 50  0001 C CNN
F 3 "" H 4600 1350 50  0001 C CNN
	1    4600 1350
	1    0    0    -1  
$EndComp
Text Label 4550 700  2    50   ~ 0
IO_OVERHEATING_LED
$Comp
L Device:LED D3
U 1 1 61AC3CAE
P 5150 1200
F 0 "D3" V 5189 1083 50  0000 R CNN
F 1 "Red" V 5098 1083 50  0000 R CNN
F 2 "Diode_SMD:D_0603_1608Metric_Pad1.05x0.95mm_HandSolder" H 5150 1200 50  0001 C CNN
F 3 "~" H 5150 1200 50  0001 C CNN
	1    5150 1200
	0    -1   -1   0   
$EndComp
$Comp
L Device:R R10
U 1 1 61AC3CB8
P 5150 900
F 0 "R10" H 5220 946 50  0000 L CNN
F 1 "330R" H 5220 855 50  0000 L CNN
F 2 "Resistor_SMD:R_0603_1608Metric_Pad1.05x0.95mm_HandSolder" V 5080 900 50  0001 C CNN
F 3 "~" H 5150 900 50  0001 C CNN
	1    5150 900 
	1    0    0    -1  
$EndComp
$Comp
L power:GND #PWR021
U 1 1 61AC3CC2
P 5150 1350
F 0 "#PWR021" H 5150 1100 50  0001 C CNN
F 1 "GND" H 5155 1177 50  0000 C CNN
F 2 "" H 5150 1350 50  0001 C CNN
F 3 "" H 5150 1350 50  0001 C CNN
	1    5150 1350
	1    0    0    -1  
$EndComp
Wire Wire Line
	5150 750  5150 700 
Wire Wire Line
	5150 700  4600 700 
Wire Wire Line
	4600 700  4550 700 
Connection ~ 4600 700 
$Comp
L Connector_Generic:Conn_01x05 J2
U 1 1 61AC9DD7
P 750 2800
F 0 "J2" H 750 2500 50  0000 C CNN
F 1 "Programming" V 850 2800 50  0000 C CNN
F 2 "Connector_PinHeader_2.54mm:PinHeader_1x05_P2.54mm_Vertical" H 750 2800 50  0001 C CNN
F 3 "~" H 750 2800 50  0001 C CNN
	1    750  2800
	-1   0    0    1   
$EndComp
$Comp
L power:GND #PWR01
U 1 1 61ACB356
P 950 3000
F 0 "#PWR01" H 950 2750 50  0001 C CNN
F 1 "GND" H 955 2827 50  0000 C CNN
F 2 "" H 950 3000 50  0001 C CNN
F 3 "" H 950 3000 50  0001 C CNN
	1    950  3000
	1    0    0    -1  
$EndComp
$Comp
L Device:R R2
U 1 1 61ACBD66
P 1150 2800
F 0 "R2" V 1150 2750 50  0000 C CNN
F 1 "330R" V 1100 3050 50  0000 C CNN
F 2 "Resistor_SMD:R_0603_1608Metric_Pad1.05x0.95mm_HandSolder" V 1080 2800 50  0001 C CNN
F 3 "~" H 1150 2800 50  0001 C CNN
	1    1150 2800
	0    1    1    0   
$EndComp
$Comp
L Device:R R3
U 1 1 61ACCD32
P 1350 2900
F 0 "R3" V 1350 2850 50  0000 C CNN
F 1 "330R" V 1450 2900 50  0000 C CNN
F 2 "Resistor_SMD:R_0603_1608Metric_Pad1.05x0.95mm_HandSolder" V 1280 2900 50  0001 C CNN
F 3 "~" H 1350 2900 50  0001 C CNN
	1    1350 2900
	0    1    1    0   
$EndComp
Wire Wire Line
	950  2800 1000 2800
Wire Wire Line
	950  2900 1200 2900
Wire Wire Line
	1500 2900 1550 2900
Wire Wire Line
	1300 2800 1550 2800
Wire Wire Line
	950  2700 1550 2700
Wire Wire Line
	950  2600 1550 2600
Text Label 1550 2600 0    50   ~ 0
RTS
Text Label 1550 2700 0    50   ~ 0
DTR
Text Label 1550 2800 0    50   ~ 0
TXD0
Text Label 1550 2900 0    50   ~ 0
RXD0
$Comp
L Transistor_BJT:BC817 Q1
U 1 1 61ABA556
P 3150 3350
F 0 "Q1" H 3100 3500 50  0000 L CNN
F 1 "BC817" H 3000 3200 50  0000 L CNN
F 2 "Package_TO_SOT_SMD:SOT-23" H 3350 3275 50  0001 L CIN
F 3 "http://www.fairchildsemi.com/ds/BC/BC817.pdf" H 3150 3350 50  0001 L CNN
	1    3150 3350
	1    0    0    -1  
$EndComp
$Comp
L Transistor_BJT:BC817 Q2
U 1 1 61ABB679
P 3150 4000
F 0 "Q2" H 3100 3850 50  0000 L CNN
F 1 "BC817" H 3000 4200 50  0000 L CNN
F 2 "Package_TO_SOT_SMD:SOT-23" H 3350 3925 50  0001 L CIN
F 3 "http://www.fairchildsemi.com/ds/BC/BC817.pdf" H 3150 4000 50  0001 L CNN
	1    3150 4000
	1    0    0    1   
$EndComp
$Comp
L Device:R R8
U 1 1 61ABCC99
P 3250 4450
F 0 "R8" V 3250 4450 50  0000 C CNN
F 1 "47k" V 3350 4450 50  0000 C CNN
F 2 "Resistor_SMD:R_0603_1608Metric_Pad1.05x0.95mm_HandSolder" V 3180 4450 50  0001 C CNN
F 3 "~" H 3250 4450 50  0001 C CNN
	1    3250 4450
	-1   0    0    1   
$EndComp
$Comp
L Device:R R7
U 1 1 61ABD88D
P 3250 2900
F 0 "R7" V 3250 2900 50  0000 C CNN
F 1 "47k" V 3350 2900 50  0000 C CNN
F 2 "Resistor_SMD:R_0603_1608Metric_Pad1.05x0.95mm_HandSolder" V 3180 2900 50  0001 C CNN
F 3 "~" H 3250 2900 50  0001 C CNN
	1    3250 2900
	-1   0    0    1   
$EndComp
$Comp
L Device:R R5
U 1 1 61ABE3A8
P 2750 3350
F 0 "R5" V 2750 3350 50  0000 C CNN
F 1 "12k" V 2850 3350 50  0000 C CNN
F 2 "Resistor_SMD:R_0603_1608Metric_Pad1.05x0.95mm_HandSolder" V 2680 3350 50  0001 C CNN
F 3 "~" H 2750 3350 50  0001 C CNN
	1    2750 3350
	0    -1   -1   0   
$EndComp
$Comp
L Device:C C4
U 1 1 61ACC2A6
P 3450 3350
F 0 "C4" H 3565 3396 50  0000 L CNN
F 1 "100n" H 3565 3305 50  0000 L CNN
F 2 "Capacitor_SMD:C_0603_1608Metric_Pad1.05x0.95mm_HandSolder" H 3488 3200 50  0001 C CNN
F 3 "~" H 3450 3350 50  0001 C CNN
	1    3450 3350
	1    0    0    -1  
$EndComp
$Comp
L Device:R R6
U 1 1 61ACDF26
P 2750 4000
F 0 "R6" V 2750 4000 50  0000 C CNN
F 1 "12k" V 2850 4000 50  0000 C CNN
F 2 "Resistor_SMD:R_0603_1608Metric_Pad1.05x0.95mm_HandSolder" V 2680 4000 50  0001 C CNN
F 3 "~" H 2750 4000 50  0001 C CNN
	1    2750 4000
	0    -1   -1   0   
$EndComp
Wire Wire Line
	2900 4000 2950 4000
Wire Wire Line
	2900 3350 2950 3350
Wire Wire Line
	3250 3550 3250 3600
Wire Wire Line
	3250 3600 2500 3600
Wire Wire Line
	2500 3600 2500 4000
Wire Wire Line
	2500 4000 2600 4000
Wire Wire Line
	2500 4000 2400 4000
Connection ~ 2500 4000
Wire Wire Line
	2400 3350 2550 3350
Wire Wire Line
	3250 3800 3250 3750
Wire Wire Line
	3250 3750 2550 3750
Wire Wire Line
	2550 3750 2550 3350
Connection ~ 2550 3350
Wire Wire Line
	2550 3350 2600 3350
$Comp
L power:+3.3V #PWR014
U 1 1 61AD30A9
P 3250 2750
F 0 "#PWR014" H 3250 2600 50  0001 C CNN
F 1 "+3.3V" H 3265 2923 50  0000 C CNN
F 2 "" H 3250 2750 50  0001 C CNN
F 3 "" H 3250 2750 50  0001 C CNN
	1    3250 2750
	1    0    0    -1  
$EndComp
$Comp
L power:+3.3V #PWR015
U 1 1 61AD3D83
P 3250 4600
F 0 "#PWR015" H 3250 4450 50  0001 C CNN
F 1 "+3.3V" H 3265 4773 50  0000 C CNN
F 2 "" H 3250 4600 50  0001 C CNN
F 3 "" H 3250 4600 50  0001 C CNN
	1    3250 4600
	-1   0    0    1   
$EndComp
$Comp
L power:GND #PWR017
U 1 1 61AD4D07
P 3450 3500
F 0 "#PWR017" H 3450 3250 50  0001 C CNN
F 1 "GND" H 3455 3327 50  0000 C CNN
F 2 "" H 3450 3500 50  0001 C CNN
F 3 "" H 3450 3500 50  0001 C CNN
	1    3450 3500
	1    0    0    -1  
$EndComp
Wire Wire Line
	3250 3050 3250 3100
Wire Wire Line
	3450 3200 3450 3100
Wire Wire Line
	3450 3100 3250 3100
Connection ~ 3250 3100
Wire Wire Line
	3250 3100 3250 3150
Wire Wire Line
	3450 3100 3550 3100
Connection ~ 3450 3100
Text Label 3550 3100 0    50   ~ 0
EN
Text Label 2400 3350 2    50   ~ 0
DTR
Text Label 2400 4000 2    50   ~ 0
RTS
Wire Wire Line
	3250 4200 3250 4250
Wire Wire Line
	3250 4250 3550 4250
Connection ~ 3250 4250
Wire Wire Line
	3250 4250 3250 4300
Text Label 3550 4250 0    50   ~ 0
BOOT
Text Notes 3800 3500 0    50   ~ 0
Timing of DTR and RTS\nis not correct. Therefore\nEN signal have to be\ndelayed a bit (400 us and\nup) -> 100nF cover that
Wire Wire Line
	4650 4950 4600 4950
Text Label 4600 4950 2    50   ~ 0
EN
$Comp
L Connector_Generic:Conn_01x06 J3
U 1 1 61ACDC9F
P 750 3950
F 0 "J3" H 750 3550 50  0000 C CNN
F 1 "Debug" V 850 3900 50  0000 C CNN
F 2 "Connector_PinHeader_2.54mm:PinHeader_1x06_P2.54mm_Vertical" H 750 3950 50  0001 C CNN
F 3 "~" H 750 3950 50  0001 C CNN
	1    750  3950
	-1   0    0    1   
$EndComp
$Comp
L Connector_Generic:Conn_01x03 J4
U 1 1 61ACF7FE
P 750 4800
F 0 "J4" H 750 4600 50  0000 C CNN
F 1 "User_interface" V 850 4800 50  0000 C CNN
F 2 "Connector_PinHeader_2.54mm:PinHeader_1x03_P2.54mm_Vertical" H 750 4800 50  0001 C CNN
F 3 "~" H 750 4800 50  0001 C CNN
	1    750  4800
	-1   0    0    1   
$EndComp
$Comp
L Device:R R4
U 1 1 61AD02C7
P 1350 4800
F 0 "R4" V 1350 4750 50  0000 C CNN
F 1 "330R" V 1450 4800 50  0000 C CNN
F 2 "Resistor_SMD:R_0603_1608Metric_Pad1.05x0.95mm_HandSolder" V 1280 4800 50  0001 C CNN
F 3 "~" H 1350 4800 50  0001 C CNN
	1    1350 4800
	0    1    1    0   
$EndComp
$Comp
L Device:R R1
U 1 1 61AD08E8
P 1100 4700
F 0 "R1" V 1100 4650 50  0000 C CNN
F 1 "330R" V 1000 4700 50  0000 C CNN
F 2 "Resistor_SMD:R_0603_1608Metric_Pad1.05x0.95mm_HandSolder" V 1030 4700 50  0001 C CNN
F 3 "~" H 1100 4700 50  0001 C CNN
	1    1100 4700
	0    1    1    0   
$EndComp
Wire Wire Line
	1200 4800 950  4800
$Comp
L power:GND #PWR02
U 1 1 61AD4D86
P 950 4150
F 0 "#PWR02" H 950 3900 50  0001 C CNN
F 1 "GND" H 955 3977 50  0000 C CNN
F 2 "" H 950 4150 50  0001 C CNN
F 3 "" H 950 4150 50  0001 C CNN
	1    950  4150
	1    0    0    -1  
$EndComp
$Comp
L power:GND #PWR03
U 1 1 61AD5350
P 950 4900
F 0 "#PWR03" H 950 4650 50  0001 C CNN
F 1 "GND" H 955 4727 50  0000 C CNN
F 2 "" H 950 4900 50  0001 C CNN
F 3 "" H 950 4900 50  0001 C CNN
	1    950  4900
	1    0    0    -1  
$EndComp
Wire Wire Line
	1250 4700 1600 4700
Wire Wire Line
	1500 4800 1600 4800
Text Label 1600 4700 0    50   ~ 0
UI_SERVICE_TXD_PIN
Text Label 1600 4800 0    50   ~ 0
UI_SERVICE_RXD_PIN
Wire Wire Line
	950  3650 1000 3650
Wire Wire Line
	950  3750 1000 3750
Wire Wire Line
	950  3850 1000 3850
Wire Wire Line
	950  3950 1000 3950
Wire Wire Line
	950  4050 1000 4050
Text Label 1000 3650 0    50   ~ 0
EN
Text Label 1000 3750 0    50   ~ 0
JTAG_TDO
Text Label 1000 3850 0    50   ~ 0
JTAG_TMS
Text Label 1000 3950 0    50   ~ 0
JTAG_TCK
Text Label 1000 4050 0    50   ~ 0
JTAG_TDI
Wire Wire Line
	5850 5550 5900 5550
Wire Wire Line
	5850 5650 5900 5650
Wire Wire Line
	5850 5750 5900 5750
Wire Wire Line
	5850 5850 5900 5850
Text Label 5900 5550 0    50   ~ 0
JTAG_TDI
Text Label 5900 5650 0    50   ~ 0
JTAG_TCK
Text Label 5900 5750 0    50   ~ 0
JTAG_TMS
Text Label 5900 5850 0    50   ~ 0
JTAG_TDO
Wire Wire Line
	5850 6050 5900 6050
Wire Wire Line
	5850 5950 5900 5950
Text Label 5900 5950 0    50   ~ 0
UI_SERVICE_RXD_PIN
Text Label 5900 6050 0    50   ~ 0
UI_SERVICE_TXD_PIN
Wire Wire Line
	5850 4950 5900 4950
Wire Wire Line
	5850 5050 5900 5050
Text Label 5900 4950 0    50   ~ 0
BOOT
Text Label 5900 5050 0    50   ~ 0
TXD0
Wire Wire Line
	5850 5250 5900 5250
Text Label 5900 5250 0    50   ~ 0
RXD0
NoConn ~ 4650 6150
NoConn ~ 4650 6250
NoConn ~ 4650 6350
NoConn ~ 4650 6450
NoConn ~ 4650 6550
NoConn ~ 4650 6650
$Comp
L Device:LED D4
U 1 1 61AFE98C
P 6550 1250
F 0 "D4" V 6589 1133 50  0000 R CNN
F 1 "IR" V 6498 1133 50  0000 R CNN
F 2 "LED_THT:LED_D5.0mm_Horizontal_O1.27mm_Z3.0mm_Clear" H 6550 1250 50  0001 C CNN
F 3 "~" H 6550 1250 50  0001 C CNN
	1    6550 1250
	0    -1   -1   0   
$EndComp
$Comp
L power:GND #PWR024
U 1 1 61AFE9A0
P 6550 1800
F 0 "#PWR024" H 6550 1550 50  0001 C CNN
F 1 "GND" H 6555 1627 50  0000 C CNN
F 2 "" H 6550 1800 50  0001 C CNN
F 3 "" H 6550 1800 50  0001 C CNN
	1    6550 1800
	1    0    0    -1  
$EndComp
$Comp
L Device:R R13
U 1 1 61B0DAD3
P 6550 950
F 0 "R13" H 6620 996 50  0000 L CNN
F 1 "220R" H 6620 905 50  0000 L CNN
F 2 "Resistor_SMD:R_0603_1608Metric_Pad1.05x0.95mm_HandSolder" V 6480 950 50  0001 C CNN
F 3 "~" H 6550 950 50  0001 C CNN
	1    6550 950 
	1    0    0    -1  
$EndComp
Wire Wire Line
	6550 800  6550 750 
Text Label 6550 750  2    50   ~ 0
IO_IR_PWR_LED_INC
$Comp
L Transistor_BJT:BC817 Q3
U 1 1 61B10B67
P 6450 1600
F 0 "Q3" H 6400 1750 50  0000 L CNN
F 1 "BC817" H 6300 1450 50  0000 L CNN
F 2 "Package_TO_SOT_SMD:SOT-23" H 6650 1525 50  0001 L CIN
F 3 "http://www.fairchildsemi.com/ds/BC/BC817.pdf" H 6450 1600 50  0001 L CNN
	1    6450 1600
	1    0    0    -1  
$EndComp
$Comp
L Device:R R11
U 1 1 61B15331
P 6100 1600
F 0 "R11" V 6000 1500 50  0000 L CNN
F 1 "10k" V 6200 1500 50  0000 L CNN
F 2 "Resistor_SMD:R_0603_1608Metric_Pad1.05x0.95mm_HandSolder" V 6030 1600 50  0001 C CNN
F 3 "~" H 6100 1600 50  0001 C CNN
	1    6100 1600
	0    1    1    0   
$EndComp
Wire Wire Line
	5950 1600 5900 1600
Text Label 5900 1600 1    50   ~ 0
IO_IR_MOD_OUT_INC
$Comp
L Device:LED D5
U 1 1 61B2A2CF
P 6550 2750
F 0 "D5" V 6589 2633 50  0000 R CNN
F 1 "IR" V 6498 2633 50  0000 R CNN
F 2 "LED_THT:LED_D5.0mm_Horizontal_O1.27mm_Z3.0mm_Clear" H 6550 2750 50  0001 C CNN
F 3 "~" H 6550 2750 50  0001 C CNN
	1    6550 2750
	0    -1   -1   0   
$EndComp
$Comp
L power:GND #PWR025
U 1 1 61B2A2D9
P 6550 3300
F 0 "#PWR025" H 6550 3050 50  0001 C CNN
F 1 "GND" H 6555 3127 50  0000 C CNN
F 2 "" H 6550 3300 50  0001 C CNN
F 3 "" H 6550 3300 50  0001 C CNN
	1    6550 3300
	1    0    0    -1  
$EndComp
$Comp
L Device:R R14
U 1 1 61B2A2E3
P 6550 2450
F 0 "R14" H 6620 2496 50  0000 L CNN
F 1 "220R" H 6620 2405 50  0000 L CNN
F 2 "Resistor_SMD:R_0603_1608Metric_Pad1.05x0.95mm_HandSolder" V 6480 2450 50  0001 C CNN
F 3 "~" H 6550 2450 50  0001 C CNN
	1    6550 2450
	1    0    0    -1  
$EndComp
Wire Wire Line
	6550 2300 6550 2250
Text Label 6550 2250 2    50   ~ 0
IO_IR_PWR_LED_DEC
$Comp
L Transistor_BJT:BC817 Q4
U 1 1 61B2A2EF
P 6450 3100
F 0 "Q4" H 6400 3250 50  0000 L CNN
F 1 "BC817" H 6300 2950 50  0000 L CNN
F 2 "Package_TO_SOT_SMD:SOT-23" H 6650 3025 50  0001 L CIN
F 3 "http://www.fairchildsemi.com/ds/BC/BC817.pdf" H 6450 3100 50  0001 L CNN
	1    6450 3100
	1    0    0    -1  
$EndComp
$Comp
L Device:R R12
U 1 1 61B2A2F9
P 6100 3100
F 0 "R12" V 6000 3000 50  0000 L CNN
F 1 "10k" V 6200 3000 50  0000 L CNN
F 2 "Resistor_SMD:R_0603_1608Metric_Pad1.05x0.95mm_HandSolder" V 6030 3100 50  0001 C CNN
F 3 "~" H 6100 3100 50  0001 C CNN
	1    6100 3100
	0    1    1    0   
$EndComp
Wire Wire Line
	5950 3100 5900 3100
Text Label 5900 3100 1    50   ~ 0
IO_IR_MOD_OUT_DEC
$Comp
L Interface_Optical:TSOP583xx U3
U 1 1 61B35AD9
P 7450 1250
F 0 "U3" H 7100 1650 50  0000 C CNN
F 1 "VS1838B" H 7200 1550 50  0000 C CNN
F 2 "OptoDevice:Vishay_MINICAST-3Pin" H 7400 875 50  0001 C CNN
F 3 "https://www.elecrow.com/download/Infrared%20receiver%20vs1838b.pdf" H 8100 1550 50  0001 C CNN
	1    7450 1250
	1    0    0    -1  
$EndComp
$Comp
L power:GND #PWR027
U 1 1 61B3C27C
P 7900 1800
F 0 "#PWR027" H 7900 1550 50  0001 C CNN
F 1 "GND" H 7905 1627 50  0000 C CNN
F 2 "" H 7900 1800 50  0001 C CNN
F 3 "" H 7900 1800 50  0001 C CNN
	1    7900 1800
	1    0    0    -1  
$EndComp
$Comp
L Device:C C6
U 1 1 61B3D1D1
P 7900 850
F 0 "C6" H 7950 750 50  0000 L CNN
F 1 "47uF" H 8000 850 50  0000 L CNN
F 2 "Capacitor_SMD:C_1206_3216Metric_Pad1.42x1.75mm_HandSolder" H 7938 700 50  0001 C CNN
F 3 "~" H 7900 850 50  0001 C CNN
	1    7900 850 
	-1   0    0    1   
$EndComp
Wire Wire Line
	7850 1050 7900 1050
Wire Wire Line
	7900 1000 7900 1050
Connection ~ 7900 1050
Wire Wire Line
	7900 1800 7900 1450
Wire Wire Line
	7900 1450 7850 1450
$Comp
L power:GND #PWR026
U 1 1 61B48510
P 7900 700
F 0 "#PWR026" H 7900 450 50  0001 C CNN
F 1 "GND" H 7905 527 50  0000 C CNN
F 2 "" H 7900 700 50  0001 C CNN
F 3 "" H 7900 700 50  0001 C CNN
	1    7900 700 
	-1   0    0    1   
$EndComp
$Comp
L Device:R R16
U 1 1 61B48B27
P 8400 1050
F 0 "R16" V 8300 1000 50  0000 L CNN
F 1 "10R" V 8400 950 50  0000 L CNN
F 2 "Resistor_SMD:R_0603_1608Metric_Pad1.05x0.95mm_HandSolder" V 8330 1050 50  0001 C CNN
F 3 "~" H 8400 1050 50  0001 C CNN
	1    8400 1050
	0    1    1    0   
$EndComp
$Comp
L power:+3.3V #PWR030
U 1 1 61B520BA
P 8600 1000
F 0 "#PWR030" H 8600 850 50  0001 C CNN
F 1 "+3.3V" H 8615 1173 50  0000 C CNN
F 2 "" H 8600 1000 50  0001 C CNN
F 3 "" H 8600 1000 50  0001 C CNN
	1    8600 1000
	1    0    0    -1  
$EndComp
Wire Wire Line
	8600 1000 8600 1050
Wire Wire Line
	8600 1050 8550 1050
Wire Wire Line
	7850 1250 7900 1250
Text Label 7900 1250 0    50   ~ 0
IO_IR_IN_INC
$Comp
L Interface_Optical:TSOP583xx U4
U 1 1 61B589A7
P 7450 2800
F 0 "U4" H 7100 3200 50  0000 C CNN
F 1 "VS1838B" H 7200 3100 50  0000 C CNN
F 2 "OptoDevice:Vishay_MINICAST-3Pin" H 7400 2425 50  0001 C CNN
F 3 "https://www.elecrow.com/download/Infrared%20receiver%20vs1838b.pdf" H 8100 3100 50  0001 C CNN
	1    7450 2800
	1    0    0    -1  
$EndComp
$Comp
L power:GND #PWR029
U 1 1 61B589B1
P 7900 3350
F 0 "#PWR029" H 7900 3100 50  0001 C CNN
F 1 "GND" H 7905 3177 50  0000 C CNN
F 2 "" H 7900 3350 50  0001 C CNN
F 3 "" H 7900 3350 50  0001 C CNN
	1    7900 3350
	1    0    0    -1  
$EndComp
$Comp
L Device:C C7
U 1 1 61B589BB
P 7900 2400
F 0 "C7" H 7950 2300 50  0000 L CNN
F 1 "47uF" H 8000 2400 50  0000 L CNN
F 2 "Capacitor_SMD:C_1206_3216Metric_Pad1.42x1.75mm_HandSolder" H 7938 2250 50  0001 C CNN
F 3 "~" H 7900 2400 50  0001 C CNN
	1    7900 2400
	-1   0    0    1   
$EndComp
Wire Wire Line
	7850 2600 7900 2600
Wire Wire Line
	7900 2550 7900 2600
Connection ~ 7900 2600
Wire Wire Line
	7900 3350 7900 3000
Wire Wire Line
	7900 3000 7850 3000
$Comp
L power:GND #PWR028
U 1 1 61B589CA
P 7900 2250
F 0 "#PWR028" H 7900 2000 50  0001 C CNN
F 1 "GND" H 7905 2077 50  0000 C CNN
F 2 "" H 7900 2250 50  0001 C CNN
F 3 "" H 7900 2250 50  0001 C CNN
	1    7900 2250
	-1   0    0    1   
$EndComp
Wire Wire Line
	7850 2800 7900 2800
Text Label 7900 2800 0    50   ~ 0
IO_IR_IN_DEC
$Comp
L Connector_Generic:Conn_01x02 J1
U 1 1 61B5E684
P 750 1500
F 0 "J1" H 750 1300 50  0000 C CNN
F 1 "Power supply" V 850 1450 50  0000 C CNN
F 2 "Connector_PinHeader_2.54mm:PinHeader_1x02_P2.54mm_Vertical" H 750 1500 50  0001 C CNN
F 3 "~" H 750 1500 50  0001 C CNN
	1    750  1500
	-1   0    0    1   
$EndComp
$Comp
L power:GND #PWR05
U 1 1 61B63B74
P 1000 1900
F 0 "#PWR05" H 1000 1650 50  0001 C CNN
F 1 "GND" H 1005 1727 50  0000 C CNN
F 2 "" H 1000 1900 50  0001 C CNN
F 3 "" H 1000 1900 50  0001 C CNN
	1    1000 1900
	1    0    0    -1  
$EndComp
Wire Wire Line
	950  1500 1000 1500
Wire Wire Line
	1000 1500 1000 1900
$Comp
L Device:Polyfuse_Small F1
U 1 1 61B68AEE
P 1150 1400
F 0 "F1" V 950 1400 50  0000 C CNN
F 1 "0.75A ; 0.1R" V 1050 1500 50  0000 C CNN
F 2 "Resistor_SMD:R_1812_4532Metric_Pad1.30x3.40mm_HandSolder" H 1200 1200 50  0001 L CNN
F 3 "~" H 1150 1400 50  0001 C CNN
	1    1150 1400
	0    1    1    0   
$EndComp
$Comp
L Diode:1N5820 D1
U 1 1 61B6ADC8
P 1500 1650
F 0 "D1" V 1450 1500 50  0000 L CNN
F 1 "1N5820" V 1550 1300 50  0000 L CNN
F 2 "Diode_THT:D_DO-201AD_P15.24mm_Horizontal" H 1500 1475 50  0001 C CNN
F 3 "http://www.vishay.com/docs/88526/1n5820.pdf" H 1500 1650 50  0001 C CNN
	1    1500 1650
	0    1    1    0   
$EndComp
$Comp
L power:GND #PWR08
U 1 1 61B6C90B
P 1500 1900
F 0 "#PWR08" H 1500 1650 50  0001 C CNN
F 1 "GND" H 1505 1727 50  0000 C CNN
F 2 "" H 1500 1900 50  0001 C CNN
F 3 "" H 1500 1900 50  0001 C CNN
	1    1500 1900
	1    0    0    -1  
$EndComp
Wire Wire Line
	1500 1800 1500 1900
Wire Wire Line
	1650 1400 1500 1400
Connection ~ 1650 1400
Wire Wire Line
	1500 1500 1500 1400
Connection ~ 1500 1400
Wire Wire Line
	1500 1400 1250 1400
$Comp
L power:PWR_FLAG #FLG01
U 1 1 61B7FD81
P 3450 1600
F 0 "#FLG01" H 3450 1675 50  0001 C CNN
F 1 "PWR_FLAG" V 3450 1900 50  0000 C CNN
F 2 "" H 3450 1600 50  0001 C CNN
F 3 "~" H 3450 1600 50  0001 C CNN
	1    3450 1600
	-1   0    0    1   
$EndComp
Wire Wire Line
	950  1400 1050 1400
$Comp
L power:+5V #PWR016
U 1 1 61B84F52
P 3450 1300
F 0 "#PWR016" H 3450 1150 50  0001 C CNN
F 1 "+5V" V 3450 1500 50  0000 C CNN
F 2 "" H 3450 1300 50  0001 C CNN
F 3 "" H 3450 1300 50  0001 C CNN
	1    3450 1300
	1    0    0    -1  
$EndComp
$Comp
L power:GND #PWR018
U 1 1 61B89720
P 3550 1600
F 0 "#PWR018" H 3550 1350 50  0001 C CNN
F 1 "GND" V 3550 1400 50  0000 C CNN
F 2 "" H 3550 1600 50  0001 C CNN
F 3 "" H 3550 1600 50  0001 C CNN
	1    3550 1600
	1    0    0    -1  
$EndComp
$Comp
L power:PWR_FLAG #FLG02
U 1 1 61B89A89
P 3550 1550
F 0 "#FLG02" H 3550 1625 50  0001 C CNN
F 1 "PWR_FLAG" V 3550 1850 50  0000 C CNN
F 2 "" H 3550 1550 50  0001 C CNN
F 3 "~" H 3550 1550 50  0001 C CNN
	1    3550 1550
	1    0    0    -1  
$EndComp
Wire Wire Line
	3550 1550 3550 1600
Wire Wire Line
	3450 1300 3450 1600
Wire Wire Line
	8600 2600 8550 2600
Wire Wire Line
	8600 2550 8600 2600
$Comp
L power:+3.3V #PWR031
U 1 1 61B589DF
P 8600 2550
F 0 "#PWR031" H 8600 2400 50  0001 C CNN
F 1 "+3.3V" H 8615 2723 50  0000 C CNN
F 2 "" H 8600 2550 50  0001 C CNN
F 3 "" H 8600 2550 50  0001 C CNN
	1    8600 2550
	1    0    0    -1  
$EndComp
$Comp
L Device:R R17
U 1 1 61B589D4
P 8400 2600
F 0 "R17" V 8300 2550 50  0000 L CNN
F 1 "10R" V 8400 2500 50  0000 L CNN
F 2 "Resistor_SMD:R_0603_1608Metric_Pad1.05x0.95mm_HandSolder" V 8330 2600 50  0001 C CNN
F 3 "~" H 8400 2600 50  0001 C CNN
	1    8400 2600
	0    1    1    0   
$EndComp
Wire Wire Line
	7900 1050 8150 1050
Wire Wire Line
	8150 1050 8150 1000
Connection ~ 8150 1050
Wire Wire Line
	8150 1050 8250 1050
Text Label 8150 1000 1    50   ~ 0
PWR_IR_INC
Wire Wire Line
	7900 2600 8150 2600
Wire Wire Line
	8150 2600 8150 2550
Connection ~ 8150 2600
Wire Wire Line
	8150 2600 8250 2600
Text Label 8150 2550 1    50   ~ 0
PWR_IR_DEC
$Comp
L power:PWR_FLAG #FLG03
U 1 1 61BC2349
P 3700 1600
F 0 "#FLG03" H 3700 1675 50  0001 C CNN
F 1 "PWR_FLAG" V 3700 1900 50  0000 C CNN
F 2 "" H 3700 1600 50  0001 C CNN
F 3 "~" H 3700 1600 50  0001 C CNN
	1    3700 1600
	-1   0    0    1   
$EndComp
Wire Wire Line
	3700 1600 3700 1550
Text Label 3700 1550 1    50   ~ 0
PWR_IR_INC
$Comp
L power:PWR_FLAG #FLG04
U 1 1 61BC6CAC
P 3800 1600
F 0 "#FLG04" H 3800 1675 50  0001 C CNN
F 1 "PWR_FLAG" V 3800 1900 50  0000 C CNN
F 2 "" H 3800 1600 50  0001 C CNN
F 3 "~" H 3800 1600 50  0001 C CNN
	1    3800 1600
	-1   0    0    1   
$EndComp
Wire Wire Line
	3800 1600 3800 1550
Text Label 3800 1550 1    50   ~ 0
PWR_IR_DEC
$Comp
L Connector_Generic:Conn_01x08 J5
U 1 1 61BFAA96
P 750 6000
F 0 "J5" H 668 5375 50  0000 C CNN
F 1 "Sensors" H 668 5466 50  0000 C CNN
F 2 "Connector_PinHeader_2.54mm:PinHeader_1x08_P2.54mm_Vertical" H 750 6000 50  0001 C CNN
F 3 "~" H 750 6000 50  0001 C CNN
	1    750  6000
	-1   0    0    1   
$EndComp
$Comp
L power:+5V #PWR07
U 1 1 61BFCF1A
P 1250 6300
F 0 "#PWR07" H 1250 6150 50  0001 C CNN
F 1 "+5V" V 1265 6473 50  0000 C CNN
F 2 "" H 1250 6300 50  0001 C CNN
F 3 "" H 1250 6300 50  0001 C CNN
	1    1250 6300
	0    1    1    0   
$EndComp
NoConn ~ 950  6200
NoConn ~ 950  5600
NoConn ~ 950  5700
NoConn ~ 950  5800
$Comp
L power:GND #PWR04
U 1 1 61C10634
P 950 6100
F 0 "#PWR04" H 950 5850 50  0001 C CNN
F 1 "GND" V 950 5900 50  0000 C CNN
F 2 "" H 950 6100 50  0001 C CNN
F 3 "" H 950 6100 50  0001 C CNN
	1    950  6100
	0    -1   -1   0   
$EndComp
Wire Wire Line
	950  5900 1000 5900
Wire Wire Line
	950  6000 1000 6000
Text Label 1000 6000 0    50   ~ 0
IO_I2C_SCL
Text Label 1000 5900 0    50   ~ 0
IO_I2C_SDA
$Comp
L Transistor_FET:IRLZ34N Q7
U 1 1 61C21EB8
P 9400 4850
F 0 "Q7" H 9604 4896 50  0000 L CNN
F 1 "IRLZ34N" H 9604 4805 50  0000 L CNN
F 2 "Package_TO_SOT_THT:TO-220-3_Vertical" H 9650 4775 50  0001 L CIN
F 3 "http://www.infineon.com/dgdl/irlz34npbf.pdf?fileId=5546d462533600a40153567206892720" H 9400 4850 50  0001 L CNN
	1    9400 4850
	1    0    0    -1  
$EndComp
$Comp
L Transistor_BJT:BC817 Q6
U 1 1 61C225DB
P 8850 5100
F 0 "Q6" H 8800 5250 50  0000 L CNN
F 1 "BC817" H 8700 4950 50  0000 L CNN
F 2 "Package_TO_SOT_SMD:SOT-23" H 9050 5025 50  0001 L CIN
F 3 "http://www.fairchildsemi.com/ds/BC/BC817.pdf" H 8850 5100 50  0001 L CNN
	1    8850 5100
	1    0    0    -1  
$EndComp
$Comp
L Device:R R20
U 1 1 61C24B68
P 9100 4550
F 0 "R20" H 9170 4596 50  0000 L CNN
F 1 "220R" H 9170 4505 50  0000 L CNN
F 2 "Resistor_SMD:R_1206_3216Metric_Pad1.42x1.75mm_HandSolder" V 9030 4550 50  0001 C CNN
F 3 "~" H 9100 4550 50  0001 C CNN
	1    9100 4550
	1    0    0    -1  
$EndComp
$Comp
L Device:R R19
U 1 1 61C2C41B
P 8950 4550
F 0 "R19" H 8750 4600 50  0000 L CNN
F 1 "N/A" H 8650 4500 50  0000 L CNN
F 2 "Resistor_SMD:R_1206_3216Metric_Pad1.42x1.75mm_HandSolder" V 8880 4550 50  0001 C CNN
F 3 "~" H 8950 4550 50  0001 C CNN
	1    8950 4550
	1    0    0    -1  
$EndComp
Wire Wire Line
	9100 4700 9100 4850
Wire Wire Line
	9100 4850 9200 4850
Wire Wire Line
	8950 4900 8950 4850
Wire Wire Line
	9100 4850 8950 4850
Connection ~ 9100 4850
Connection ~ 8950 4850
Wire Wire Line
	8950 4850 8950 4700
$Comp
L Transistor_BJT:BC817 Q5
U 1 1 61C3A353
P 8500 5350
F 0 "Q5" H 8450 5500 50  0000 L CNN
F 1 "BC817" H 8350 5200 50  0000 L CNN
F 2 "Package_TO_SOT_SMD:SOT-23" H 8700 5275 50  0001 L CIN
F 3 "http://www.fairchildsemi.com/ds/BC/BC817.pdf" H 8500 5350 50  0001 L CNN
	1    8500 5350
	1    0    0    -1  
$EndComp
$Comp
L Device:R R18
U 1 1 61C3B043
P 8600 4900
F 0 "R18" V 8500 4800 50  0000 L CNN
F 1 "10k" V 8700 4800 50  0000 L CNN
F 2 "Resistor_SMD:R_0603_1608Metric_Pad1.05x0.95mm_HandSolder" V 8530 4900 50  0001 C CNN
F 3 "~" H 8600 4900 50  0001 C CNN
	1    8600 4900
	-1   0    0    1   
$EndComp
$Comp
L Device:R R15
U 1 1 61C3B7DA
P 8100 5350
F 0 "R15" V 8000 5250 50  0000 L CNN
F 1 "10k" V 8200 5250 50  0000 L CNN
F 2 "Resistor_SMD:R_0603_1608Metric_Pad1.05x0.95mm_HandSolder" V 8030 5350 50  0001 C CNN
F 3 "~" H 8100 5350 50  0001 C CNN
	1    8100 5350
	0    -1   -1   0   
$EndComp
Wire Wire Line
	8250 5350 8300 5350
Wire Wire Line
	8600 5150 8600 5100
Wire Wire Line
	8650 5100 8600 5100
Connection ~ 8600 5100
Wire Wire Line
	8600 5100 8600 5050
Wire Wire Line
	8950 4400 8950 4350
Wire Wire Line
	8950 4350 9050 4350
Wire Wire Line
	9100 4350 9100 4400
Connection ~ 9050 4350
Wire Wire Line
	9050 4350 9100 4350
Wire Wire Line
	9050 4250 9050 4350
$Comp
L power:+5V #PWR035
U 1 1 61C582FB
P 9050 4250
F 0 "#PWR035" H 9050 4100 50  0001 C CNN
F 1 "+5V" H 9065 4423 50  0000 C CNN
F 2 "" H 9050 4250 50  0001 C CNN
F 3 "" H 9050 4250 50  0001 C CNN
	1    9050 4250
	1    0    0    -1  
$EndComp
$Comp
L power:+3.3V #PWR032
U 1 1 61C58DCD
P 8600 4400
F 0 "#PWR032" H 8600 4250 50  0001 C CNN
F 1 "+3.3V" H 8615 4573 50  0000 C CNN
F 2 "" H 8600 4400 50  0001 C CNN
F 3 "" H 8600 4400 50  0001 C CNN
	1    8600 4400
	1    0    0    -1  
$EndComp
Wire Wire Line
	8600 4400 8600 4750
Wire Wire Line
	7950 5350 7900 5350
Text Label 7900 5350 2    50   ~ 0
IO_PWR_LED_PWM
$Comp
L power:GND #PWR033
U 1 1 61C64765
P 8600 5550
F 0 "#PWR033" H 8600 5300 50  0001 C CNN
F 1 "GND" H 8605 5377 50  0000 C CNN
F 2 "" H 8600 5550 50  0001 C CNN
F 3 "" H 8600 5550 50  0001 C CNN
	1    8600 5550
	1    0    0    -1  
$EndComp
$Comp
L power:GND #PWR034
U 1 1 61C64A55
P 8950 5550
F 0 "#PWR034" H 8950 5300 50  0001 C CNN
F 1 "GND" H 8955 5377 50  0000 C CNN
F 2 "" H 8950 5550 50  0001 C CNN
F 3 "" H 8950 5550 50  0001 C CNN
	1    8950 5550
	1    0    0    -1  
$EndComp
$Comp
L Connector_Generic:Conn_01x02 J6
U 1 1 61C65488
P 10250 4900
F 0 "J6" H 10250 4700 50  0000 C CNN
F 1 "Power LED" V 10350 4850 50  0000 C CNN
F 2 "Connector_PinHeader_2.54mm:PinHeader_1x02_P2.54mm_Vertical" H 10250 4900 50  0001 C CNN
F 3 "~" H 10250 4900 50  0001 C CNN
	1    10250 4900
	1    0    0    1   
$EndComp
$Comp
L Device:R R23
U 1 1 61C66764
P 9500 5350
F 0 "R23" V 9400 5250 50  0000 L CNN
F 1 "2k2" V 9600 5250 50  0000 L CNN
F 2 "Resistor_SMD:R_0603_1608Metric_Pad1.05x0.95mm_HandSolder" V 9430 5350 50  0001 C CNN
F 3 "~" H 9500 5350 50  0001 C CNN
	1    9500 5350
	-1   0    0    1   
$EndComp
$Comp
L power:GND #PWR043
U 1 1 61C66EAD
P 9500 5550
F 0 "#PWR043" H 9500 5300 50  0001 C CNN
F 1 "GND" H 9505 5377 50  0000 C CNN
F 2 "" H 9500 5550 50  0001 C CNN
F 3 "" H 9500 5550 50  0001 C CNN
	1    9500 5550
	1    0    0    -1  
$EndComp
Wire Wire Line
	9500 5050 9500 5150
Wire Wire Line
	8950 5300 8950 5550
Wire Wire Line
	9500 5500 9500 5550
Wire Wire Line
	10050 4900 10050 5150
Wire Wire Line
	10050 5150 9500 5150
Connection ~ 9500 5150
Wire Wire Line
	9500 5150 9500 5200
Wire Wire Line
	10050 4600 9500 4600
Wire Wire Line
	9500 4600 9500 4650
Wire Wire Line
	10050 4600 10050 4800
$Comp
L Device:C C8
U 1 1 61C8D029
P 9300 4350
F 0 "C8" H 9415 4396 50  0000 L CNN
F 1 "100n" H 9415 4305 50  0000 L CNN
F 2 "Capacitor_SMD:C_0603_1608Metric_Pad1.05x0.95mm_HandSolder" H 9338 4200 50  0001 C CNN
F 3 "~" H 9300 4350 50  0001 C CNN
	1    9300 4350
	0    -1   -1   0   
$EndComp
$Comp
L power:GND #PWR042
U 1 1 61C8F25C
P 9500 4350
F 0 "#PWR042" H 9500 4100 50  0001 C CNN
F 1 "GND" H 9505 4177 50  0000 C CNN
F 2 "" H 9500 4350 50  0001 C CNN
F 3 "" H 9500 4350 50  0001 C CNN
	1    9500 4350
	0    -1   -1   0   
$EndComp
Wire Wire Line
	9500 4350 9450 4350
Wire Wire Line
	9150 4350 9100 4350
Connection ~ 9100 4350
$Comp
L Device:C C1
U 1 1 61CD3CCB
P 1000 6450
F 0 "C1" H 1115 6496 50  0000 L CNN
F 1 "100n" H 1115 6405 50  0000 L CNN
F 2 "Capacitor_SMD:C_0603_1608Metric_Pad1.05x0.95mm_HandSolder" H 1038 6300 50  0001 C CNN
F 3 "~" H 1000 6450 50  0001 C CNN
	1    1000 6450
	1    0    0    -1  
$EndComp
Wire Wire Line
	1250 6300 1000 6300
Wire Wire Line
	1000 6300 950  6300
Connection ~ 1000 6300
$Comp
L power:GND #PWR06
U 1 1 61CE157C
P 1000 6650
F 0 "#PWR06" H 1000 6400 50  0001 C CNN
F 1 "GND" V 1000 6450 50  0000 C CNN
F 2 "" H 1000 6650 50  0001 C CNN
F 3 "" H 1000 6650 50  0001 C CNN
	1    1000 6650
	1    0    0    -1  
$EndComp
Wire Wire Line
	1000 6600 1000 6650
Text Label 5900 5150 0    50   ~ 0
IO_OVERHEATING_LED
Wire Wire Line
	5850 5350 5900 5350
Wire Wire Line
	5850 6850 5900 6850
Text Label 5900 5350 0    50   ~ 0
IO_LGHT_SENS_INC
Text Label 5900 6850 0    50   ~ 0
IO_LGHT_SENS_DEC
$Comp
L Device:R R21
U 1 1 61BAD81C
P 9150 950
F 0 "R21" H 9000 900 50  0000 C CNN
F 1 "22k" H 9000 1000 50  0000 C CNN
F 2 "Resistor_SMD:R_0603_1608Metric_Pad1.05x0.95mm_HandSolder" V 9080 950 50  0001 C CNN
F 3 "~" H 9150 950 50  0001 C CNN
	1    9150 950 
	-1   0    0    1   
$EndComp
Wire Wire Line
	9150 1100 9150 1150
Connection ~ 9150 1150
Wire Wire Line
	9150 1150 9150 1200
$Comp
L Device:C C9
U 1 1 61BC18AE
P 9400 1350
F 0 "C9" H 9515 1396 50  0000 L CNN
F 1 "100n" H 9515 1305 50  0000 L CNN
F 2 "Capacitor_SMD:C_0603_1608Metric_Pad1.05x0.95mm_HandSolder" H 9438 1200 50  0001 C CNN
F 3 "~" H 9400 1350 50  0001 C CNN
	1    9400 1350
	1    0    0    -1  
$EndComp
Wire Wire Line
	9150 1150 9400 1150
Wire Wire Line
	9400 1200 9400 1150
Connection ~ 9400 1150
Wire Wire Line
	9400 1150 9500 1150
$Comp
L power:GND #PWR040
U 1 1 61BDDA6D
P 9400 1500
F 0 "#PWR040" H 9400 1250 50  0001 C CNN
F 1 "GND" H 9405 1327 50  0000 C CNN
F 2 "" H 9400 1500 50  0001 C CNN
F 3 "" H 9400 1500 50  0001 C CNN
	1    9400 1500
	1    0    0    -1  
$EndComp
$Comp
L power:GND #PWR037
U 1 1 61BDE244
P 9150 1500
F 0 "#PWR037" H 9150 1250 50  0001 C CNN
F 1 "GND" H 9155 1327 50  0000 C CNN
F 2 "" H 9150 1500 50  0001 C CNN
F 3 "" H 9150 1500 50  0001 C CNN
	1    9150 1500
	1    0    0    -1  
$EndComp
$Comp
L power:+3.3V #PWR036
U 1 1 61BDE4F9
P 9150 800
F 0 "#PWR036" H 9150 650 50  0001 C CNN
F 1 "+3.3V" H 9165 973 50  0000 C CNN
F 2 "" H 9150 800 50  0001 C CNN
F 3 "" H 9150 800 50  0001 C CNN
	1    9150 800 
	1    0    0    -1  
$EndComp
Text Label 9500 1150 0    50   ~ 0
IO_LGHT_SENS_INC
$Comp
L Device:R R22
U 1 1 61C0A1CA
P 9150 2500
F 0 "R22" H 9000 2450 50  0000 C CNN
F 1 "22k" H 9000 2550 50  0000 C CNN
F 2 "Resistor_SMD:R_0603_1608Metric_Pad1.05x0.95mm_HandSolder" V 9080 2500 50  0001 C CNN
F 3 "~" H 9150 2500 50  0001 C CNN
	1    9150 2500
	-1   0    0    1   
$EndComp
Wire Wire Line
	9150 2650 9150 2700
Connection ~ 9150 2700
Wire Wire Line
	9150 2700 9150 2750
$Comp
L Device:C C10
U 1 1 61C0A1D3
P 9400 2900
F 0 "C10" H 9515 2946 50  0000 L CNN
F 1 "100n" H 9515 2855 50  0000 L CNN
F 2 "Capacitor_SMD:C_0603_1608Metric_Pad1.05x0.95mm_HandSolder" H 9438 2750 50  0001 C CNN
F 3 "~" H 9400 2900 50  0001 C CNN
	1    9400 2900
	1    0    0    -1  
$EndComp
Wire Wire Line
	9150 2700 9400 2700
Wire Wire Line
	9400 2750 9400 2700
Connection ~ 9400 2700
Wire Wire Line
	9400 2700 9500 2700
$Comp
L power:GND #PWR041
U 1 1 61C0A1DD
P 9400 3050
F 0 "#PWR041" H 9400 2800 50  0001 C CNN
F 1 "GND" H 9405 2877 50  0000 C CNN
F 2 "" H 9400 3050 50  0001 C CNN
F 3 "" H 9400 3050 50  0001 C CNN
	1    9400 3050
	1    0    0    -1  
$EndComp
$Comp
L power:GND #PWR039
U 1 1 61C0A1E3
P 9150 3050
F 0 "#PWR039" H 9150 2800 50  0001 C CNN
F 1 "GND" H 9155 2877 50  0000 C CNN
F 2 "" H 9150 3050 50  0001 C CNN
F 3 "" H 9150 3050 50  0001 C CNN
	1    9150 3050
	1    0    0    -1  
$EndComp
$Comp
L power:+3.3V #PWR038
U 1 1 61C0A1E9
P 9150 2350
F 0 "#PWR038" H 9150 2200 50  0001 C CNN
F 1 "+3.3V" H 9165 2523 50  0000 C CNN
F 2 "" H 9150 2350 50  0001 C CNN
F 3 "" H 9150 2350 50  0001 C CNN
	1    9150 2350
	1    0    0    -1  
$EndComp
Text Label 9500 2700 0    50   ~ 0
IO_LGHT_SENS_DEC
Wire Wire Line
	1750 1400 2000 1400
$Comp
L Sensor_Optical:SFH203 D6
U 1 1 61CF8340
P 9150 1400
F 0 "D6" V 9050 1200 50  0000 L CNN
F 1 "IR" V 9150 1200 50  0000 L CNN
F 2 "LED_THT:LED_D5.0mm_Horizontal_O1.27mm_Z3.0mm_IRBlack" H 9150 1575 50  0001 C CNN
F 3 "http://www.osram-os.com/Graphics/XPic9/00101656_0.pdf/SFH%20203,%20SFH%20203%20FA,%20Lead%20(Pb)%20Free%20Product%20-%20RoHS%20Compliant.pdf" H 9100 1400 50  0001 C CNN
	1    9150 1400
	0    1    1    0   
$EndComp
$Comp
L Sensor_Optical:SFH203 D7
U 1 1 61CF9871
P 9150 2950
F 0 "D7" V 9050 2750 50  0000 L CNN
F 1 "IR" V 9150 2750 50  0000 L CNN
F 2 "LED_THT:LED_D5.0mm_Horizontal_O1.27mm_Z3.0mm_IRBlack" H 9150 3125 50  0001 C CNN
F 3 "http://www.osram-os.com/Graphics/XPic9/00101656_0.pdf/SFH%20203,%20SFH%20203%20FA,%20Lead%20(Pb)%20Free%20Product%20-%20RoHS%20Compliant.pdf" H 9100 2950 50  0001 C CNN
	1    9150 2950
	0    1    1    0   
$EndComp
Text Label 10050 5150 0    50   ~ 0
PWR_GND
Text Label 10050 4600 0    50   ~ 0
LED_MINUS
$Comp
L Connector:TestPoint TP1
U 1 1 61BE5046
P 6200 5450
F 0 "TP1" V 6154 5638 50  0000 L CNN
F 1 "IO5" V 6245 5638 50  0000 L CNN
F 2 "TestPoint:TestPoint_Pad_D1.5mm" H 6400 5450 50  0001 C CNN
F 3 "~" H 6400 5450 50  0001 C CNN
	1    6200 5450
	0    1    1    0   
$EndComp
Wire Wire Line
	5850 5450 6200 5450
$Comp
L Connector:TestPoint TP2
U 1 1 61BEC8B9
P 6550 6150
F 0 "TP2" V 6504 6338 50  0000 L CNN
F 1 "IO18" V 6595 6338 50  0000 L CNN
F 2 "TestPoint:TestPoint_Pad_D1.5mm" H 6750 6150 50  0001 C CNN
F 3 "~" H 6750 6150 50  0001 C CNN
	1    6550 6150
	0    1    1    0   
$EndComp
Wire Wire Line
	6550 6150 5850 6150
$Comp
L Connector:TestPoint TP5
U 1 1 61C08A77
P 6550 7150
F 0 "TP5" V 6504 7338 50  0000 L CNN
F 1 "IO18" V 6595 7338 50  0000 L CNN
F 2 "TestPoint:TestPoint_Pad_D1.5mm" H 6750 7150 50  0001 C CNN
F 3 "~" H 6750 7150 50  0001 C CNN
	1    6550 7150
	0    1    1    0   
$EndComp
$Comp
L Connector:TestPoint TP4
U 1 1 61C09030
P 6550 6550
F 0 "TP4" V 6504 6738 50  0000 L CNN
F 1 "IO18" V 6595 6738 50  0000 L CNN
F 2 "TestPoint:TestPoint_Pad_D1.5mm" H 6750 6550 50  0001 C CNN
F 3 "~" H 6750 6550 50  0001 C CNN
	1    6550 6550
	0    1    1    0   
$EndComp
$Comp
L Connector:TestPoint TP3
U 1 1 61C09314
P 6200 7250
F 0 "TP3" V 6154 7438 50  0000 L CNN
F 1 "IO18" V 6245 7438 50  0000 L CNN
F 2 "TestPoint:TestPoint_Pad_D1.5mm" H 6400 7250 50  0001 C CNN
F 3 "~" H 6400 7250 50  0001 C CNN
	1    6200 7250
	0    1    1    0   
$EndComp
Wire Wire Line
	6550 7150 5850 7150
Wire Wire Line
	6200 7250 5850 7250
Wire Wire Line
	5850 6550 6550 6550
$Comp
L Connector:TestPoint TP6
U 1 1 61C319EF
P 4250 2250
F 0 "TP6" H 4308 2368 50  0000 L CNN
F 1 "GND" H 4308 2277 50  0000 L CNN
F 2 "TestPoint:TestPoint_Pad_D1.5mm" H 4450 2250 50  0001 C CNN
F 3 "~" H 4450 2250 50  0001 C CNN
	1    4250 2250
	1    0    0    -1  
$EndComp
$Comp
L power:GND #PWR044
U 1 1 61C338E3
P 4250 2250
F 0 "#PWR044" H 4250 2000 50  0001 C CNN
F 1 "GND" V 4250 2050 50  0000 C CNN
F 2 "" H 4250 2250 50  0001 C CNN
F 3 "" H 4250 2250 50  0001 C CNN
	1    4250 2250
	1    0    0    -1  
$EndComp
$Comp
L Connector:TestPoint TP7
U 1 1 61C3ABA9
P 4550 2250
F 0 "TP7" H 4608 2368 50  0000 L CNN
F 1 "GND" H 4608 2277 50  0000 L CNN
F 2 "TestPoint:TestPoint_Pad_D1.5mm" H 4750 2250 50  0001 C CNN
F 3 "~" H 4750 2250 50  0001 C CNN
	1    4550 2250
	1    0    0    -1  
$EndComp
$Comp
L power:GND #PWR045
U 1 1 61C3ABB3
P 4550 2250
F 0 "#PWR045" H 4550 2000 50  0001 C CNN
F 1 "GND" V 4550 2050 50  0000 C CNN
F 2 "" H 4550 2250 50  0001 C CNN
F 3 "" H 4550 2250 50  0001 C CNN
	1    4550 2250
	1    0    0    -1  
$EndComp
$Comp
L Connector:TestPoint TP8
U 1 1 61C42593
P 4850 2250
F 0 "TP8" H 4908 2368 50  0000 L CNN
F 1 "GND" H 4908 2277 50  0000 L CNN
F 2 "TestPoint:TestPoint_Pad_D1.5mm" H 5050 2250 50  0001 C CNN
F 3 "~" H 5050 2250 50  0001 C CNN
	1    4850 2250
	1    0    0    -1  
$EndComp
$Comp
L power:GND #PWR046
U 1 1 61C4259D
P 4850 2250
F 0 "#PWR046" H 4850 2000 50  0001 C CNN
F 1 "GND" V 4850 2050 50  0000 C CNN
F 2 "" H 4850 2250 50  0001 C CNN
F 3 "" H 4850 2250 50  0001 C CNN
	1    4850 2250
	1    0    0    -1  
$EndComp
$Comp
L power:+3.3V #PWR047
U 1 1 61C49609
P 5150 2000
F 0 "#PWR047" H 5150 1850 50  0001 C CNN
F 1 "+3.3V" H 5165 2173 50  0000 C CNN
F 2 "" H 5150 2000 50  0001 C CNN
F 3 "" H 5150 2000 50  0001 C CNN
	1    5150 2000
	1    0    0    -1  
$EndComp
$Comp
L Connector:TestPoint TP9
U 1 1 61C49EA8
P 5150 2000
F 0 "TP9" H 5092 2026 50  0000 R CNN
F 1 "+3V3" H 5092 2117 50  0000 R CNN
F 2 "TestPoint:TestPoint_Pad_D1.5mm" H 5350 2000 50  0001 C CNN
F 3 "~" H 5350 2000 50  0001 C CNN
	1    5150 2000
	-1   0    0    1   
$EndComp
$EndSCHEMATC
