G04 #@! TF.GenerationSoftware,KiCad,Pcbnew,5.1.5+dfsg1-2build2*
G04 #@! TF.CreationDate,2022-01-20T19:04:38+01:00*
G04 #@! TF.ProjectId,LED-02,4c45442d-3032-42e6-9b69-6361645f7063,rev?*
G04 #@! TF.SameCoordinates,Original*
G04 #@! TF.FileFunction,Copper,L2,Bot*
G04 #@! TF.FilePolarity,Positive*
%FSLAX46Y46*%
G04 Gerber Fmt 4.6, Leading zero omitted, Abs format (unit mm)*
G04 Created by KiCad (PCBNEW 5.1.5+dfsg1-2build2) date 2022-01-20 19:04:38*
%MOMM*%
%LPD*%
G04 APERTURE LIST*
%ADD10C,0.100000*%
%ADD11C,1.500000*%
%ADD12C,0.254000*%
G04 APERTURE END LIST*
G04 #@! TA.AperFunction,ComponentPad*
D10*
G36*
X127824504Y-141699204D02*
G01*
X127848773Y-141702804D01*
X127872571Y-141708765D01*
X127895671Y-141717030D01*
X127917849Y-141727520D01*
X127938893Y-141740133D01*
X127958598Y-141754747D01*
X127976777Y-141771223D01*
X127993253Y-141789402D01*
X128007867Y-141809107D01*
X128020480Y-141830151D01*
X128030970Y-141852329D01*
X128039235Y-141875429D01*
X128045196Y-141899227D01*
X128048796Y-141923496D01*
X128050000Y-141948000D01*
X128050000Y-143548000D01*
X128048796Y-143572504D01*
X128045196Y-143596773D01*
X128039235Y-143620571D01*
X128030970Y-143643671D01*
X128020480Y-143665849D01*
X128007867Y-143686893D01*
X127993253Y-143706598D01*
X127976777Y-143724777D01*
X127958598Y-143741253D01*
X127938893Y-143755867D01*
X127917849Y-143768480D01*
X127895671Y-143778970D01*
X127872571Y-143787235D01*
X127848773Y-143793196D01*
X127824504Y-143796796D01*
X127800000Y-143798000D01*
X126200000Y-143798000D01*
X126175496Y-143796796D01*
X126151227Y-143793196D01*
X126127429Y-143787235D01*
X126104329Y-143778970D01*
X126082151Y-143768480D01*
X126061107Y-143755867D01*
X126041402Y-143741253D01*
X126023223Y-143724777D01*
X126006747Y-143706598D01*
X125992133Y-143686893D01*
X125979520Y-143665849D01*
X125969030Y-143643671D01*
X125960765Y-143620571D01*
X125954804Y-143596773D01*
X125951204Y-143572504D01*
X125950000Y-143548000D01*
X125950000Y-141948000D01*
X125951204Y-141923496D01*
X125954804Y-141899227D01*
X125960765Y-141875429D01*
X125969030Y-141852329D01*
X125979520Y-141830151D01*
X125992133Y-141809107D01*
X126006747Y-141789402D01*
X126023223Y-141771223D01*
X126041402Y-141754747D01*
X126061107Y-141740133D01*
X126082151Y-141727520D01*
X126104329Y-141717030D01*
X126127429Y-141708765D01*
X126151227Y-141702804D01*
X126175496Y-141699204D01*
X126200000Y-141698000D01*
X127800000Y-141698000D01*
X127824504Y-141699204D01*
G37*
G04 #@! TD.AperFunction*
G04 #@! TA.AperFunction,ComponentPad*
G36*
X129602504Y-96233204D02*
G01*
X129626773Y-96236804D01*
X129650571Y-96242765D01*
X129673671Y-96251030D01*
X129695849Y-96261520D01*
X129716893Y-96274133D01*
X129736598Y-96288747D01*
X129754777Y-96305223D01*
X129771253Y-96323402D01*
X129785867Y-96343107D01*
X129798480Y-96364151D01*
X129808970Y-96386329D01*
X129817235Y-96409429D01*
X129823196Y-96433227D01*
X129826796Y-96457496D01*
X129828000Y-96482000D01*
X129828000Y-98082000D01*
X129826796Y-98106504D01*
X129823196Y-98130773D01*
X129817235Y-98154571D01*
X129808970Y-98177671D01*
X129798480Y-98199849D01*
X129785867Y-98220893D01*
X129771253Y-98240598D01*
X129754777Y-98258777D01*
X129736598Y-98275253D01*
X129716893Y-98289867D01*
X129695849Y-98302480D01*
X129673671Y-98312970D01*
X129650571Y-98321235D01*
X129626773Y-98327196D01*
X129602504Y-98330796D01*
X129578000Y-98332000D01*
X127978000Y-98332000D01*
X127953496Y-98330796D01*
X127929227Y-98327196D01*
X127905429Y-98321235D01*
X127882329Y-98312970D01*
X127860151Y-98302480D01*
X127839107Y-98289867D01*
X127819402Y-98275253D01*
X127801223Y-98258777D01*
X127784747Y-98240598D01*
X127770133Y-98220893D01*
X127757520Y-98199849D01*
X127747030Y-98177671D01*
X127738765Y-98154571D01*
X127732804Y-98130773D01*
X127729204Y-98106504D01*
X127728000Y-98082000D01*
X127728000Y-96482000D01*
X127729204Y-96457496D01*
X127732804Y-96433227D01*
X127738765Y-96409429D01*
X127747030Y-96386329D01*
X127757520Y-96364151D01*
X127770133Y-96343107D01*
X127784747Y-96323402D01*
X127801223Y-96305223D01*
X127819402Y-96288747D01*
X127839107Y-96274133D01*
X127860151Y-96261520D01*
X127882329Y-96251030D01*
X127905429Y-96242765D01*
X127929227Y-96236804D01*
X127953496Y-96233204D01*
X127978000Y-96232000D01*
X129578000Y-96232000D01*
X129602504Y-96233204D01*
G37*
G04 #@! TD.AperFunction*
G04 #@! TA.AperFunction,ComponentPad*
G36*
X151954504Y-119601204D02*
G01*
X151978773Y-119604804D01*
X152002571Y-119610765D01*
X152025671Y-119619030D01*
X152047849Y-119629520D01*
X152068893Y-119642133D01*
X152088598Y-119656747D01*
X152106777Y-119673223D01*
X152123253Y-119691402D01*
X152137867Y-119711107D01*
X152150480Y-119732151D01*
X152160970Y-119754329D01*
X152169235Y-119777429D01*
X152175196Y-119801227D01*
X152178796Y-119825496D01*
X152180000Y-119850000D01*
X152180000Y-121450000D01*
X152178796Y-121474504D01*
X152175196Y-121498773D01*
X152169235Y-121522571D01*
X152160970Y-121545671D01*
X152150480Y-121567849D01*
X152137867Y-121588893D01*
X152123253Y-121608598D01*
X152106777Y-121626777D01*
X152088598Y-121643253D01*
X152068893Y-121657867D01*
X152047849Y-121670480D01*
X152025671Y-121680970D01*
X152002571Y-121689235D01*
X151978773Y-121695196D01*
X151954504Y-121698796D01*
X151930000Y-121700000D01*
X150330000Y-121700000D01*
X150305496Y-121698796D01*
X150281227Y-121695196D01*
X150257429Y-121689235D01*
X150234329Y-121680970D01*
X150212151Y-121670480D01*
X150191107Y-121657867D01*
X150171402Y-121643253D01*
X150153223Y-121626777D01*
X150136747Y-121608598D01*
X150122133Y-121588893D01*
X150109520Y-121567849D01*
X150099030Y-121545671D01*
X150090765Y-121522571D01*
X150084804Y-121498773D01*
X150081204Y-121474504D01*
X150080000Y-121450000D01*
X150080000Y-119850000D01*
X150081204Y-119825496D01*
X150084804Y-119801227D01*
X150090765Y-119777429D01*
X150099030Y-119754329D01*
X150109520Y-119732151D01*
X150122133Y-119711107D01*
X150136747Y-119691402D01*
X150153223Y-119673223D01*
X150171402Y-119656747D01*
X150191107Y-119642133D01*
X150212151Y-119629520D01*
X150234329Y-119619030D01*
X150257429Y-119610765D01*
X150281227Y-119604804D01*
X150305496Y-119601204D01*
X150330000Y-119600000D01*
X151930000Y-119600000D01*
X151954504Y-119601204D01*
G37*
G04 #@! TD.AperFunction*
G04 #@! TA.AperFunction,ComponentPad*
G36*
X107504504Y-139667204D02*
G01*
X107528773Y-139670804D01*
X107552571Y-139676765D01*
X107575671Y-139685030D01*
X107597849Y-139695520D01*
X107618893Y-139708133D01*
X107638598Y-139722747D01*
X107656777Y-139739223D01*
X107673253Y-139757402D01*
X107687867Y-139777107D01*
X107700480Y-139798151D01*
X107710970Y-139820329D01*
X107719235Y-139843429D01*
X107725196Y-139867227D01*
X107728796Y-139891496D01*
X107730000Y-139916000D01*
X107730000Y-141516000D01*
X107728796Y-141540504D01*
X107725196Y-141564773D01*
X107719235Y-141588571D01*
X107710970Y-141611671D01*
X107700480Y-141633849D01*
X107687867Y-141654893D01*
X107673253Y-141674598D01*
X107656777Y-141692777D01*
X107638598Y-141709253D01*
X107618893Y-141723867D01*
X107597849Y-141736480D01*
X107575671Y-141746970D01*
X107552571Y-141755235D01*
X107528773Y-141761196D01*
X107504504Y-141764796D01*
X107480000Y-141766000D01*
X105880000Y-141766000D01*
X105855496Y-141764796D01*
X105831227Y-141761196D01*
X105807429Y-141755235D01*
X105784329Y-141746970D01*
X105762151Y-141736480D01*
X105741107Y-141723867D01*
X105721402Y-141709253D01*
X105703223Y-141692777D01*
X105686747Y-141674598D01*
X105672133Y-141654893D01*
X105659520Y-141633849D01*
X105649030Y-141611671D01*
X105640765Y-141588571D01*
X105634804Y-141564773D01*
X105631204Y-141540504D01*
X105630000Y-141516000D01*
X105630000Y-139916000D01*
X105631204Y-139891496D01*
X105634804Y-139867227D01*
X105640765Y-139843429D01*
X105649030Y-139820329D01*
X105659520Y-139798151D01*
X105672133Y-139777107D01*
X105686747Y-139757402D01*
X105703223Y-139739223D01*
X105721402Y-139722747D01*
X105741107Y-139708133D01*
X105762151Y-139695520D01*
X105784329Y-139685030D01*
X105807429Y-139676765D01*
X105831227Y-139670804D01*
X105855496Y-139667204D01*
X105880000Y-139666000D01*
X107480000Y-139666000D01*
X107504504Y-139667204D01*
G37*
G04 #@! TD.AperFunction*
G04 #@! TA.AperFunction,ComponentPad*
G36*
X120966504Y-107409204D02*
G01*
X120990773Y-107412804D01*
X121014571Y-107418765D01*
X121037671Y-107427030D01*
X121059849Y-107437520D01*
X121080893Y-107450133D01*
X121100598Y-107464747D01*
X121118777Y-107481223D01*
X121135253Y-107499402D01*
X121149867Y-107519107D01*
X121162480Y-107540151D01*
X121172970Y-107562329D01*
X121181235Y-107585429D01*
X121187196Y-107609227D01*
X121190796Y-107633496D01*
X121192000Y-107658000D01*
X121192000Y-109258000D01*
X121190796Y-109282504D01*
X121187196Y-109306773D01*
X121181235Y-109330571D01*
X121172970Y-109353671D01*
X121162480Y-109375849D01*
X121149867Y-109396893D01*
X121135253Y-109416598D01*
X121118777Y-109434777D01*
X121100598Y-109451253D01*
X121080893Y-109465867D01*
X121059849Y-109478480D01*
X121037671Y-109488970D01*
X121014571Y-109497235D01*
X120990773Y-109503196D01*
X120966504Y-109506796D01*
X120942000Y-109508000D01*
X119342000Y-109508000D01*
X119317496Y-109506796D01*
X119293227Y-109503196D01*
X119269429Y-109497235D01*
X119246329Y-109488970D01*
X119224151Y-109478480D01*
X119203107Y-109465867D01*
X119183402Y-109451253D01*
X119165223Y-109434777D01*
X119148747Y-109416598D01*
X119134133Y-109396893D01*
X119121520Y-109375849D01*
X119111030Y-109353671D01*
X119102765Y-109330571D01*
X119096804Y-109306773D01*
X119093204Y-109282504D01*
X119092000Y-109258000D01*
X119092000Y-107658000D01*
X119093204Y-107633496D01*
X119096804Y-107609227D01*
X119102765Y-107585429D01*
X119111030Y-107562329D01*
X119121520Y-107540151D01*
X119134133Y-107519107D01*
X119148747Y-107499402D01*
X119165223Y-107481223D01*
X119183402Y-107464747D01*
X119203107Y-107450133D01*
X119224151Y-107437520D01*
X119246329Y-107427030D01*
X119269429Y-107418765D01*
X119293227Y-107412804D01*
X119317496Y-107409204D01*
X119342000Y-107408000D01*
X120942000Y-107408000D01*
X120966504Y-107409204D01*
G37*
G04 #@! TD.AperFunction*
D11*
X121158000Y-127000000D03*
X121158000Y-124968000D03*
X121158000Y-129032000D03*
X123190000Y-127000000D03*
X119126000Y-127000000D03*
X132842000Y-126746000D03*
X132842000Y-124714000D03*
X132842000Y-128778000D03*
X134874000Y-126746000D03*
X130810000Y-126746000D03*
X140462000Y-116840000D03*
X138430000Y-116840000D03*
X142494000Y-116840000D03*
X140462000Y-114808000D03*
X140462000Y-118872000D03*
X127254000Y-110490000D03*
X125222000Y-110490000D03*
X129286000Y-110490000D03*
X127254000Y-108458000D03*
X127254000Y-112522000D03*
X114554000Y-116332000D03*
X114554000Y-114300000D03*
X112522000Y-116332000D03*
X116586000Y-116332000D03*
X114554000Y-118364000D03*
X104140000Y-113254000D03*
X104140000Y-111252000D03*
X106426000Y-113284000D03*
X104140000Y-115316000D03*
X102108000Y-113284000D03*
X100584000Y-130810000D03*
X100584000Y-128778000D03*
X100584000Y-132842000D03*
X98806000Y-130810000D03*
X102870000Y-130810000D03*
X109982000Y-130556000D03*
X107950000Y-130556000D03*
X112014000Y-130556000D03*
X109982000Y-132588000D03*
X109982000Y-128524000D03*
X110000000Y-147746000D03*
X112014000Y-147574000D03*
X107950000Y-147828000D03*
X109982000Y-149860000D03*
X109982000Y-145796000D03*
X120142000Y-141986000D03*
X120142000Y-139954000D03*
X120142000Y-144018000D03*
X118110000Y-141986000D03*
X122174000Y-141986000D03*
X127000000Y-153670000D03*
X127000000Y-155702000D03*
X127000000Y-151638000D03*
X129032000Y-153670000D03*
X124968000Y-153670000D03*
X134356022Y-142424314D03*
X134366000Y-140335000D03*
X136525000Y-142494000D03*
X134366000Y-144526000D03*
X132334000Y-142494000D03*
X144000000Y-147746000D03*
X144018000Y-145542000D03*
X146050000Y-147955000D03*
X144018000Y-149860000D03*
X141986000Y-147828000D03*
X143510000Y-131445000D03*
X143510000Y-129540000D03*
X143510000Y-133350000D03*
X145415000Y-131445000D03*
X141605000Y-131445000D03*
X153238000Y-131746000D03*
X153543000Y-129794000D03*
X155448000Y-132080000D03*
X152654000Y-133858000D03*
X151003000Y-131445000D03*
X149746000Y-112746000D03*
X150114000Y-110744000D03*
X151892000Y-113030000D03*
X149352000Y-114808000D03*
X147701000Y-112268000D03*
X136398000Y-102108000D03*
X136652000Y-99949000D03*
X138684000Y-102108000D03*
X134366000Y-102108000D03*
X136398000Y-104140000D03*
X124460000Y-102870000D03*
X117475000Y-99695000D03*
X118745000Y-103632000D03*
X118000000Y-101746000D03*
X119888000Y-100838000D03*
X116078000Y-102616000D03*
X129540000Y-121412000D03*
X121412000Y-120396000D03*
X109220000Y-123952000D03*
X115824000Y-137160000D03*
X129032000Y-146304000D03*
X144272000Y-137668000D03*
X146304000Y-119888000D03*
X133350000Y-108458000D03*
X115316000Y-109982000D03*
X106426000Y-106934000D03*
X98298000Y-124968000D03*
X104394000Y-144526000D03*
X120650000Y-154940000D03*
X139954000Y-152908000D03*
X153416000Y-138176000D03*
X154432000Y-117602000D03*
X143002000Y-102362000D03*
X123190000Y-97790000D03*
D12*
G36*
X127410136Y-95681884D02*
G01*
X127373506Y-95701463D01*
X127276815Y-95780815D01*
X127197463Y-95877506D01*
X127138498Y-95987820D01*
X127102188Y-96107518D01*
X127089928Y-96232000D01*
X127093000Y-96996250D01*
X127251750Y-97155000D01*
X128651000Y-97155000D01*
X128651000Y-97135000D01*
X128905000Y-97135000D01*
X128905000Y-97155000D01*
X130304250Y-97155000D01*
X130463000Y-96996250D01*
X130466072Y-96232000D01*
X130453812Y-96107518D01*
X130417502Y-95987820D01*
X130358537Y-95877506D01*
X130338023Y-95852509D01*
X130862082Y-95898876D01*
X133046303Y-96248775D01*
X135200401Y-96751876D01*
X137313645Y-97405671D01*
X139375507Y-98206903D01*
X141375715Y-99151582D01*
X143304304Y-100234999D01*
X145151666Y-101451759D01*
X146908597Y-102795799D01*
X148566344Y-104260422D01*
X150116649Y-105838334D01*
X151551788Y-107521671D01*
X152864611Y-109302049D01*
X154048578Y-111170597D01*
X155097791Y-113118006D01*
X156007021Y-115134574D01*
X156771740Y-117210256D01*
X157388138Y-119334710D01*
X157853143Y-121497351D01*
X158164440Y-123687407D01*
X158320477Y-125893966D01*
X158320477Y-128106034D01*
X158164440Y-130312593D01*
X157853143Y-132502649D01*
X157388138Y-134665290D01*
X156771740Y-136789744D01*
X156007021Y-138865426D01*
X155097791Y-140881994D01*
X154048578Y-142829403D01*
X152864611Y-144697951D01*
X151551788Y-146478329D01*
X150116649Y-148161666D01*
X148566344Y-149739578D01*
X146908597Y-151204201D01*
X145151666Y-152548241D01*
X143304304Y-153765001D01*
X141375715Y-154848418D01*
X139375507Y-155793097D01*
X137313645Y-156594329D01*
X135200401Y-157248124D01*
X133046303Y-157751225D01*
X130862082Y-158101124D01*
X128658621Y-158296079D01*
X126446897Y-158335119D01*
X124237928Y-158218049D01*
X122042719Y-157945451D01*
X119872208Y-157518686D01*
X117737207Y-156939877D01*
X115648352Y-156211910D01*
X113616051Y-155338411D01*
X111650428Y-154323731D01*
X109761276Y-153172925D01*
X107958007Y-151891727D01*
X106249603Y-150486520D01*
X104644577Y-148964304D01*
X103150925Y-147332664D01*
X101776087Y-145599727D01*
X100526914Y-143774127D01*
X99409628Y-141864959D01*
X98429797Y-139881734D01*
X97592300Y-137834334D01*
X97579366Y-137795000D01*
X103378000Y-137795000D01*
X103378000Y-143510000D01*
X103380440Y-143534776D01*
X103387667Y-143558601D01*
X103399403Y-143580557D01*
X103415197Y-143599803D01*
X103434443Y-143615597D01*
X103456399Y-143627333D01*
X103480224Y-143634560D01*
X103505000Y-143637000D01*
X109855000Y-143637000D01*
X109879776Y-143634560D01*
X109903601Y-143627333D01*
X109925557Y-143615597D01*
X109944803Y-143599803D01*
X109960597Y-143580557D01*
X109972333Y-143558601D01*
X109979560Y-143534776D01*
X109982000Y-143510000D01*
X109982000Y-140335000D01*
X123698000Y-140335000D01*
X123698000Y-145415000D01*
X123700440Y-145439776D01*
X123707667Y-145463601D01*
X123719403Y-145485557D01*
X123735197Y-145504803D01*
X123754443Y-145520597D01*
X123776399Y-145532333D01*
X123800224Y-145539560D01*
X123825000Y-145542000D01*
X130175000Y-145542000D01*
X130199776Y-145539560D01*
X130223601Y-145532333D01*
X130245557Y-145520597D01*
X130264803Y-145504803D01*
X130280597Y-145485557D01*
X130292333Y-145463601D01*
X130299560Y-145439776D01*
X130302000Y-145415000D01*
X130302000Y-140335000D01*
X130299560Y-140310224D01*
X130292333Y-140286399D01*
X130280597Y-140264443D01*
X130264803Y-140245197D01*
X130245557Y-140229403D01*
X130223601Y-140217667D01*
X130199776Y-140210440D01*
X130175000Y-140208000D01*
X123825000Y-140208000D01*
X123800224Y-140210440D01*
X123776399Y-140217667D01*
X123754443Y-140229403D01*
X123735197Y-140245197D01*
X123719403Y-140264443D01*
X123707667Y-140286399D01*
X123700440Y-140310224D01*
X123698000Y-140335000D01*
X109982000Y-140335000D01*
X109982000Y-137795000D01*
X109979560Y-137770224D01*
X109972333Y-137746399D01*
X109960597Y-137724443D01*
X109944803Y-137705197D01*
X109925557Y-137689403D01*
X109903601Y-137677667D01*
X109879776Y-137670440D01*
X109855000Y-137668000D01*
X103505000Y-137668000D01*
X103480224Y-137670440D01*
X103456399Y-137677667D01*
X103434443Y-137689403D01*
X103415197Y-137705197D01*
X103399403Y-137724443D01*
X103387667Y-137746399D01*
X103380440Y-137770224D01*
X103378000Y-137795000D01*
X97579366Y-137795000D01*
X96901311Y-135732957D01*
X96360273Y-133588074D01*
X95971880Y-131410368D01*
X95738067Y-129210691D01*
X95660000Y-127000000D01*
X95738067Y-124789309D01*
X95971880Y-122589632D01*
X96360273Y-120411926D01*
X96901311Y-118267043D01*
X97036472Y-117856000D01*
X148463000Y-117856000D01*
X148463000Y-123190000D01*
X148465440Y-123214776D01*
X148472667Y-123238601D01*
X148484403Y-123260557D01*
X148500197Y-123279803D01*
X148519443Y-123295597D01*
X148541399Y-123307333D01*
X148565224Y-123314560D01*
X148590000Y-123317000D01*
X153670000Y-123317000D01*
X153694776Y-123314560D01*
X153718601Y-123307333D01*
X153740557Y-123295597D01*
X153759803Y-123279803D01*
X153775597Y-123260557D01*
X153787333Y-123238601D01*
X153794560Y-123214776D01*
X153797000Y-123190000D01*
X153797000Y-117856000D01*
X153794560Y-117831224D01*
X153787333Y-117807399D01*
X153775597Y-117785443D01*
X153759803Y-117766197D01*
X153740557Y-117750403D01*
X153718601Y-117738667D01*
X153694776Y-117731440D01*
X153670000Y-117729000D01*
X148590000Y-117729000D01*
X148565224Y-117731440D01*
X148541399Y-117738667D01*
X148519443Y-117750403D01*
X148500197Y-117766197D01*
X148484403Y-117785443D01*
X148472667Y-117807399D01*
X148465440Y-117831224D01*
X148463000Y-117856000D01*
X97036472Y-117856000D01*
X97592300Y-116165666D01*
X98429797Y-114118266D01*
X99409628Y-112135041D01*
X100526914Y-110225873D01*
X101776087Y-108400273D01*
X103150925Y-106667336D01*
X103720629Y-106045000D01*
X117348000Y-106045000D01*
X117348000Y-111125000D01*
X117350440Y-111149776D01*
X117357667Y-111173601D01*
X117369403Y-111195557D01*
X117385197Y-111214803D01*
X117404443Y-111230597D01*
X117426399Y-111242333D01*
X117450224Y-111249560D01*
X117475000Y-111252000D01*
X122555000Y-111252000D01*
X122579776Y-111249560D01*
X122603601Y-111242333D01*
X122625557Y-111230597D01*
X122644803Y-111214803D01*
X122660597Y-111195557D01*
X122672333Y-111173601D01*
X122679560Y-111149776D01*
X122682000Y-111125000D01*
X122682000Y-106045000D01*
X122679560Y-106020224D01*
X122672333Y-105996399D01*
X122660597Y-105974443D01*
X122644803Y-105955197D01*
X122625557Y-105939403D01*
X122603601Y-105927667D01*
X122579776Y-105920440D01*
X122555000Y-105918000D01*
X117475000Y-105918000D01*
X117450224Y-105920440D01*
X117426399Y-105927667D01*
X117404443Y-105939403D01*
X117385197Y-105955197D01*
X117369403Y-105974443D01*
X117357667Y-105996399D01*
X117350440Y-106020224D01*
X117348000Y-106045000D01*
X103720629Y-106045000D01*
X104644577Y-105035696D01*
X106249603Y-103513480D01*
X107958007Y-102108273D01*
X109761276Y-100827075D01*
X111650428Y-99676269D01*
X113616051Y-98661589D01*
X114382879Y-98332000D01*
X127089928Y-98332000D01*
X127102188Y-98456482D01*
X127138498Y-98576180D01*
X127197463Y-98686494D01*
X127276815Y-98783185D01*
X127373506Y-98862537D01*
X127483820Y-98921502D01*
X127603518Y-98957812D01*
X127728000Y-98970072D01*
X128492250Y-98967000D01*
X128651000Y-98808250D01*
X128651000Y-97409000D01*
X128905000Y-97409000D01*
X128905000Y-98808250D01*
X129063750Y-98967000D01*
X129828000Y-98970072D01*
X129952482Y-98957812D01*
X130072180Y-98921502D01*
X130182494Y-98862537D01*
X130279185Y-98783185D01*
X130358537Y-98686494D01*
X130417502Y-98576180D01*
X130453812Y-98456482D01*
X130466072Y-98332000D01*
X130463000Y-97567750D01*
X130304250Y-97409000D01*
X128905000Y-97409000D01*
X128651000Y-97409000D01*
X127251750Y-97409000D01*
X127093000Y-97567750D01*
X127089928Y-98332000D01*
X114382879Y-98332000D01*
X115648352Y-97788090D01*
X117737207Y-97060123D01*
X119872208Y-96481314D01*
X122042719Y-96054549D01*
X124237928Y-95781951D01*
X126446897Y-95664881D01*
X127410136Y-95681884D01*
G37*
X127410136Y-95681884D02*
X127373506Y-95701463D01*
X127276815Y-95780815D01*
X127197463Y-95877506D01*
X127138498Y-95987820D01*
X127102188Y-96107518D01*
X127089928Y-96232000D01*
X127093000Y-96996250D01*
X127251750Y-97155000D01*
X128651000Y-97155000D01*
X128651000Y-97135000D01*
X128905000Y-97135000D01*
X128905000Y-97155000D01*
X130304250Y-97155000D01*
X130463000Y-96996250D01*
X130466072Y-96232000D01*
X130453812Y-96107518D01*
X130417502Y-95987820D01*
X130358537Y-95877506D01*
X130338023Y-95852509D01*
X130862082Y-95898876D01*
X133046303Y-96248775D01*
X135200401Y-96751876D01*
X137313645Y-97405671D01*
X139375507Y-98206903D01*
X141375715Y-99151582D01*
X143304304Y-100234999D01*
X145151666Y-101451759D01*
X146908597Y-102795799D01*
X148566344Y-104260422D01*
X150116649Y-105838334D01*
X151551788Y-107521671D01*
X152864611Y-109302049D01*
X154048578Y-111170597D01*
X155097791Y-113118006D01*
X156007021Y-115134574D01*
X156771740Y-117210256D01*
X157388138Y-119334710D01*
X157853143Y-121497351D01*
X158164440Y-123687407D01*
X158320477Y-125893966D01*
X158320477Y-128106034D01*
X158164440Y-130312593D01*
X157853143Y-132502649D01*
X157388138Y-134665290D01*
X156771740Y-136789744D01*
X156007021Y-138865426D01*
X155097791Y-140881994D01*
X154048578Y-142829403D01*
X152864611Y-144697951D01*
X151551788Y-146478329D01*
X150116649Y-148161666D01*
X148566344Y-149739578D01*
X146908597Y-151204201D01*
X145151666Y-152548241D01*
X143304304Y-153765001D01*
X141375715Y-154848418D01*
X139375507Y-155793097D01*
X137313645Y-156594329D01*
X135200401Y-157248124D01*
X133046303Y-157751225D01*
X130862082Y-158101124D01*
X128658621Y-158296079D01*
X126446897Y-158335119D01*
X124237928Y-158218049D01*
X122042719Y-157945451D01*
X119872208Y-157518686D01*
X117737207Y-156939877D01*
X115648352Y-156211910D01*
X113616051Y-155338411D01*
X111650428Y-154323731D01*
X109761276Y-153172925D01*
X107958007Y-151891727D01*
X106249603Y-150486520D01*
X104644577Y-148964304D01*
X103150925Y-147332664D01*
X101776087Y-145599727D01*
X100526914Y-143774127D01*
X99409628Y-141864959D01*
X98429797Y-139881734D01*
X97592300Y-137834334D01*
X97579366Y-137795000D01*
X103378000Y-137795000D01*
X103378000Y-143510000D01*
X103380440Y-143534776D01*
X103387667Y-143558601D01*
X103399403Y-143580557D01*
X103415197Y-143599803D01*
X103434443Y-143615597D01*
X103456399Y-143627333D01*
X103480224Y-143634560D01*
X103505000Y-143637000D01*
X109855000Y-143637000D01*
X109879776Y-143634560D01*
X109903601Y-143627333D01*
X109925557Y-143615597D01*
X109944803Y-143599803D01*
X109960597Y-143580557D01*
X109972333Y-143558601D01*
X109979560Y-143534776D01*
X109982000Y-143510000D01*
X109982000Y-140335000D01*
X123698000Y-140335000D01*
X123698000Y-145415000D01*
X123700440Y-145439776D01*
X123707667Y-145463601D01*
X123719403Y-145485557D01*
X123735197Y-145504803D01*
X123754443Y-145520597D01*
X123776399Y-145532333D01*
X123800224Y-145539560D01*
X123825000Y-145542000D01*
X130175000Y-145542000D01*
X130199776Y-145539560D01*
X130223601Y-145532333D01*
X130245557Y-145520597D01*
X130264803Y-145504803D01*
X130280597Y-145485557D01*
X130292333Y-145463601D01*
X130299560Y-145439776D01*
X130302000Y-145415000D01*
X130302000Y-140335000D01*
X130299560Y-140310224D01*
X130292333Y-140286399D01*
X130280597Y-140264443D01*
X130264803Y-140245197D01*
X130245557Y-140229403D01*
X130223601Y-140217667D01*
X130199776Y-140210440D01*
X130175000Y-140208000D01*
X123825000Y-140208000D01*
X123800224Y-140210440D01*
X123776399Y-140217667D01*
X123754443Y-140229403D01*
X123735197Y-140245197D01*
X123719403Y-140264443D01*
X123707667Y-140286399D01*
X123700440Y-140310224D01*
X123698000Y-140335000D01*
X109982000Y-140335000D01*
X109982000Y-137795000D01*
X109979560Y-137770224D01*
X109972333Y-137746399D01*
X109960597Y-137724443D01*
X109944803Y-137705197D01*
X109925557Y-137689403D01*
X109903601Y-137677667D01*
X109879776Y-137670440D01*
X109855000Y-137668000D01*
X103505000Y-137668000D01*
X103480224Y-137670440D01*
X103456399Y-137677667D01*
X103434443Y-137689403D01*
X103415197Y-137705197D01*
X103399403Y-137724443D01*
X103387667Y-137746399D01*
X103380440Y-137770224D01*
X103378000Y-137795000D01*
X97579366Y-137795000D01*
X96901311Y-135732957D01*
X96360273Y-133588074D01*
X95971880Y-131410368D01*
X95738067Y-129210691D01*
X95660000Y-127000000D01*
X95738067Y-124789309D01*
X95971880Y-122589632D01*
X96360273Y-120411926D01*
X96901311Y-118267043D01*
X97036472Y-117856000D01*
X148463000Y-117856000D01*
X148463000Y-123190000D01*
X148465440Y-123214776D01*
X148472667Y-123238601D01*
X148484403Y-123260557D01*
X148500197Y-123279803D01*
X148519443Y-123295597D01*
X148541399Y-123307333D01*
X148565224Y-123314560D01*
X148590000Y-123317000D01*
X153670000Y-123317000D01*
X153694776Y-123314560D01*
X153718601Y-123307333D01*
X153740557Y-123295597D01*
X153759803Y-123279803D01*
X153775597Y-123260557D01*
X153787333Y-123238601D01*
X153794560Y-123214776D01*
X153797000Y-123190000D01*
X153797000Y-117856000D01*
X153794560Y-117831224D01*
X153787333Y-117807399D01*
X153775597Y-117785443D01*
X153759803Y-117766197D01*
X153740557Y-117750403D01*
X153718601Y-117738667D01*
X153694776Y-117731440D01*
X153670000Y-117729000D01*
X148590000Y-117729000D01*
X148565224Y-117731440D01*
X148541399Y-117738667D01*
X148519443Y-117750403D01*
X148500197Y-117766197D01*
X148484403Y-117785443D01*
X148472667Y-117807399D01*
X148465440Y-117831224D01*
X148463000Y-117856000D01*
X97036472Y-117856000D01*
X97592300Y-116165666D01*
X98429797Y-114118266D01*
X99409628Y-112135041D01*
X100526914Y-110225873D01*
X101776087Y-108400273D01*
X103150925Y-106667336D01*
X103720629Y-106045000D01*
X117348000Y-106045000D01*
X117348000Y-111125000D01*
X117350440Y-111149776D01*
X117357667Y-111173601D01*
X117369403Y-111195557D01*
X117385197Y-111214803D01*
X117404443Y-111230597D01*
X117426399Y-111242333D01*
X117450224Y-111249560D01*
X117475000Y-111252000D01*
X122555000Y-111252000D01*
X122579776Y-111249560D01*
X122603601Y-111242333D01*
X122625557Y-111230597D01*
X122644803Y-111214803D01*
X122660597Y-111195557D01*
X122672333Y-111173601D01*
X122679560Y-111149776D01*
X122682000Y-111125000D01*
X122682000Y-106045000D01*
X122679560Y-106020224D01*
X122672333Y-105996399D01*
X122660597Y-105974443D01*
X122644803Y-105955197D01*
X122625557Y-105939403D01*
X122603601Y-105927667D01*
X122579776Y-105920440D01*
X122555000Y-105918000D01*
X117475000Y-105918000D01*
X117450224Y-105920440D01*
X117426399Y-105927667D01*
X117404443Y-105939403D01*
X117385197Y-105955197D01*
X117369403Y-105974443D01*
X117357667Y-105996399D01*
X117350440Y-106020224D01*
X117348000Y-106045000D01*
X103720629Y-106045000D01*
X104644577Y-105035696D01*
X106249603Y-103513480D01*
X107958007Y-102108273D01*
X109761276Y-100827075D01*
X111650428Y-99676269D01*
X113616051Y-98661589D01*
X114382879Y-98332000D01*
X127089928Y-98332000D01*
X127102188Y-98456482D01*
X127138498Y-98576180D01*
X127197463Y-98686494D01*
X127276815Y-98783185D01*
X127373506Y-98862537D01*
X127483820Y-98921502D01*
X127603518Y-98957812D01*
X127728000Y-98970072D01*
X128492250Y-98967000D01*
X128651000Y-98808250D01*
X128651000Y-97409000D01*
X128905000Y-97409000D01*
X128905000Y-98808250D01*
X129063750Y-98967000D01*
X129828000Y-98970072D01*
X129952482Y-98957812D01*
X130072180Y-98921502D01*
X130182494Y-98862537D01*
X130279185Y-98783185D01*
X130358537Y-98686494D01*
X130417502Y-98576180D01*
X130453812Y-98456482D01*
X130466072Y-98332000D01*
X130463000Y-97567750D01*
X130304250Y-97409000D01*
X128905000Y-97409000D01*
X128651000Y-97409000D01*
X127251750Y-97409000D01*
X127093000Y-97567750D01*
X127089928Y-98332000D01*
X114382879Y-98332000D01*
X115648352Y-97788090D01*
X117737207Y-97060123D01*
X119872208Y-96481314D01*
X122042719Y-96054549D01*
X124237928Y-95781951D01*
X126446897Y-95664881D01*
X127410136Y-95681884D01*
M02*
