(kicad_pcb (version 20171130) (host pcbnew 5.1.5+dfsg1-2build2)

  (general
    (thickness 1.6)
    (drawings 9)
    (tracks 169)
    (zones 0)
    (modules 23)
    (nets 6)
  )

  (page A4)
  (layers
    (0 F.Cu signal hide)
    (31 B.Cu signal hide)
    (32 B.Adhes user)
    (33 F.Adhes user)
    (34 B.Paste user)
    (35 F.Paste user)
    (36 B.SilkS user)
    (37 F.SilkS user)
    (38 B.Mask user)
    (39 F.Mask user hide)
    (40 Dwgs.User user)
    (41 Cmts.User user)
    (42 Eco1.User user)
    (43 Eco2.User user)
    (44 Edge.Cuts user)
    (45 Margin user)
    (46 B.CrtYd user)
    (47 F.CrtYd user)
    (48 B.Fab user)
    (49 F.Fab user)
  )

  (setup
    (last_trace_width 0.25)
    (user_trace_width 0.4)
    (user_trace_width 0.6)
    (user_trace_width 0.8)
    (user_trace_width 1)
    (user_trace_width 1.2)
    (trace_clearance 0.2)
    (zone_clearance 0.508)
    (zone_45_only no)
    (trace_min 0.25)
    (via_size 0.8)
    (via_drill 0.4)
    (via_min_size 0.4)
    (via_min_drill 0.3)
    (user_via 1.4 0.8)
    (user_via 1.5 0.9)
    (uvia_size 0.3)
    (uvia_drill 0.1)
    (uvias_allowed no)
    (uvia_min_size 0.2)
    (uvia_min_drill 0.1)
    (edge_width 0.05)
    (segment_width 0.2)
    (pcb_text_width 0.3)
    (pcb_text_size 1.5 1.5)
    (mod_edge_width 0.12)
    (mod_text_size 1 1)
    (mod_text_width 0.15)
    (pad_size 1.524 1.524)
    (pad_drill 0.762)
    (pad_to_mask_clearance 0.051)
    (solder_mask_min_width 0.25)
    (aux_axis_origin 0 0)
    (visible_elements FFFFFF7F)
    (pcbplotparams
      (layerselection 0x010fc_ffffffff)
      (usegerberextensions false)
      (usegerberattributes false)
      (usegerberadvancedattributes false)
      (creategerberjobfile false)
      (excludeedgelayer true)
      (linewidth 0.100000)
      (plotframeref false)
      (viasonmask false)
      (mode 1)
      (useauxorigin false)
      (hpglpennumber 1)
      (hpglpenspeed 20)
      (hpglpendiameter 15.000000)
      (psnegative false)
      (psa4output false)
      (plotreference true)
      (plotvalue true)
      (plotinvisibletext false)
      (padsonsilk false)
      (subtractmaskfromsilk false)
      (outputformat 1)
      (mirror false)
      (drillshape 1)
      (scaleselection 1)
      (outputdirectory ""))
  )

  (net 0 "")
  (net 1 "Net-(D1-Pad2)")
  (net 2 GND)
  (net 3 "Net-(D10-Pad2)")
  (net 4 "Net-(D11-Pad2)")
  (net 5 "Net-(D15-Pad2)")

  (net_class Default "This is the default net class."
    (clearance 0.2)
    (trace_width 0.25)
    (via_dia 0.8)
    (via_drill 0.4)
    (uvia_dia 0.3)
    (uvia_drill 0.1)
  )

  (net_class Power ""
    (clearance 0.3)
    (trace_width 0.3)
    (via_dia 1.4)
    (via_drill 0.8)
    (uvia_dia 0.6)
    (uvia_drill 0.1)
    (add_net GND)
    (add_net "Net-(D1-Pad2)")
    (add_net "Net-(D10-Pad2)")
    (add_net "Net-(D11-Pad2)")
    (add_net "Net-(D15-Pad2)")
  )

  (module Connector_Wire:SolderWire-0.5sqmm_1x01_D0.9mm_OD2.1mm (layer F.Cu) (tedit 5EB70B43) (tstamp 603D0623)
    (at 127 142.748)
    (descr "Soldered wire connection, for a single 0.5 mm² wire, basic insulation, conductor diameter 0.9mm, outer diameter 2.1mm, size source Multi-Contact FLEXI-E 0.5 (https://ec.staubli.com/AcroFiles/Catalogues/TM_Cab-Main-11014119_(en)_hi.pdf), bend radius 3 times outer diameter, generated with kicad-footprint-generator")
    (tags "connector wire 0.5sqmm")
    (path /60402E54)
    (attr virtual)
    (fp_text reference J5 (at 0 -2.25) (layer F.SilkS)
      (effects (font (size 1 1) (thickness 0.15)))
    )
    (fp_text value Conn_01x01 (at 0 2.25) (layer F.Fab)
      (effects (font (size 1 1) (thickness 0.15)))
    )
    (fp_text user %R (at 0 0) (layer F.Fab)
      (effects (font (size 0.52 0.52) (thickness 0.08)))
    )
    (fp_circle (center 0 0) (end 1.05 0) (layer F.Fab) (width 0.1))
    (fp_line (start -1.8 -1.55) (end -1.8 1.55) (layer F.CrtYd) (width 0.05))
    (fp_line (start -1.8 1.55) (end 1.8 1.55) (layer F.CrtYd) (width 0.05))
    (fp_line (start 1.8 1.55) (end 1.8 -1.55) (layer F.CrtYd) (width 0.05))
    (fp_line (start 1.8 -1.55) (end -1.8 -1.55) (layer F.CrtYd) (width 0.05))
    (pad 1 thru_hole roundrect (at 0 0) (size 2.1 2.1) (drill 1.1) (layers *.Cu *.Mask) (roundrect_rratio 0.119048)
      (net 5 "Net-(D15-Pad2)"))
    (model ${KISYS3DMOD}/Connector_Wire.3dshapes/SolderWire-0.5sqmm_1x01_D0.9mm_OD2.1mm.wrl
      (at (xyz 0 0 0))
      (scale (xyz 1 1 1))
      (rotate (xyz 0 0 0))
    )
  )

  (module LED_SMD:LED_1W_3W_R8 (layer F.Cu) (tedit 58AC980C) (tstamp 603C9F60)
    (at 121.158 127 255)
    (descr https://www.gme.cz/data/attachments/dsh.518-234.1.pdf)
    (tags "LED 1W 3W 5W")
    (path /603DFA52)
    (attr smd)
    (fp_text reference D18 (at -4.429108 4.079338 75) (layer F.SilkS)
      (effects (font (size 1 1) (thickness 0.15)))
    )
    (fp_text value LED (at 0 5.08 75) (layer F.Fab)
      (effects (font (size 1 1) (thickness 0.15)))
    )
    (fp_arc (start 0 0) (end -4.59 -0.45) (angle 131.3332206) (layer F.CrtYd) (width 0.05))
    (fp_arc (start 0 0) (end 4.59 0.45) (angle 131.3332206) (layer F.CrtYd) (width 0.05))
    (fp_text user %R (at 0 -2.54 75) (layer F.Fab)
      (effects (font (size 1 1) (thickness 0.15)))
    )
    (fp_line (start -2.54 0) (end -1.27 0) (layer F.Fab) (width 0.1))
    (fp_line (start -1.27 -1.27) (end -1.27 1.27) (layer F.Fab) (width 0.1))
    (fp_line (start 1.27 0) (end 2.54 0) (layer F.Fab) (width 0.1))
    (fp_line (start 1.27 1.27) (end 1.27 0) (layer F.Fab) (width 0.1))
    (fp_line (start -1.27 0) (end 1.27 1.27) (layer F.Fab) (width 0.1))
    (fp_line (start 1.27 -1.27) (end 1.27 1.27) (layer F.Fab) (width 0.1))
    (fp_line (start -1.27 0) (end 1.27 -1.27) (layer F.Fab) (width 0.1))
    (fp_line (start 8.55 0.45) (end 4.59 0.45) (layer F.CrtYd) (width 0.05))
    (fp_line (start 8.55 -3.15) (end 8.55 0.45) (layer F.CrtYd) (width 0.05))
    (fp_line (start 3.37 -3.15) (end 8.55 -3.15) (layer F.CrtYd) (width 0.05))
    (fp_line (start -8.55 3.15) (end -3.37 3.15) (layer F.CrtYd) (width 0.05))
    (fp_line (start -8.55 -0.45) (end -8.55 3.15) (layer F.CrtYd) (width 0.05))
    (fp_line (start -4.59 -0.45) (end -8.55 -0.45) (layer F.CrtYd) (width 0.05))
    (fp_line (start -8.255 2.794) (end -3.429 2.794) (layer F.SilkS) (width 0.12))
    (fp_line (start -8.255 -0.127) (end -8.255 2.794) (layer F.SilkS) (width 0.12))
    (fp_line (start -4.445 -0.127) (end -8.255 -0.127) (layer F.SilkS) (width 0.12))
    (fp_circle (center 0 0) (end -4.3 0) (layer F.SilkS) (width 0.12))
    (fp_line (start 4.318 1.016) (end 5.334 1.016) (layer F.Fab) (width 0.1))
    (fp_line (start -5.334 -1.016) (end -4.318 -1.016) (layer F.Fab) (width 0.1))
    (fp_line (start 4.826 1.524) (end 4.826 0.508) (layer F.Fab) (width 0.1))
    (fp_circle (center 0 0) (end 4.025 0) (layer F.Fab) (width 0.1))
    (pad 3 smd circle (at 0 0 255) (size 5.7 5.7) (layers F.Cu F.Paste F.Mask)
      (net 2 GND))
    (pad 1 smd rect (at -6.35 1.35 255) (size 3.5 2.7) (layers F.Cu F.Paste F.Mask)
      (net 2 GND))
    (pad 2 smd rect (at 6.35 -1.35 255) (size 3.5 2.7) (layers F.Cu F.Paste F.Mask)
      (net 5 "Net-(D15-Pad2)"))
    (model ${KISYS3DMOD}/Capacitor_SMD.3dshapes/C_Elec_6.3x5.4.step
      (at (xyz 0 0 0))
      (scale (xyz 1 1 1))
      (rotate (xyz 0 0 0))
    )
  )

  (module Connector_Wire:SolderWire-0.5sqmm_1x01_D0.9mm_OD2.1mm (layer F.Cu) (tedit 5EB70B43) (tstamp 61B4C8C4)
    (at 128.778 97.282)
    (descr "Soldered wire connection, for a single 0.5 mm² wire, basic insulation, conductor diameter 0.9mm, outer diameter 2.1mm, size source Multi-Contact FLEXI-E 0.5 (https://ec.staubli.com/AcroFiles/Catalogues/TM_Cab-Main-11014119_(en)_hi.pdf), bend radius 3 times outer diameter, generated with kicad-footprint-generator")
    (tags "connector wire 0.5sqmm")
    (path /603BF285)
    (attr virtual)
    (fp_text reference J4 (at -1.778 1.778) (layer F.SilkS)
      (effects (font (size 1 1) (thickness 0.15)))
    )
    (fp_text value Conn_01x01 (at 0 2.25) (layer F.Fab)
      (effects (font (size 1 1) (thickness 0.15)))
    )
    (fp_text user %R (at 0 0) (layer F.Fab)
      (effects (font (size 0.52 0.52) (thickness 0.08)))
    )
    (fp_circle (center 0 0) (end 1.05 0) (layer F.Fab) (width 0.1))
    (fp_line (start -1.8 -1.55) (end -1.8 1.55) (layer F.CrtYd) (width 0.05))
    (fp_line (start -1.8 1.55) (end 1.8 1.55) (layer F.CrtYd) (width 0.05))
    (fp_line (start 1.8 1.55) (end 1.8 -1.55) (layer F.CrtYd) (width 0.05))
    (fp_line (start 1.8 -1.55) (end -1.8 -1.55) (layer F.CrtYd) (width 0.05))
    (pad 1 thru_hole roundrect (at 0 0) (size 2.1 2.1) (drill 1.1) (layers *.Cu *.Mask) (roundrect_rratio 0.119048)
      (net 2 GND))
    (model ${KISYS3DMOD}/Connector_Wire.3dshapes/SolderWire-0.5sqmm_1x01_D0.9mm_OD2.1mm.wrl
      (at (xyz 0 0 0))
      (scale (xyz 1 1 1))
      (rotate (xyz 0 0 0))
    )
  )

  (module Connector_Wire:SolderWire-0.5sqmm_1x01_D0.9mm_OD2.1mm (layer F.Cu) (tedit 5EB70B43) (tstamp 603D064D)
    (at 151.13 120.65)
    (descr "Soldered wire connection, for a single 0.5 mm² wire, basic insulation, conductor diameter 0.9mm, outer diameter 2.1mm, size source Multi-Contact FLEXI-E 0.5 (https://ec.staubli.com/AcroFiles/Catalogues/TM_Cab-Main-11014119_(en)_hi.pdf), bend radius 3 times outer diameter, generated with kicad-footprint-generator")
    (tags "connector wire 0.5sqmm")
    (path /603C01E6)
    (attr virtual)
    (fp_text reference J3 (at 0 2.032) (layer F.SilkS)
      (effects (font (size 1 1) (thickness 0.15)))
    )
    (fp_text value Conn_01x01 (at 0 2.25) (layer F.Fab)
      (effects (font (size 1 1) (thickness 0.15)))
    )
    (fp_text user %R (at 0 0) (layer F.Fab)
      (effects (font (size 0.52 0.52) (thickness 0.08)))
    )
    (fp_circle (center 0 0) (end 1.05 0) (layer F.Fab) (width 0.1))
    (fp_line (start -1.8 -1.55) (end -1.8 1.55) (layer F.CrtYd) (width 0.05))
    (fp_line (start -1.8 1.55) (end 1.8 1.55) (layer F.CrtYd) (width 0.05))
    (fp_line (start 1.8 1.55) (end 1.8 -1.55) (layer F.CrtYd) (width 0.05))
    (fp_line (start 1.8 -1.55) (end -1.8 -1.55) (layer F.CrtYd) (width 0.05))
    (pad 1 thru_hole roundrect (at 0 0) (size 2.1 2.1) (drill 1.1) (layers *.Cu *.Mask) (roundrect_rratio 0.119048)
      (net 1 "Net-(D1-Pad2)"))
    (model ${KISYS3DMOD}/Connector_Wire.3dshapes/SolderWire-0.5sqmm_1x01_D0.9mm_OD2.1mm.wrl
      (at (xyz 0 0 0))
      (scale (xyz 1 1 1))
      (rotate (xyz 0 0 0))
    )
  )

  (module Connector_Wire:SolderWire-0.5sqmm_1x01_D0.9mm_OD2.1mm (layer F.Cu) (tedit 5EB70B43) (tstamp 603D070D)
    (at 106.68 140.716)
    (descr "Soldered wire connection, for a single 0.5 mm² wire, basic insulation, conductor diameter 0.9mm, outer diameter 2.1mm, size source Multi-Contact FLEXI-E 0.5 (https://ec.staubli.com/AcroFiles/Catalogues/TM_Cab-Main-11014119_(en)_hi.pdf), bend radius 3 times outer diameter, generated with kicad-footprint-generator")
    (tags "connector wire 0.5sqmm")
    (path /603C06DF)
    (attr virtual)
    (fp_text reference J2 (at 0 -2.25) (layer F.SilkS)
      (effects (font (size 1 1) (thickness 0.15)))
    )
    (fp_text value Conn_01x01 (at 0 2.25) (layer F.Fab)
      (effects (font (size 1 1) (thickness 0.15)))
    )
    (fp_text user %R (at 0 0) (layer F.Fab)
      (effects (font (size 0.52 0.52) (thickness 0.08)))
    )
    (fp_circle (center 0 0) (end 1.05 0) (layer F.Fab) (width 0.1))
    (fp_line (start -1.8 -1.55) (end -1.8 1.55) (layer F.CrtYd) (width 0.05))
    (fp_line (start -1.8 1.55) (end 1.8 1.55) (layer F.CrtYd) (width 0.05))
    (fp_line (start 1.8 1.55) (end 1.8 -1.55) (layer F.CrtYd) (width 0.05))
    (fp_line (start 1.8 -1.55) (end -1.8 -1.55) (layer F.CrtYd) (width 0.05))
    (pad 1 thru_hole roundrect (at 0 0) (size 2.1 2.1) (drill 1.1) (layers *.Cu *.Mask) (roundrect_rratio 0.119048)
      (net 3 "Net-(D10-Pad2)"))
    (model ${KISYS3DMOD}/Connector_Wire.3dshapes/SolderWire-0.5sqmm_1x01_D0.9mm_OD2.1mm.wrl
      (at (xyz 0 0 0))
      (scale (xyz 1 1 1))
      (rotate (xyz 0 0 0))
    )
  )

  (module Connector_Wire:SolderWire-0.5sqmm_1x01_D0.9mm_OD2.1mm (layer F.Cu) (tedit 5EB70B43) (tstamp 603D06BC)
    (at 120.142 108.458)
    (descr "Soldered wire connection, for a single 0.5 mm² wire, basic insulation, conductor diameter 0.9mm, outer diameter 2.1mm, size source Multi-Contact FLEXI-E 0.5 (https://ec.staubli.com/AcroFiles/Catalogues/TM_Cab-Main-11014119_(en)_hi.pdf), bend radius 3 times outer diameter, generated with kicad-footprint-generator")
    (tags "connector wire 0.5sqmm")
    (path /603C0896)
    (attr virtual)
    (fp_text reference J1 (at 1.016 -2.032) (layer F.SilkS)
      (effects (font (size 1 1) (thickness 0.15)))
    )
    (fp_text value Conn_01x01 (at 0 2.25) (layer F.Fab)
      (effects (font (size 1 1) (thickness 0.15)))
    )
    (fp_text user %R (at 0 0) (layer F.Fab)
      (effects (font (size 0.52 0.52) (thickness 0.08)))
    )
    (fp_circle (center 0 0) (end 1.05 0) (layer F.Fab) (width 0.1))
    (fp_line (start -1.8 -1.55) (end -1.8 1.55) (layer F.CrtYd) (width 0.05))
    (fp_line (start -1.8 1.55) (end 1.8 1.55) (layer F.CrtYd) (width 0.05))
    (fp_line (start 1.8 1.55) (end 1.8 -1.55) (layer F.CrtYd) (width 0.05))
    (fp_line (start 1.8 -1.55) (end -1.8 -1.55) (layer F.CrtYd) (width 0.05))
    (pad 1 thru_hole roundrect (at 0 0) (size 2.1 2.1) (drill 1.1) (layers *.Cu *.Mask) (roundrect_rratio 0.119048)
      (net 4 "Net-(D11-Pad2)"))
    (model ${KISYS3DMOD}/Connector_Wire.3dshapes/SolderWire-0.5sqmm_1x01_D0.9mm_OD2.1mm.wrl
      (at (xyz 0 0 0))
      (scale (xyz 1 1 1))
      (rotate (xyz 0 0 0))
    )
  )

  (module LED_SMD:LED_1W_3W_R8 (layer F.Cu) (tedit 58AC980C) (tstamp 5E0F6D63)
    (at 127 153.746)
    (descr https://www.gme.cz/data/attachments/dsh.518-234.1.pdf)
    (tags "LED 1W 3W 5W")
    (path /5E100AEF)
    (attr smd)
    (fp_text reference D1 (at 4.845917 2.897375) (layer F.SilkS)
      (effects (font (size 1 1) (thickness 0.15)))
    )
    (fp_text value LED (at 0 5.08) (layer F.Fab)
      (effects (font (size 1 1) (thickness 0.15)))
    )
    (fp_line (start -2.54 0) (end -1.27 0) (layer F.Fab) (width 0.1))
    (fp_line (start -1.27 -1.27) (end -1.27 1.27) (layer F.Fab) (width 0.1))
    (fp_line (start 1.27 0) (end 2.54 0) (layer F.Fab) (width 0.1))
    (fp_line (start 1.27 1.27) (end 1.27 0) (layer F.Fab) (width 0.1))
    (fp_line (start -1.27 0) (end 1.27 1.27) (layer F.Fab) (width 0.1))
    (fp_line (start 1.27 -1.27) (end 1.27 1.27) (layer F.Fab) (width 0.1))
    (fp_line (start -1.27 0) (end 1.27 -1.27) (layer F.Fab) (width 0.1))
    (fp_line (start 8.55 0.45) (end 4.59 0.45) (layer F.CrtYd) (width 0.05))
    (fp_line (start 8.55 -3.15) (end 8.55 0.45) (layer F.CrtYd) (width 0.05))
    (fp_line (start 3.37 -3.15) (end 8.55 -3.15) (layer F.CrtYd) (width 0.05))
    (fp_line (start -8.55 3.15) (end -3.37 3.15) (layer F.CrtYd) (width 0.05))
    (fp_line (start -8.55 -0.45) (end -8.55 3.15) (layer F.CrtYd) (width 0.05))
    (fp_line (start -4.59 -0.45) (end -8.55 -0.45) (layer F.CrtYd) (width 0.05))
    (fp_line (start -8.255 2.794) (end -3.429 2.794) (layer F.SilkS) (width 0.12))
    (fp_line (start -8.255 -0.127) (end -8.255 2.794) (layer F.SilkS) (width 0.12))
    (fp_line (start -4.445 -0.127) (end -8.255 -0.127) (layer F.SilkS) (width 0.12))
    (fp_circle (center 0 0) (end -4.3 0) (layer F.SilkS) (width 0.12))
    (fp_line (start 4.318 1.016) (end 5.334 1.016) (layer F.Fab) (width 0.1))
    (fp_line (start -5.334 -1.016) (end -4.318 -1.016) (layer F.Fab) (width 0.1))
    (fp_line (start 4.826 1.524) (end 4.826 0.508) (layer F.Fab) (width 0.1))
    (fp_circle (center 0 0) (end 4.025 0) (layer F.Fab) (width 0.1))
    (fp_text user %R (at 0 -2.54) (layer F.Fab)
      (effects (font (size 1 1) (thickness 0.15)))
    )
    (fp_arc (start 0 0) (end 4.59 0.45) (angle 131.3332206) (layer F.CrtYd) (width 0.05))
    (fp_arc (start 0 0) (end -4.59 -0.45) (angle 131.3332206) (layer F.CrtYd) (width 0.05))
    (pad 2 smd rect (at 6.35 -1.35) (size 3.5 2.7) (layers F.Cu F.Paste F.Mask)
      (net 1 "Net-(D1-Pad2)"))
    (pad 1 smd rect (at -6.35 1.35) (size 3.5 2.7) (layers F.Cu F.Paste F.Mask)
      (net 2 GND))
    (pad 3 smd circle (at 0 0) (size 5.7 5.7) (layers F.Cu F.Paste F.Mask)
      (net 2 GND))
    (model ${KISYS3DMOD}/Capacitor_SMD.3dshapes/C_Elec_6.3x5.4.step
      (at (xyz 0 0 0))
      (scale (xyz 1 1 1))
      (rotate (xyz 0 0 0))
    )
  )

  (module LED_SMD:LED_1W_3W_R8 (layer F.Cu) (tedit 58AC980C) (tstamp 5E0F6D82)
    (at 144 147.746 40)
    (descr https://www.gme.cz/data/attachments/dsh.518-234.1.pdf)
    (tags "LED 1W 3W 5W")
    (path /5E102443)
    (attr smd)
    (fp_text reference D2 (at 4.893886 2.49538 40) (layer F.SilkS)
      (effects (font (size 1 1) (thickness 0.15)))
    )
    (fp_text value LED (at 0 5.08 40) (layer F.Fab)
      (effects (font (size 1 1) (thickness 0.15)))
    )
    (fp_circle (center 0 0) (end 4.025 0) (layer F.Fab) (width 0.1))
    (fp_line (start 4.826 1.524) (end 4.826 0.508) (layer F.Fab) (width 0.1))
    (fp_line (start -5.334 -1.016) (end -4.318 -1.016) (layer F.Fab) (width 0.1))
    (fp_line (start 4.318 1.016) (end 5.334 1.016) (layer F.Fab) (width 0.1))
    (fp_circle (center 0 0) (end -4.3 0) (layer F.SilkS) (width 0.12))
    (fp_line (start -4.445 -0.127) (end -8.255 -0.127) (layer F.SilkS) (width 0.12))
    (fp_line (start -8.255 -0.127) (end -8.255 2.794) (layer F.SilkS) (width 0.12))
    (fp_line (start -8.255 2.794) (end -3.429 2.794) (layer F.SilkS) (width 0.12))
    (fp_line (start -4.59 -0.45) (end -8.55 -0.45) (layer F.CrtYd) (width 0.05))
    (fp_line (start -8.55 -0.45) (end -8.55 3.15) (layer F.CrtYd) (width 0.05))
    (fp_line (start -8.55 3.15) (end -3.37 3.15) (layer F.CrtYd) (width 0.05))
    (fp_line (start 3.37 -3.15) (end 8.55 -3.15) (layer F.CrtYd) (width 0.05))
    (fp_line (start 8.55 -3.15) (end 8.55 0.45) (layer F.CrtYd) (width 0.05))
    (fp_line (start 8.55 0.45) (end 4.59 0.45) (layer F.CrtYd) (width 0.05))
    (fp_line (start -1.27 0) (end 1.27 -1.27) (layer F.Fab) (width 0.1))
    (fp_line (start 1.27 -1.27) (end 1.27 1.27) (layer F.Fab) (width 0.1))
    (fp_line (start -1.27 0) (end 1.27 1.27) (layer F.Fab) (width 0.1))
    (fp_line (start 1.27 1.27) (end 1.27 0) (layer F.Fab) (width 0.1))
    (fp_line (start 1.27 0) (end 2.54 0) (layer F.Fab) (width 0.1))
    (fp_line (start -1.27 -1.27) (end -1.27 1.27) (layer F.Fab) (width 0.1))
    (fp_line (start -2.54 0) (end -1.27 0) (layer F.Fab) (width 0.1))
    (fp_arc (start 0 0) (end -4.59 -0.45) (angle 131.3332206) (layer F.CrtYd) (width 0.05))
    (fp_arc (start 0 0) (end 4.59 0.45) (angle 131.3332206) (layer F.CrtYd) (width 0.05))
    (fp_text user %R (at 0 -2.54 40) (layer F.Fab)
      (effects (font (size 1 1) (thickness 0.15)))
    )
    (pad 3 smd circle (at 0 0 40) (size 5.7 5.7) (layers F.Cu F.Paste F.Mask)
      (net 2 GND))
    (pad 1 smd rect (at -6.35 1.35 40) (size 3.5 2.7) (layers F.Cu F.Paste F.Mask)
      (net 2 GND))
    (pad 2 smd rect (at 6.35 -1.35 40) (size 3.5 2.7) (layers F.Cu F.Paste F.Mask)
      (net 1 "Net-(D1-Pad2)"))
    (model ${KISYS3DMOD}/Capacitor_SMD.3dshapes/C_Elec_6.3x5.4.step
      (at (xyz 0 0 0))
      (scale (xyz 1 1 1))
      (rotate (xyz 0 0 0))
    )
  )

  (module LED_SMD:LED_1W_3W_R8 (layer F.Cu) (tedit 58AC980C) (tstamp 5E0F83E8)
    (at 153.238 131.746 80)
    (descr https://www.gme.cz/data/attachments/dsh.518-234.1.pdf)
    (tags "LED 1W 3W 5W")
    (path /5E102983)
    (attr smd)
    (fp_text reference D3 (at 5.278193 2.602997 80) (layer F.SilkS)
      (effects (font (size 1 1) (thickness 0.15)))
    )
    (fp_text value LED (at 0 5.08 80) (layer F.Fab)
      (effects (font (size 1 1) (thickness 0.15)))
    )
    (fp_line (start -2.54 0) (end -1.27 0) (layer F.Fab) (width 0.1))
    (fp_line (start -1.27 -1.27) (end -1.27 1.27) (layer F.Fab) (width 0.1))
    (fp_line (start 1.27 0) (end 2.54 0) (layer F.Fab) (width 0.1))
    (fp_line (start 1.27 1.27) (end 1.27 0) (layer F.Fab) (width 0.1))
    (fp_line (start -1.27 0) (end 1.27 1.27) (layer F.Fab) (width 0.1))
    (fp_line (start 1.27 -1.27) (end 1.27 1.27) (layer F.Fab) (width 0.1))
    (fp_line (start -1.27 0) (end 1.27 -1.27) (layer F.Fab) (width 0.1))
    (fp_line (start 8.55 0.45) (end 4.59 0.45) (layer F.CrtYd) (width 0.05))
    (fp_line (start 8.55 -3.15) (end 8.55 0.45) (layer F.CrtYd) (width 0.05))
    (fp_line (start 3.37 -3.15) (end 8.55 -3.15) (layer F.CrtYd) (width 0.05))
    (fp_line (start -8.55 3.15) (end -3.37 3.15) (layer F.CrtYd) (width 0.05))
    (fp_line (start -8.55 -0.45) (end -8.55 3.15) (layer F.CrtYd) (width 0.05))
    (fp_line (start -4.59 -0.45) (end -8.55 -0.45) (layer F.CrtYd) (width 0.05))
    (fp_line (start -8.255 2.794) (end -3.429 2.794) (layer F.SilkS) (width 0.12))
    (fp_line (start -8.255 -0.127) (end -8.255 2.794) (layer F.SilkS) (width 0.12))
    (fp_line (start -4.445 -0.127) (end -8.255 -0.127) (layer F.SilkS) (width 0.12))
    (fp_circle (center 0 0) (end -4.3 0) (layer F.SilkS) (width 0.12))
    (fp_line (start 4.318 1.016) (end 5.334 1.016) (layer F.Fab) (width 0.1))
    (fp_line (start -5.334 -1.016) (end -4.318 -1.016) (layer F.Fab) (width 0.1))
    (fp_line (start 4.826 1.524) (end 4.826 0.508) (layer F.Fab) (width 0.1))
    (fp_circle (center 0 0) (end 4.025 0) (layer F.Fab) (width 0.1))
    (fp_text user %R (at 0 -2.54 80) (layer F.Fab)
      (effects (font (size 1 1) (thickness 0.15)))
    )
    (fp_arc (start 0 0) (end 4.59 0.45) (angle 131.3332206) (layer F.CrtYd) (width 0.05))
    (fp_arc (start 0 0) (end -4.59 -0.45) (angle 131.3332206) (layer F.CrtYd) (width 0.05))
    (pad 2 smd rect (at 6.35 -1.35 80) (size 3.5 2.7) (layers F.Cu F.Paste F.Mask)
      (net 1 "Net-(D1-Pad2)"))
    (pad 1 smd rect (at -6.35 1.35 80) (size 3.5 2.7) (layers F.Cu F.Paste F.Mask)
      (net 2 GND))
    (pad 3 smd circle (at 0 0 80) (size 5.7 5.7) (layers F.Cu F.Paste F.Mask)
      (net 2 GND))
    (model ${KISYS3DMOD}/Capacitor_SMD.3dshapes/C_Elec_6.3x5.4.step
      (at (xyz 0 0 0))
      (scale (xyz 1 1 1))
      (rotate (xyz 0 0 0))
    )
  )

  (module LED_SMD:LED_1W_3W_R8 (layer F.Cu) (tedit 58AC980C) (tstamp 603D2873)
    (at 149.746 112.746 122)
    (descr https://www.gme.cz/data/attachments/dsh.518-234.1.pdf)
    (tags "LED 1W 3W 5W")
    (path /5E102B6D)
    (attr smd)
    (fp_text reference D4 (at 4.529115 3.000412 307) (layer F.SilkS)
      (effects (font (size 1 1) (thickness 0.15)))
    )
    (fp_text value LED (at 0 5.08 122) (layer F.Fab)
      (effects (font (size 1 1) (thickness 0.15)))
    )
    (fp_circle (center 0 0) (end 4.025 0) (layer F.Fab) (width 0.1))
    (fp_line (start 4.826 1.524) (end 4.826 0.508) (layer F.Fab) (width 0.1))
    (fp_line (start -5.334 -1.016) (end -4.318 -1.016) (layer F.Fab) (width 0.1))
    (fp_line (start 4.318 1.016) (end 5.334 1.016) (layer F.Fab) (width 0.1))
    (fp_circle (center 0 0) (end -4.3 0) (layer F.SilkS) (width 0.12))
    (fp_line (start -4.445 -0.127) (end -8.255 -0.127) (layer F.SilkS) (width 0.12))
    (fp_line (start -8.255 -0.127) (end -8.255 2.794) (layer F.SilkS) (width 0.12))
    (fp_line (start -8.255 2.794) (end -3.429 2.794) (layer F.SilkS) (width 0.12))
    (fp_line (start -4.59 -0.45) (end -8.55 -0.45) (layer F.CrtYd) (width 0.05))
    (fp_line (start -8.55 -0.45) (end -8.55 3.15) (layer F.CrtYd) (width 0.05))
    (fp_line (start -8.55 3.15) (end -3.37 3.15) (layer F.CrtYd) (width 0.05))
    (fp_line (start 3.37 -3.15) (end 8.55 -3.15) (layer F.CrtYd) (width 0.05))
    (fp_line (start 8.55 -3.15) (end 8.55 0.45) (layer F.CrtYd) (width 0.05))
    (fp_line (start 8.55 0.45) (end 4.59 0.45) (layer F.CrtYd) (width 0.05))
    (fp_line (start -1.27 0) (end 1.27 -1.27) (layer F.Fab) (width 0.1))
    (fp_line (start 1.27 -1.27) (end 1.27 1.27) (layer F.Fab) (width 0.1))
    (fp_line (start -1.27 0) (end 1.27 1.27) (layer F.Fab) (width 0.1))
    (fp_line (start 1.27 1.27) (end 1.27 0) (layer F.Fab) (width 0.1))
    (fp_line (start 1.27 0) (end 2.54 0) (layer F.Fab) (width 0.1))
    (fp_line (start -1.27 -1.27) (end -1.27 1.27) (layer F.Fab) (width 0.1))
    (fp_line (start -2.54 0) (end -1.27 0) (layer F.Fab) (width 0.1))
    (fp_arc (start 0 0) (end -4.59 -0.45) (angle 131.3332206) (layer F.CrtYd) (width 0.05))
    (fp_arc (start 0 0) (end 4.59 0.45) (angle 131.3332206) (layer F.CrtYd) (width 0.05))
    (fp_text user %R (at 0 -2.54 122) (layer F.Fab)
      (effects (font (size 1 1) (thickness 0.15)))
    )
    (pad 3 smd circle (at 0 0 122) (size 5.7 5.7) (layers F.Cu F.Paste F.Mask)
      (net 2 GND))
    (pad 1 smd rect (at -6.35 1.35 122) (size 3.5 2.7) (layers F.Cu F.Paste F.Mask)
      (net 2 GND))
    (pad 2 smd rect (at 6.35 -1.35 122) (size 3.5 2.7) (layers F.Cu F.Paste F.Mask)
      (net 1 "Net-(D1-Pad2)"))
    (model ${KISYS3DMOD}/Capacitor_SMD.3dshapes/C_Elec_6.3x5.4.step
      (at (xyz 0 0 0))
      (scale (xyz 1 1 1))
      (rotate (xyz 0 0 0))
    )
  )

  (module LED_SMD:LED_1W_3W_R8 (layer F.Cu) (tedit 58AC980C) (tstamp 5E0F82D7)
    (at 136.508 102 162)
    (descr https://www.gme.cz/data/attachments/dsh.518-234.1.pdf)
    (tags "LED 1W 3W 5W")
    (path /5E102E94)
    (attr smd)
    (fp_text reference D5 (at 3.747942 3.748695 162) (layer F.SilkS)
      (effects (font (size 1 1) (thickness 0.15)))
    )
    (fp_text value LED (at 0 5.08 162) (layer F.Fab)
      (effects (font (size 1 1) (thickness 0.15)))
    )
    (fp_line (start -2.54 0) (end -1.27 0) (layer F.Fab) (width 0.1))
    (fp_line (start -1.27 -1.27) (end -1.27 1.27) (layer F.Fab) (width 0.1))
    (fp_line (start 1.27 0) (end 2.54 0) (layer F.Fab) (width 0.1))
    (fp_line (start 1.27 1.27) (end 1.27 0) (layer F.Fab) (width 0.1))
    (fp_line (start -1.27 0) (end 1.27 1.27) (layer F.Fab) (width 0.1))
    (fp_line (start 1.27 -1.27) (end 1.27 1.27) (layer F.Fab) (width 0.1))
    (fp_line (start -1.27 0) (end 1.27 -1.27) (layer F.Fab) (width 0.1))
    (fp_line (start 8.55 0.45) (end 4.59 0.45) (layer F.CrtYd) (width 0.05))
    (fp_line (start 8.55 -3.15) (end 8.55 0.45) (layer F.CrtYd) (width 0.05))
    (fp_line (start 3.37 -3.15) (end 8.55 -3.15) (layer F.CrtYd) (width 0.05))
    (fp_line (start -8.55 3.15) (end -3.37 3.15) (layer F.CrtYd) (width 0.05))
    (fp_line (start -8.55 -0.45) (end -8.55 3.15) (layer F.CrtYd) (width 0.05))
    (fp_line (start -4.59 -0.45) (end -8.55 -0.45) (layer F.CrtYd) (width 0.05))
    (fp_line (start -8.255 2.794) (end -3.429 2.794) (layer F.SilkS) (width 0.12))
    (fp_line (start -8.255 -0.127) (end -8.255 2.794) (layer F.SilkS) (width 0.12))
    (fp_line (start -4.445 -0.127) (end -8.255 -0.127) (layer F.SilkS) (width 0.12))
    (fp_circle (center 0 0) (end -4.3 0) (layer F.SilkS) (width 0.12))
    (fp_line (start 4.318 1.016) (end 5.334 1.016) (layer F.Fab) (width 0.1))
    (fp_line (start -5.334 -1.016) (end -4.318 -1.016) (layer F.Fab) (width 0.1))
    (fp_line (start 4.826 1.524) (end 4.826 0.508) (layer F.Fab) (width 0.1))
    (fp_circle (center 0 0) (end 4.025 0) (layer F.Fab) (width 0.1))
    (fp_text user %R (at 0 -2.54 162) (layer F.Fab)
      (effects (font (size 1 1) (thickness 0.15)))
    )
    (fp_arc (start 0 0) (end 4.59 0.45) (angle 131.3332206) (layer F.CrtYd) (width 0.05))
    (fp_arc (start 0 0) (end -4.59 -0.45) (angle 131.3332206) (layer F.CrtYd) (width 0.05))
    (pad 2 smd rect (at 6.35 -1.35 162) (size 3.5 2.7) (layers F.Cu F.Paste F.Mask)
      (net 1 "Net-(D1-Pad2)"))
    (pad 1 smd rect (at -6.35 1.35 162) (size 3.5 2.7) (layers F.Cu F.Paste F.Mask)
      (net 2 GND))
    (pad 3 smd circle (at 0 0 162) (size 5.7 5.7) (layers F.Cu F.Paste F.Mask)
      (net 2 GND))
    (model ${KISYS3DMOD}/Capacitor_SMD.3dshapes/C_Elec_6.3x5.4.step
      (at (xyz 0 0 0))
      (scale (xyz 1 1 1))
      (rotate (xyz 0 0 0))
    )
  )

  (module LED_SMD:LED_1W_3W_R8 (layer F.Cu) (tedit 58AC980C) (tstamp 5E0F8331)
    (at 118 101.746 200)
    (descr https://www.gme.cz/data/attachments/dsh.518-234.1.pdf)
    (tags "LED 1W 3W 5W")
    (path /5E103226)
    (attr smd)
    (fp_text reference D6 (at 4.74979 3.076602 200) (layer F.SilkS)
      (effects (font (size 1 1) (thickness 0.15)))
    )
    (fp_text value LED (at 0 5.08 20) (layer F.Fab)
      (effects (font (size 1 1) (thickness 0.15)))
    )
    (fp_circle (center 0 0) (end 4.025 0) (layer F.Fab) (width 0.1))
    (fp_line (start 4.826 1.524) (end 4.826 0.508) (layer F.Fab) (width 0.1))
    (fp_line (start -5.334 -1.016) (end -4.318 -1.016) (layer F.Fab) (width 0.1))
    (fp_line (start 4.318 1.016) (end 5.334 1.016) (layer F.Fab) (width 0.1))
    (fp_circle (center 0 0) (end -4.3 0) (layer F.SilkS) (width 0.12))
    (fp_line (start -4.445 -0.127) (end -8.255 -0.127) (layer F.SilkS) (width 0.12))
    (fp_line (start -8.255 -0.127) (end -8.255 2.794) (layer F.SilkS) (width 0.12))
    (fp_line (start -8.255 2.794) (end -3.429 2.794) (layer F.SilkS) (width 0.12))
    (fp_line (start -4.59 -0.45) (end -8.55 -0.45) (layer F.CrtYd) (width 0.05))
    (fp_line (start -8.55 -0.45) (end -8.55 3.15) (layer F.CrtYd) (width 0.05))
    (fp_line (start -8.55 3.15) (end -3.37 3.15) (layer F.CrtYd) (width 0.05))
    (fp_line (start 3.37 -3.15) (end 8.55 -3.15) (layer F.CrtYd) (width 0.05))
    (fp_line (start 8.55 -3.15) (end 8.55 0.45) (layer F.CrtYd) (width 0.05))
    (fp_line (start 8.55 0.45) (end 4.59 0.45) (layer F.CrtYd) (width 0.05))
    (fp_line (start -1.27 0) (end 1.27 -1.27) (layer F.Fab) (width 0.1))
    (fp_line (start 1.27 -1.27) (end 1.27 1.27) (layer F.Fab) (width 0.1))
    (fp_line (start -1.27 0) (end 1.27 1.27) (layer F.Fab) (width 0.1))
    (fp_line (start 1.27 1.27) (end 1.27 0) (layer F.Fab) (width 0.1))
    (fp_line (start 1.27 0) (end 2.54 0) (layer F.Fab) (width 0.1))
    (fp_line (start -1.27 -1.27) (end -1.27 1.27) (layer F.Fab) (width 0.1))
    (fp_line (start -2.54 0) (end -1.27 0) (layer F.Fab) (width 0.1))
    (fp_arc (start 0 0) (end -4.59 -0.45) (angle 131.3332206) (layer F.CrtYd) (width 0.05))
    (fp_arc (start 0 0) (end 4.59 0.45) (angle 131.3332206) (layer F.CrtYd) (width 0.05))
    (fp_text user %R (at 0 -2.54 20) (layer F.Fab)
      (effects (font (size 1 1) (thickness 0.15)))
    )
    (pad 3 smd circle (at 0 0 200) (size 5.7 5.7) (layers F.Cu F.Paste F.Mask)
      (net 2 GND))
    (pad 1 smd rect (at -6.35 1.35 200) (size 3.5 2.7) (layers F.Cu F.Paste F.Mask)
      (net 2 GND))
    (pad 2 smd rect (at 6.35 -1.35 200) (size 3.5 2.7) (layers F.Cu F.Paste F.Mask)
      (net 3 "Net-(D10-Pad2)"))
    (model ${KISYS3DMOD}/Capacitor_SMD.3dshapes/C_Elec_6.3x5.4.step
      (at (xyz 0 0 0))
      (scale (xyz 1 1 1))
      (rotate (xyz 0 0 0))
    )
  )

  (module LED_SMD:LED_1W_3W_R8 (layer F.Cu) (tedit 58AC980C) (tstamp 5E0F8442)
    (at 104.394 113.03 240)
    (descr https://www.gme.cz/data/attachments/dsh.518-234.1.pdf)
    (tags "LED 1W 3W 5W")
    (path /5E10376D)
    (attr smd)
    (fp_text reference D7 (at 4.598156 2.316239 60) (layer F.SilkS)
      (effects (font (size 1 1) (thickness 0.15)))
    )
    (fp_text value LED (at 0 5.08 60) (layer F.Fab)
      (effects (font (size 1 1) (thickness 0.15)))
    )
    (fp_line (start -2.54 0) (end -1.27 0) (layer F.Fab) (width 0.1))
    (fp_line (start -1.27 -1.27) (end -1.27 1.27) (layer F.Fab) (width 0.1))
    (fp_line (start 1.27 0) (end 2.54 0) (layer F.Fab) (width 0.1))
    (fp_line (start 1.27 1.27) (end 1.27 0) (layer F.Fab) (width 0.1))
    (fp_line (start -1.27 0) (end 1.27 1.27) (layer F.Fab) (width 0.1))
    (fp_line (start 1.27 -1.27) (end 1.27 1.27) (layer F.Fab) (width 0.1))
    (fp_line (start -1.27 0) (end 1.27 -1.27) (layer F.Fab) (width 0.1))
    (fp_line (start 8.55 0.45) (end 4.59 0.45) (layer F.CrtYd) (width 0.05))
    (fp_line (start 8.55 -3.15) (end 8.55 0.45) (layer F.CrtYd) (width 0.05))
    (fp_line (start 3.37 -3.15) (end 8.55 -3.15) (layer F.CrtYd) (width 0.05))
    (fp_line (start -8.55 3.15) (end -3.37 3.15) (layer F.CrtYd) (width 0.05))
    (fp_line (start -8.55 -0.45) (end -8.55 3.15) (layer F.CrtYd) (width 0.05))
    (fp_line (start -4.59 -0.45) (end -8.55 -0.45) (layer F.CrtYd) (width 0.05))
    (fp_line (start -8.255 2.794) (end -3.429 2.794) (layer F.SilkS) (width 0.12))
    (fp_line (start -8.255 -0.127) (end -8.255 2.794) (layer F.SilkS) (width 0.12))
    (fp_line (start -4.445 -0.127) (end -8.255 -0.127) (layer F.SilkS) (width 0.12))
    (fp_circle (center 0 0) (end -4.3 0) (layer F.SilkS) (width 0.12))
    (fp_line (start 4.318 1.016) (end 5.334 1.016) (layer F.Fab) (width 0.1))
    (fp_line (start -5.334 -1.016) (end -4.318 -1.016) (layer F.Fab) (width 0.1))
    (fp_line (start 4.826 1.524) (end 4.826 0.508) (layer F.Fab) (width 0.1))
    (fp_circle (center 0 0) (end 4.025 0) (layer F.Fab) (width 0.1))
    (fp_text user %R (at 0 -2.54 60) (layer F.Fab)
      (effects (font (size 1 1) (thickness 0.15)))
    )
    (fp_arc (start 0 0) (end 4.59 0.45) (angle 131.3332206) (layer F.CrtYd) (width 0.05))
    (fp_arc (start 0 0) (end -4.59 -0.45) (angle 131.3332206) (layer F.CrtYd) (width 0.05))
    (pad 2 smd rect (at 6.35 -1.35 240) (size 3.5 2.7) (layers F.Cu F.Paste F.Mask)
      (net 3 "Net-(D10-Pad2)"))
    (pad 1 smd rect (at -6.35 1.35 240) (size 3.5 2.7) (layers F.Cu F.Paste F.Mask)
      (net 2 GND))
    (pad 3 smd circle (at 0 0 240) (size 5.7 5.7) (layers F.Cu F.Paste F.Mask)
      (net 2 GND))
    (model ${KISYS3DMOD}/Capacitor_SMD.3dshapes/C_Elec_6.3x5.4.step
      (at (xyz 0 0 0))
      (scale (xyz 1 1 1))
      (rotate (xyz 0 0 0))
    )
  )

  (module LED_SMD:LED_1W_3W_R8 (layer F.Cu) (tedit 58AC980C) (tstamp 61B4BF04)
    (at 100.584 130.984 280)
    (descr https://www.gme.cz/data/attachments/dsh.518-234.1.pdf)
    (tags "LED 1W 3W 5W")
    (path /5E103AC2)
    (attr smd)
    (fp_text reference D8 (at 5.16852 1.865851 100) (layer F.SilkS)
      (effects (font (size 1 1) (thickness 0.15)))
    )
    (fp_text value LED (at 0 5.08 100) (layer F.Fab)
      (effects (font (size 1 1) (thickness 0.15)))
    )
    (fp_circle (center 0 0) (end 4.025 0) (layer F.Fab) (width 0.1))
    (fp_line (start 4.826 1.524) (end 4.826 0.508) (layer F.Fab) (width 0.1))
    (fp_line (start -5.334 -1.016) (end -4.318 -1.016) (layer F.Fab) (width 0.1))
    (fp_line (start 4.318 1.016) (end 5.334 1.016) (layer F.Fab) (width 0.1))
    (fp_circle (center 0 0) (end -4.3 0) (layer F.SilkS) (width 0.12))
    (fp_line (start -4.445 -0.127) (end -8.255 -0.127) (layer F.SilkS) (width 0.12))
    (fp_line (start -8.255 -0.127) (end -8.255 2.794) (layer F.SilkS) (width 0.12))
    (fp_line (start -8.255 2.794) (end -3.429 2.794) (layer F.SilkS) (width 0.12))
    (fp_line (start -4.59 -0.45) (end -8.55 -0.45) (layer F.CrtYd) (width 0.05))
    (fp_line (start -8.55 -0.45) (end -8.55 3.15) (layer F.CrtYd) (width 0.05))
    (fp_line (start -8.55 3.15) (end -3.37 3.15) (layer F.CrtYd) (width 0.05))
    (fp_line (start 3.37 -3.15) (end 8.55 -3.15) (layer F.CrtYd) (width 0.05))
    (fp_line (start 8.55 -3.15) (end 8.55 0.45) (layer F.CrtYd) (width 0.05))
    (fp_line (start 8.55 0.45) (end 4.59 0.45) (layer F.CrtYd) (width 0.05))
    (fp_line (start -1.27 0) (end 1.27 -1.27) (layer F.Fab) (width 0.1))
    (fp_line (start 1.27 -1.27) (end 1.27 1.27) (layer F.Fab) (width 0.1))
    (fp_line (start -1.27 0) (end 1.27 1.27) (layer F.Fab) (width 0.1))
    (fp_line (start 1.27 1.27) (end 1.27 0) (layer F.Fab) (width 0.1))
    (fp_line (start 1.27 0) (end 2.54 0) (layer F.Fab) (width 0.1))
    (fp_line (start -1.27 -1.27) (end -1.27 1.27) (layer F.Fab) (width 0.1))
    (fp_line (start -2.54 0) (end -1.27 0) (layer F.Fab) (width 0.1))
    (fp_arc (start 0 0) (end -4.59 -0.45) (angle 131.3332206) (layer F.CrtYd) (width 0.05))
    (fp_arc (start 0 0) (end 4.59 0.45) (angle 131.3332206) (layer F.CrtYd) (width 0.05))
    (fp_text user %R (at 0 -2.54 100) (layer F.Fab)
      (effects (font (size 1 1) (thickness 0.15)))
    )
    (pad 3 smd circle (at 0 0 280) (size 5.7 5.7) (layers F.Cu F.Paste F.Mask)
      (net 2 GND))
    (pad 1 smd rect (at -6.35 1.35 280) (size 3.5 2.7) (layers F.Cu F.Paste F.Mask)
      (net 2 GND))
    (pad 2 smd rect (at 6.35 -1.35 280) (size 3.5 2.7) (layers F.Cu F.Paste F.Mask)
      (net 3 "Net-(D10-Pad2)"))
    (model ${KISYS3DMOD}/Capacitor_SMD.3dshapes/C_Elec_6.3x5.4.step
      (at (xyz 0 0 0))
      (scale (xyz 1 1 1))
      (rotate (xyz 0 0 0))
    )
  )

  (module LED_SMD:LED_1W_3W_R8 (layer F.Cu) (tedit 58AC980C) (tstamp 5E0F838B)
    (at 110 147.746 320)
    (descr https://www.gme.cz/data/attachments/dsh.518-234.1.pdf)
    (tags "LED 1W 3W 5W")
    (path /5E103DA2)
    (attr smd)
    (fp_text reference D9 (at 4.475353 3.323001 140) (layer F.SilkS)
      (effects (font (size 1 1) (thickness 0.15)))
    )
    (fp_text value LED (at 0 5.08 140) (layer F.Fab)
      (effects (font (size 1 1) (thickness 0.15)))
    )
    (fp_line (start -2.54 0) (end -1.27 0) (layer F.Fab) (width 0.1))
    (fp_line (start -1.27 -1.27) (end -1.27 1.27) (layer F.Fab) (width 0.1))
    (fp_line (start 1.27 0) (end 2.54 0) (layer F.Fab) (width 0.1))
    (fp_line (start 1.27 1.27) (end 1.27 0) (layer F.Fab) (width 0.1))
    (fp_line (start -1.27 0) (end 1.27 1.27) (layer F.Fab) (width 0.1))
    (fp_line (start 1.27 -1.27) (end 1.27 1.27) (layer F.Fab) (width 0.1))
    (fp_line (start -1.27 0) (end 1.27 -1.27) (layer F.Fab) (width 0.1))
    (fp_line (start 8.55 0.45) (end 4.59 0.45) (layer F.CrtYd) (width 0.05))
    (fp_line (start 8.55 -3.15) (end 8.55 0.45) (layer F.CrtYd) (width 0.05))
    (fp_line (start 3.37 -3.15) (end 8.55 -3.15) (layer F.CrtYd) (width 0.05))
    (fp_line (start -8.55 3.15) (end -3.37 3.15) (layer F.CrtYd) (width 0.05))
    (fp_line (start -8.55 -0.45) (end -8.55 3.15) (layer F.CrtYd) (width 0.05))
    (fp_line (start -4.59 -0.45) (end -8.55 -0.45) (layer F.CrtYd) (width 0.05))
    (fp_line (start -8.255 2.794) (end -3.429 2.794) (layer F.SilkS) (width 0.12))
    (fp_line (start -8.255 -0.127) (end -8.255 2.794) (layer F.SilkS) (width 0.12))
    (fp_line (start -4.445 -0.127) (end -8.255 -0.127) (layer F.SilkS) (width 0.12))
    (fp_circle (center 0 0) (end -4.3 0) (layer F.SilkS) (width 0.12))
    (fp_line (start 4.318 1.016) (end 5.334 1.016) (layer F.Fab) (width 0.1))
    (fp_line (start -5.334 -1.016) (end -4.318 -1.016) (layer F.Fab) (width 0.1))
    (fp_line (start 4.826 1.524) (end 4.826 0.508) (layer F.Fab) (width 0.1))
    (fp_circle (center 0 0) (end 4.025 0) (layer F.Fab) (width 0.1))
    (fp_text user %R (at 0 -2.54 140) (layer F.Fab)
      (effects (font (size 1 1) (thickness 0.15)))
    )
    (fp_arc (start 0 0) (end 4.59 0.45) (angle 131.3332206) (layer F.CrtYd) (width 0.05))
    (fp_arc (start 0 0) (end -4.59 -0.45) (angle 131.3332206) (layer F.CrtYd) (width 0.05))
    (pad 2 smd rect (at 6.35 -1.35 320) (size 3.5 2.7) (layers F.Cu F.Paste F.Mask)
      (net 3 "Net-(D10-Pad2)"))
    (pad 1 smd rect (at -6.35 1.35 320) (size 3.5 2.7) (layers F.Cu F.Paste F.Mask)
      (net 2 GND))
    (pad 3 smd circle (at 0 0 320) (size 5.7 5.7) (layers F.Cu F.Paste F.Mask)
      (net 2 GND))
    (model ${KISYS3DMOD}/Capacitor_SMD.3dshapes/C_Elec_6.3x5.4.step
      (at (xyz 0 0 0))
      (scale (xyz 1 1 1))
      (rotate (xyz 0 0 0))
    )
  )

  (module LED_SMD:LED_1W_3W_R8 (layer F.Cu) (tedit 58AC980C) (tstamp 603C676D)
    (at 134.356022 142.424314 25)
    (descr https://www.gme.cz/data/attachments/dsh.518-234.1.pdf)
    (tags "LED 1W 3W 5W")
    (path /5E103FE7)
    (autoplace_cost90 10)
    (autoplace_cost180 10)
    (attr smd)
    (fp_text reference D10 (at 1.888535 -4.927889 25) (layer F.SilkS)
      (effects (font (size 1 1) (thickness 0.15)))
    )
    (fp_text value LED (at 0 5.08 25) (layer F.Fab)
      (effects (font (size 1 1) (thickness 0.15)))
    )
    (fp_circle (center 0 0) (end 4.025 0) (layer F.Fab) (width 0.1))
    (fp_line (start 4.826 1.524) (end 4.826 0.508) (layer F.Fab) (width 0.1))
    (fp_line (start -5.334 -1.016) (end -4.318 -1.016) (layer F.Fab) (width 0.1))
    (fp_line (start 4.318 1.016) (end 5.334 1.016) (layer F.Fab) (width 0.1))
