EESchema Schematic File Version 4
EELAYER 30 0
EELAYER END
$Descr A4 11693 8268
encoding utf-8
Sheet 1 1
Title ""
Date ""
Rev ""
Comp ""
Comment1 ""
Comment2 ""
Comment3 ""
Comment4 ""
$EndDescr
$Comp
L Device:LED D1
U 1 1 5E100AEF
P 3600 4050
F 0 "D1" V 3639 3933 50  0000 R CNN
F 1 "LED" V 3548 3933 50  0000 R CNN
F 2 "LED_SMD:LED_1W_3W_R8" H 3600 4050 50  0001 C CNN
F 3 "~" H 3600 4050 50  0001 C CNN
	1    3600 4050
	0    -1   -1   0   
$EndComp
$Comp
L Device:LED D2
U 1 1 5E102443
P 3950 4050
F 0 "D2" V 3989 3933 50  0000 R CNN
F 1 "LED" V 3898 3933 50  0000 R CNN
F 2 "LED_SMD:LED_1W_3W_R8" H 3950 4050 50  0001 C CNN
F 3 "~" H 3950 4050 50  0001 C CNN
	1    3950 4050
	0    -1   -1   0   
$EndComp
$Comp
L Device:LED D3
U 1 1 5E102983
P 4300 4050
F 0 "D3" V 4339 3933 50  0000 R CNN
F 1 "LED" V 4248 3933 50  0000 R CNN
F 2 "LED_SMD:LED_1W_3W_R8" H 4300 4050 50  0001 C CNN
F 3 "~" H 4300 4050 50  0001 C CNN
	1    4300 4050
	0    -1   -1   0   
$EndComp
$Comp
L Device:LED D4
U 1 1 5E102B6D
P 4650 4050
F 0 "D4" V 4689 3933 50  0000 R CNN
F 1 "LED" V 4598 3933 50  0000 R CNN
F 2 "LED_SMD:LED_1W_3W_R8" H 4650 4050 50  0001 C CNN
F 3 "~" H 4650 4050 50  0001 C CNN
	1    4650 4050
	0    -1   -1   0   
$EndComp
$Comp
L Device:LED D5
U 1 1 5E102E94
P 5000 4050
F 0 "D5" V 5039 3933 50  0000 R CNN
F 1 "LED" V 4948 3933 50  0000 R CNN
F 2 "LED_SMD:LED_1W_3W_R8" H 5000 4050 50  0001 C CNN
F 3 "~" H 5000 4050 50  0001 C CNN
	1    5000 4050
	0    -1   -1   0   
$EndComp
$Comp
L Device:LED D6
U 1 1 5E103226
P 5300 4050
F 0 "D6" V 5339 3933 50  0000 R CNN
F 1 "LED" V 5248 3933 50  0000 R CNN
F 2 "LED_SMD:LED_1W_3W_R8" H 5300 4050 50  0001 C CNN
F 3 "~" H 5300 4050 50  0001 C CNN
	1    5300 4050
	0    -1   -1   0   
$EndComp
$Comp
L Device:LED D7
U 1 1 5E10376D
P 5600 4050
F 0 "D7" V 5639 3933 50  0000 R CNN
F 1 "LED" V 5548 3933 50  0000 R CNN
F 2 "LED_SMD:LED_1W_3W_R8" H 5600 4050 50  0001 C CNN
F 3 "~" H 5600 4050 50  0001 C CNN
	1    5600 4050
	0    -1   -1   0   
$EndComp
$Comp
L Device:LED D8
U 1 1 5E103AC2
P 5900 4050
F 0 "D8" V 5939 3933 50  0000 R CNN
F 1 "LED" V 5848 3933 50  0000 R CNN
F 2 "LED_SMD:LED_1W_3W_R8" H 5900 4050 50  0001 C CNN
F 3 "~" H 5900 4050 50  0001 C CNN
	1    5900 4050
	0    -1   -1   0   
$EndComp
$Comp
L Device:LED D9
U 1 1 5E103DA2
P 6200 4050
F 0 "D9" V 6239 3933 50  0000 R CNN
F 1 "LED" V 6148 3933 50  0000 R CNN
F 2 "LED_SMD:LED_1W_3W_R8" H 6200 4050 50  0001 C CNN
F 3 "~" H 6200 4050 50  0001 C CNN
	1    6200 4050
	0    -1   -1   0   
$EndComp
$Comp
L Device:LED D10
U 1 1 5E103FE7
P 6500 4050
F 0 "D10" V 6539 3933 50  0000 R CNN
F 1 "LED" V 6448 3933 50  0000 R CNN
F 2 "LED_SMD:LED_1W_3W_R8" H 6500 4050 50  0001 C CNN
F 3 "~" H 6500 4050 50  0001 C CNN
	1    6500 4050
	0    -1   -1   0   
$EndComp
$Comp
L Device:LED D13
U 1 1 5E0FA029
P 7400 4050
F 0 "D13" V 7439 3933 50  0000 R CNN
F 1 "LED" V 7348 3933 50  0000 R CNN
F 2 "LED_SMD:LED_1W_3W_R8" H 7400 4050 50  0001 C CNN
F 3 "~" H 7400 4050 50  0001 C CNN
	1    7400 4050
	0    -1   -1   0   
$EndComp
$Comp
L Device:LED D14
U 1 1 5E0FA3DA
P 7700 4050
F 0 "D14" V 7739 3933 50  0000 R CNN
F 1 "LED" V 7648 3933 50  0000 R CNN
F 2 "LED_SMD:LED_1W_3W_R8" H 7700 4050 50  0001 C CNN
F 3 "~" H 7700 4050 50  0001 C CNN
	1    7700 4050
	0    -1   -1   0   
$EndComp
$Comp
L Device:LED D15
U 1 1 5E0FA6E7
P 8000 4050
F 0 "D15" V 8039 3933 50  0000 R CNN
F 1 "LED" V 7948 3933 50  0000 R CNN
F 2 "LED_SMD:LED_1W_3W_R8" H 8000 4050 50  0001 C CNN
F 3 "~" H 8000 4050 50  0001 C CNN
	1    8000 4050
	0    -1   -1   0   
$EndComp
$Comp
L Device:LED D16
U 1 1 5E0FAB2C
P 8300 4050
F 0 "D16" V 8339 3933 50  0000 R CNN
F 1 "LED" V 8248 3933 50  0000 R CNN
F 2 "LED_SMD:LED_1W_3W_R8" H 8300 4050 50  0001 C CNN
F 3 "~" H 8300 4050 50  0001 C CNN
	1    8300 4050
	0    -1   -1   0   
$EndComp
$Comp
L Device:LED D17
U 1 1 5E0FB265
P 8600 4050
F 0 "D17" V 8639 3933 50  0000 R CNN
F 1 "LED" V 8548 3933 50  0000 R CNN
F 2 "LED_SMD:LED_1W_3W_R8" H 8600 4050 50  0001 C CNN
F 3 "~" H 8600 4050 50  0001 C CNN
	1    8600 4050
	0    -1   -1   0   
$EndComp
$Comp
L Connector_Generic:Conn_01x01 J4
U 1 1 603BF285
P 2550 4250
F 0 "J4" H 2468 4025 50  0000 C CNN
F 1 "Conn_01x01" H 2468 4116 50  0000 C CNN
F 2 "Connector_Wire:SolderWire-0.5sqmm_1x01_D0.9mm_OD2.1mm" H 2550 4250 50  0001 C CNN
F 3 "~" H 2550 4250 50  0001 C CNN
	1    2550 4250
	-1   0    0    1   
$EndComp
$Comp
L Connector_Generic:Conn_01x01 J3
U 1 1 603C01E6
P 2550 3700
F 0 "J3" H 2468 3475 50  0000 C CNN
F 1 "Conn_01x01" H 2468 3566 50  0000 C CNN
F 2 "Connector_Wire:SolderWire-0.5sqmm_1x01_D0.9mm_OD2.1mm" H 2550 3700 50  0001 C CNN
F 3 "~" H 2550 3700 50  0001 C CNN
	1    2550 3700
	-1   0    0    1   
$EndComp
$Comp
L Connector_Generic:Conn_01x01 J2
U 1 1 603C06DF
P 2550 3400
F 0 "J2" H 2468 3175 50  0000 C CNN
F 1 "Conn_01x01" H 2468 3266 50  0000 C CNN
F 2 "Connector_Wire:SolderWire-0.5sqmm_1x01_D0.9mm_OD2.1mm" H 2550 3400 50  0001 C CNN
F 3 "~" H 2550 3400 50  0001 C CNN
	1    2550 3400
	-1   0    0    1   
$EndComp
$Comp
L Connector_Generic:Conn_01x01 J1
U 1 1 603C0896
P 2550 3100
F 0 "J1" H 2468 2875 50  0000 C CNN
F 1 "Conn_01x01" H 2468 2966 50  0000 C CNN
F 2 "Connector_Wire:SolderWire-0.5sqmm_1x01_D0.9mm_OD2.1mm" H 2550 3100 50  0001 C CNN
F 3 "~" H 2550 3100 50  0001 C CNN
	1    2550 3100
	-1   0    0    1   
$EndComp
$Comp
L power:GND #PWR0101
U 1 1 603C0C45
P 2800 4300
F 0 "#PWR0101" H 2800 4050 50  0001 C CNN
F 1 "GND" H 2805 4127 50  0000 C CNN
F 2 "" H 2800 4300 50  0001 C CNN
F 3 "" H 2800 4300 50  0001 C CNN
	1    2800 4300
	1    0    0    -1  
$EndComp
Wire Wire Line
	2750 4250 2800 4250
Wire Wire Line
	2800 4250 2800 4300
Wire Wire Line
	2800 4250 3600 4250
Wire Wire Line
	8600 4250 8600 4200
Connection ~ 2800 4250
Wire Wire Line
	8300 4200 8300 4250
Connection ~ 8300 4250
Wire Wire Line
	8300 4250 8600 4250
Wire Wire Line
	8000 4200 8000 4250
Connection ~ 8000 4250
Wire Wire Line
	8000 4250 8300 4250
Wire Wire Line
	7700 4200 7700 4250
Connection ~ 7700 4250
Wire Wire Line
	7700 4250 8000 4250
Wire Wire Line
	7400 4200 7400 4250
Connection ~ 7400 4250
Wire Wire Line
	7400 4250 7700 4250
Wire Wire Line
	7100 4200 7100 4250
Connection ~ 7100 4250
Wire Wire Line
	7100 4250 7400 4250
Wire Wire Line
	6800 4200 6800 4250
Connection ~ 6800 4250
Wire Wire Line
	6800 4250 7100 4250
Wire Wire Line
	6500 4200 6500 4250
Connection ~ 6500 4250
Wire Wire Line
	6500 4250 6800 4250
Wire Wire Line
	6200 4200 6200 4250
Connection ~ 6200 4250
Wire Wire Line
	6200 4250 6500 4250
Wire Wire Line
	5900 4200 5900 4250
Connection ~ 5900 4250
Wire Wire Line
	5900 4250 6200 4250
Wire Wire Line
	5600 4200 5600 4250
Connection ~ 5600 4250
Wire Wire Line
	5600 4250 5900 4250
Wire Wire Line
	5300 4200 5300 4250
Connection ~ 5300 4250
Wire Wire Line
	5300 4250 5600 4250
Wire Wire Line
	5000 4200 5000 4250
Connection ~ 5000 4250
Wire Wire Line
	5000 4250 5300 4250
Wire Wire Line
	4650 4200 4650 4250
Connection ~ 4650 4250
Wire Wire Line
	4650 4250 5000 4250
Wire Wire Line
	4300 4200 4300 4250
Connection ~ 4300 4250
Wire Wire Line
	4300 4250 4650 4250
Wire Wire Line
	3950 4200 3950 4250
Connection ~ 3950 4250
Wire Wire Line
	3950 4250 4300 4250
Wire Wire Line
	3600 4200 3600 4250
Connection ~ 3600 4250
Wire Wire Line
	3600 4250 3950 4250
Wire Wire Line
	2750 3700 3600 3700
Wire Wire Line
	3600 3700 3600 3900
Wire Wire Line
	3600 3700 3950 3700
Wire Wire Line
	3950 3700 3950 3900
Connection ~ 3600 3700
Wire Wire Line
	3950 3700 4300 3700
Wire Wire Line
	4300 3700 4300 3900
Connection ~ 3950 3700
Wire Wire Line
	4300 3700 4650 3700
Wire Wire Line
	4650 3700 4650 3900
Connection ~ 4300 3700
Wire Wire Line
	4650 3700 5000 3700
Wire Wire Line
	5000 3700 5000 3900
Connection ~ 4650 3700
$Comp
L Device:LED D18
U 1 1 603DFA52
P 8900 4050
F 0 "D18" V 8939 3933 50  0000 R CNN
F 1 "LED" V 8848 3933 50  0000 R CNN
F 2 "LED_SMD:LED_1W_3W_R8" H 8900 4050 50  0001 C CNN
F 3 "~" H 8900 4050 50  0001 C CNN
	1    8900 4050
	0    -1   -1   0   
$EndComp
Wire Wire Line
	8900 4200 8900 4250
Wire Wire Line
	8900 4250 8600 4250
Connection ~ 8600 4250
Wire Wire Line
	2750 3400 5300 3400
Wire Wire Line
	5600 3400 5600 3900
Wire Wire Line
	5600 3400 5900 3400
Wire Wire Line
	5900 3400 5900 3900
Connection ~ 5600 3400
Wire Wire Line
	5900 3400 6200 3400
Wire Wire Line
	6200 3400 6200 3900
Connection ~ 5900 3400
Wire Wire Line
	6200 3400 6500 3400
Wire Wire Line
	6500 3400 6500 3900
Connection ~ 6200 3400
Wire Wire Line
	2750 3100 6800 3100
Wire Wire Line
	7400 3100 7700 3100
Wire Wire Line
	7700 3100 7700 3900
Connection ~ 7400 3100
$Comp
L Connector_Generic:Conn_01x01 J5
U 1 1 60402E54
P 2550 2800
F 0 "J5" H 2468 2575 50  0000 C CNN
F 1 "Conn_01x01" H 2468 2666 50  0000 C CNN
F 2 "Connector_Wire:SolderWire-0.5sqmm_1x01_D0.9mm_OD2.1mm" H 2550 2800 50  0001 C CNN
F 3 "~" H 2550 2800 50  0001 C CNN
	1    2550 2800
	-1   0    0    1   
$EndComp
Wire Wire Line
	5300 3900 5300 3400
Connection ~ 5300 3400
Wire Wire Line
	5300 3400 5600 3400
Wire Wire Line
	7400 3100 7400 3900
$Comp
L Device:LED D12
U 1 1 5E104698
P 7100 4050
F 0 "D12" V 7139 3933 50  0000 R CNN
F 1 "LED" V 7048 3933 50  0000 R CNN
F 2 "LED_SMD:LED_1W_3W_R8" H 7100 4050 50  0001 C CNN
F 3 "~" H 7100 4050 50  0001 C CNN
	1    7100 4050
	0    -1   -1   0   
$EndComp
$Comp
L Device:LED D11
U 1 1 5E10438A
P 6800 4050
F 0 "D11" V 6839 3933 50  0000 R CNN
F 1 "LED" V 6748 3933 50  0000 R CNN
F 2 "LED_SMD:LED_1W_3W_R8" H 6800 4050 50  0001 C CNN
F 3 "~" H 6800 4050 50  0001 C CNN
	1    6800 4050
	0    -1   -1   0   
$EndComp
Wire Wire Line
	6800 3900 6800 3100
Connection ~ 6800 3100
Wire Wire Line
	6800 3100 7100 3100
Wire Wire Line
	7100 3900 7100 3100
Connection ~ 7100 3100
Wire Wire Line
	7100 3100 7400 3100
Wire Wire Line
	2750 2800 8000 2800
Wire Wire Line
	8000 2800 8000 3900
Wire Wire Line
	8000 2800 8300 2800
Wire Wire Line
	8300 2800 8300 3900
Connection ~ 8000 2800
Wire Wire Line
	8300 2800 8600 2800
Wire Wire Line
	8600 2800 8600 3900
Connection ~ 8300 2800
Wire Wire Line
	8600 2800 8900 2800
Wire Wire Line
	8900 2800 8900 3900
Connection ~ 8600 2800
Text Notes 2850 3700 0    50   ~ 0
5*0.25 A = 1.25A
Text Notes 2850 3400 0    50   ~ 0
5*0.25 A = 1.25A
Text Notes 2850 3100 0    50   ~ 0
4*0.25 A = 1 A
Text Notes 2850 2800 0    50   ~ 0
4*0.25 A = 1 A
Text Notes 900  2850 0    50   ~ 0
<+5V >-----< 2R2 @ 5W >-----
Text Notes 900  3150 0    50   ~ 0
<+5V >-----< 2R2 @ 5W >-----
Text Notes 900  3450 0    50   ~ 0
<+5V >-----< 1R6 @ 5W >-----
Text Notes 900  3750 0    50   ~ 0
<+5V >-----< 1R6 @ 5W >-----
Text Notes 850  2700 0    50   ~ 0
External power resisotrs. It turns\nout that DC/DC efficiency is under\n70% while using resistors make it\n60% effective. Resistors will not turn\noff due to overheating, but DC/DC\nwill.
$EndSCHEMATC
