G04 #@! TF.GenerationSoftware,KiCad,Pcbnew,5.1.5+dfsg1-2build2*
G04 #@! TF.CreationDate,2022-01-20T19:04:38+01:00*
G04 #@! TF.ProjectId,LED-02,4c45442d-3032-42e6-9b69-6361645f7063,rev?*
G04 #@! TF.SameCoordinates,Original*
G04 #@! TF.FileFunction,Legend,Top*
G04 #@! TF.FilePolarity,Positive*
%FSLAX46Y46*%
G04 Gerber Fmt 4.6, Leading zero omitted, Abs format (unit mm)*
G04 Created by KiCad (PCBNEW 5.1.5+dfsg1-2build2) date 2022-01-20 19:04:38*
%MOMM*%
%LPD*%
G04 APERTURE LIST*
%ADD10C,0.120000*%
%ADD11C,0.150000*%
G04 APERTURE END LIST*
D10*
X120595754Y-118303142D02*
X119346694Y-122964700D01*
X123417224Y-119059152D02*
X120595754Y-118303142D01*
X122431123Y-122739330D02*
X123417224Y-119059152D01*
X125458000Y-127000000D02*
G75*
G03X125458000Y-127000000I-4300000J0D01*
G01*
X118745000Y-156540000D02*
X123571000Y-156540000D01*
X118745000Y-153619000D02*
X118745000Y-156540000D01*
X122555000Y-153619000D02*
X118745000Y-153619000D01*
X131300000Y-153746000D02*
G75*
G03X131300000Y-153746000I-4300000J0D01*
G01*
X148300000Y-147746000D02*
G75*
G03X148300000Y-147746000I-4300000J0D01*
G01*
X140513298Y-150505903D02*
X137594669Y-152954924D01*
X137594669Y-152954924D02*
X139472252Y-155192540D01*
X139472252Y-155192540D02*
X143169182Y-152090447D01*
X154556087Y-140360761D02*
X155394113Y-135608079D01*
X151679464Y-139853535D02*
X154556087Y-140360761D01*
X152341063Y-136101417D02*
X151679464Y-139853535D01*
X157538000Y-131746000D02*
G75*
G03X157538000Y-131746000I-4300000J0D01*
G01*
X154046000Y-112746000D02*
G75*
G03X154046000Y-112746000I-4300000J0D01*
G01*
X151993789Y-116582874D02*
X154012781Y-119813937D01*
X154012781Y-119813937D02*
X156489930Y-118266043D01*
X156489930Y-118266043D02*
X153932540Y-114173362D01*
X145222365Y-101893683D02*
X140632566Y-100402367D01*
X144319726Y-104671719D02*
X145222365Y-101893683D01*
X140696201Y-103494365D02*
X144319726Y-104671719D01*
X140808000Y-102000000D02*
G75*
G03X140808000Y-102000000I-4300000J0D01*
G01*
X122300000Y-101746000D02*
G75*
G03X122300000Y-101746000I-4300000J0D01*
G01*
X122220370Y-100345061D02*
X125800599Y-99041965D01*
X125800599Y-99041965D02*
X124801558Y-96297123D01*
X124801558Y-96297123D02*
X120266602Y-97947712D01*
X106101825Y-104483960D02*
X103688825Y-108663399D01*
X108631485Y-105944460D02*
X106101825Y-104483960D01*
X106726485Y-109244017D02*
X108631485Y-105944460D01*
X108694000Y-113030000D02*
G75*
G03X108694000Y-113030000I-4300000J0D01*
G01*
X104884000Y-130984000D02*
G75*
G03X104884000Y-130984000I-4300000J0D01*
G01*
X99937204Y-126584476D02*
X99275605Y-122832359D01*
X99275605Y-122832359D02*
X96398981Y-123339585D01*
X96398981Y-123339585D02*
X97237008Y-128092267D01*
X101880355Y-144580116D02*
X105577285Y-147682209D01*
X103757937Y-142342501D02*
X101880355Y-144580116D01*
X106676566Y-144791521D02*
X103757937Y-142342501D01*
X114300000Y-147746000D02*
G75*
G03X114300000Y-147746000I-4300000J0D01*
G01*
X138656022Y-142424314D02*
G75*
G03X138656022Y-142424314I-4300000J0D01*
G01*
X130273811Y-144187751D02*
X126820779Y-145797927D01*
X126820779Y-145797927D02*
X128055247Y-148445252D01*
X128055247Y-148445252D02*
X132429088Y-146405696D01*
X148499916Y-119881222D02*
X144802986Y-116779129D01*
X146622334Y-122118837D02*
X148499916Y-119881222D01*
X143703705Y-119669817D02*
X146622334Y-122118837D01*
X144680271Y-116715338D02*
G75*
G03X144680271Y-116715338I-4300000J0D01*
G01*
X114373806Y-130576360D02*
G75*
G03X114373806Y-130576360I-4300000J0D01*
G01*
X110587730Y-126159343D02*
X110919793Y-122363842D01*
X110919793Y-122363842D02*
X108009909Y-122109260D01*
X108009909Y-122109260D02*
X107589295Y-126916895D01*
X114685958Y-107668024D02*
X113035369Y-112202981D01*
X117430800Y-108667065D02*
X114685958Y-107668024D01*
X116127703Y-112247294D02*
X117430800Y-108667065D01*
X118788083Y-116380791D02*
G75*
G03X118788083Y-116380791I-4300000J0D01*
G01*
X131476393Y-110464136D02*
G75*
G03X131476393Y-110464136I-4300000J0D01*
G01*
X131615547Y-110203245D02*
X135411049Y-109871182D01*
X135411049Y-109871182D02*
X135156467Y-106961297D01*
X135156467Y-106961297D02*
X130348831Y-107381911D01*
X145666212Y-139959530D02*
X146086826Y-135151895D01*
X142756328Y-139704948D02*
X145666212Y-139959530D01*
X143088391Y-135909447D02*
X142756328Y-139704948D01*
X147902315Y-131492430D02*
G75*
G03X147902315Y-131492430I-4300000J0D01*
G01*
X124338311Y-141972503D02*
G75*
G03X124338311Y-141972503I-4300000J0D01*
G01*
X117925796Y-138059520D02*
X116020796Y-134759963D01*
X116020796Y-134759963D02*
X113491136Y-136220463D01*
X113491136Y-136220463D02*
X115904136Y-140399902D01*
X127393123Y-119944442D02*
X129043712Y-124479398D01*
X130137965Y-118945401D02*
X127393123Y-119944442D01*
X131441061Y-122525630D02*
X130137965Y-118945401D01*
X137142000Y-126746000D02*
G75*
G03X137142000Y-126746000I-4300000J0D01*
G01*
D11*
X126666666Y-139950380D02*
X126666666Y-140664666D01*
X126619047Y-140807523D01*
X126523809Y-140902761D01*
X126380952Y-140950380D01*
X126285714Y-140950380D01*
X127619047Y-139950380D02*
X127142857Y-139950380D01*
X127095238Y-140426571D01*
X127142857Y-140378952D01*
X127238095Y-140331333D01*
X127476190Y-140331333D01*
X127571428Y-140378952D01*
X127619047Y-140426571D01*
X127666666Y-140521809D01*
X127666666Y-140759904D01*
X127619047Y-140855142D01*
X127571428Y-140902761D01*
X127476190Y-140950380D01*
X127238095Y-140950380D01*
X127142857Y-140902761D01*
X127095238Y-140855142D01*
X118486686Y-122955994D02*
X117520760Y-122697175D01*
X117582383Y-122467193D01*
X117665354Y-122341528D01*
X117781996Y-122274185D01*
X117886314Y-122252838D01*
X118082625Y-122256140D01*
X118220614Y-122293114D01*
X118392275Y-122388410D01*
X118471943Y-122459055D01*
X118539287Y-122575698D01*
X118548309Y-122726012D01*
X118486686Y-122955994D01*
X118881077Y-121484107D02*
X118733180Y-122036065D01*
X118807128Y-121760086D02*
X117841202Y-121501267D01*
X117954542Y-121630234D01*
X118021886Y-121746876D01*
X118043233Y-121851194D01*
X118477016Y-120784253D02*
X118406370Y-120863921D01*
X118348048Y-120897593D01*
X118243731Y-120918940D01*
X118197734Y-120906615D01*
X118118066Y-120835969D01*
X118084394Y-120777648D01*
X118063047Y-120673331D01*
X118112346Y-120489345D01*
X118182992Y-120409677D01*
X118241313Y-120376005D01*
X118345631Y-120354658D01*
X118391627Y-120366982D01*
X118471296Y-120437628D01*
X118504967Y-120495950D01*
X118526314Y-120600267D01*
X118477016Y-120784253D01*
X118498363Y-120888571D01*
X118532034Y-120946892D01*
X118611703Y-121017538D01*
X118795688Y-121066837D01*
X118900006Y-121045490D01*
X118958327Y-121011818D01*
X119028973Y-120932150D01*
X119078272Y-120748164D01*
X119056925Y-120643846D01*
X119023253Y-120585525D01*
X118943585Y-120514879D01*
X118759599Y-120465580D01*
X118655282Y-120486927D01*
X118596960Y-120520599D01*
X118526314Y-120600267D01*
X126666666Y-98512380D02*
X126666666Y-99226666D01*
X126619047Y-99369523D01*
X126523809Y-99464761D01*
X126380952Y-99512380D01*
X126285714Y-99512380D01*
X127571428Y-98845714D02*
X127571428Y-99512380D01*
X127333333Y-98464761D02*
X127095238Y-99179047D01*
X127714285Y-99179047D01*
X150796666Y-122134380D02*
X150796666Y-122848666D01*
X150749047Y-122991523D01*
X150653809Y-123086761D01*
X150510952Y-123134380D01*
X150415714Y-123134380D01*
X151177619Y-122134380D02*
X151796666Y-122134380D01*
X151463333Y-122515333D01*
X151606190Y-122515333D01*
X151701428Y-122562952D01*
X151749047Y-122610571D01*
X151796666Y-122705809D01*
X151796666Y-122943904D01*
X151749047Y-123039142D01*
X151701428Y-123086761D01*
X151606190Y-123134380D01*
X151320476Y-123134380D01*
X151225238Y-123086761D01*
X151177619Y-123039142D01*
X106346666Y-137918380D02*
X106346666Y-138632666D01*
X106299047Y-138775523D01*
X106203809Y-138870761D01*
X106060952Y-138918380D01*
X105965714Y-138918380D01*
X106775238Y-138013619D02*
X106822857Y-137966000D01*
X106918095Y-137918380D01*
X107156190Y-137918380D01*
X107251428Y-137966000D01*
X107299047Y-138013619D01*
X107346666Y-138108857D01*
X107346666Y-138204095D01*
X107299047Y-138346952D01*
X106727619Y-138918380D01*
X107346666Y-138918380D01*
X120824666Y-105878380D02*
X120824666Y-106592666D01*
X120777047Y-106735523D01*
X120681809Y-106830761D01*
X120538952Y-106878380D01*
X120443714Y-106878380D01*
X121824666Y-106878380D02*
X121253238Y-106878380D01*
X121538952Y-106878380D02*
X121538952Y-105878380D01*
X121443714Y-106021238D01*
X121348476Y-106116476D01*
X121253238Y-106164095D01*
X131107821Y-157095755D02*
X131107821Y-156095755D01*
X131345917Y-156095755D01*
X131488774Y-156143375D01*
X131584012Y-156238613D01*
X131631631Y-156333851D01*
X131679250Y-156524327D01*
X131679250Y-156667184D01*
X131631631Y-156857660D01*
X131584012Y-156952898D01*
X131488774Y-157048136D01*
X131345917Y-157095755D01*
X131107821Y-157095755D01*
X132631631Y-157095755D02*
X132060202Y-157095755D01*
X132345917Y-157095755D02*
X132345917Y-156095755D01*
X132250678Y-156238613D01*
X132155440Y-156333851D01*
X132060202Y-156381470D01*
X149078305Y-147332825D02*
X148435517Y-146566780D01*
X148617909Y-146413736D01*
X148757952Y-146358387D01*
X148892127Y-146370126D01*
X148989823Y-146412474D01*
X149148737Y-146527778D01*
X149240564Y-146637213D01*
X149326521Y-146813735D01*
X149351261Y-146917301D01*
X149339522Y-147051475D01*
X149260696Y-147179780D01*
X149078305Y-147332825D01*
X149226301Y-146027558D02*
X149232170Y-145960471D01*
X149274518Y-145862775D01*
X149456910Y-145709730D01*
X149560475Y-145684991D01*
X149627562Y-145690860D01*
X149725259Y-145733208D01*
X149786476Y-145806164D01*
X149841825Y-145946208D01*
X149771392Y-146751255D01*
X150245610Y-146353339D01*
X157035339Y-127805437D02*
X156050531Y-127631788D01*
X156091876Y-127397310D01*
X156163578Y-127264892D01*
X156273908Y-127187639D01*
X156375968Y-127157281D01*
X156571819Y-127143462D01*
X156712506Y-127168269D01*
X156891819Y-127248240D01*
X156977342Y-127311674D01*
X157054595Y-127422003D01*
X157076684Y-127570959D01*
X157035339Y-127805437D01*
X156207641Y-126740772D02*
X156315138Y-126131129D01*
X156632420Y-126525550D01*
X156657227Y-126384863D01*
X156720660Y-126299341D01*
X156775825Y-126260714D01*
X156877885Y-126230356D01*
X157112363Y-126271701D01*
X157197885Y-126335135D01*
X157236512Y-126390299D01*
X157266870Y-126492360D01*
X157217256Y-126773733D01*
X157153822Y-126859255D01*
X157098658Y-126897882D01*
X149084943Y-106997897D02*
X149883579Y-106396082D01*
X150026868Y-106586233D01*
X150074811Y-106728982D01*
X150056067Y-106862358D01*
X150008664Y-106957704D01*
X149885201Y-107110366D01*
X149771110Y-107196340D01*
X149590331Y-107272941D01*
X149485613Y-107292226D01*
X149352236Y-107273481D01*
X149228232Y-107188048D01*
X149084943Y-106997897D01*
X150477103Y-107737595D02*
X149944679Y-108138805D01*
X150638055Y-107318181D02*
X149924312Y-107557897D01*
X150296864Y-108052291D01*
X133260142Y-97478756D02*
X133569159Y-96527700D01*
X133795601Y-96601275D01*
X133916751Y-96690709D01*
X133977898Y-96810716D01*
X133993756Y-96916008D01*
X133980184Y-97111877D01*
X133936039Y-97247742D01*
X133831890Y-97414180D01*
X133757171Y-97490042D01*
X133637164Y-97551189D01*
X133486584Y-97552332D01*
X133260142Y-97478756D01*
X134973099Y-96983868D02*
X134520215Y-96836717D01*
X134327776Y-97274886D01*
X134387779Y-97244313D01*
X134493071Y-97228454D01*
X134719513Y-97302030D01*
X134795375Y-97376748D01*
X134825948Y-97436752D01*
X134841807Y-97542044D01*
X134768231Y-97768486D01*
X134693513Y-97844348D01*
X134633509Y-97874921D01*
X134528217Y-97890779D01*
X134301775Y-97817204D01*
X134225913Y-97742485D01*
X134195340Y-97682481D01*
X111945538Y-101157006D02*
X111603518Y-100217313D01*
X111827254Y-100135880D01*
X111977783Y-100131767D01*
X112099851Y-100188688D01*
X112177171Y-100261896D01*
X112287065Y-100424599D01*
X112335925Y-100558840D01*
X112356325Y-100754116D01*
X112344151Y-100859897D01*
X112287230Y-100981965D01*
X112169275Y-101075573D01*
X111945538Y-101157006D01*
X112945936Y-99728713D02*
X112766947Y-99793860D01*
X112693739Y-99871180D01*
X112665279Y-99932214D01*
X112624644Y-100099030D01*
X112645044Y-100294305D01*
X112775337Y-100652283D01*
X112852658Y-100725491D01*
X112913691Y-100753952D01*
X113019473Y-100766126D01*
X113198462Y-100700979D01*
X113271670Y-100623659D01*
X113300130Y-100562625D01*
X113312304Y-100456843D01*
X113230871Y-100233107D01*
X113153550Y-100159899D01*
X113092516Y-100131439D01*
X112986735Y-100119265D01*
X112807746Y-100184411D01*
X112734538Y-100261732D01*
X112706077Y-100322766D01*
X112693904Y-100428547D01*
X100111725Y-116719399D02*
X99245700Y-116219399D01*
X99364747Y-116013203D01*
X99477415Y-115913294D01*
X99607513Y-115878435D01*
X99713801Y-115884814D01*
X99902568Y-115938813D01*
X100026286Y-116010242D01*
X100167434Y-116146719D01*
X100226103Y-116235578D01*
X100260962Y-116365675D01*
X100230773Y-116513203D01*
X100111725Y-116719399D01*
X99698081Y-115435852D02*
X100031414Y-114858502D01*
X100683154Y-115729656D01*
X99070322Y-135749673D02*
X100055130Y-135576025D01*
X100096475Y-135810503D01*
X100074386Y-135959458D01*
X99997133Y-136069787D01*
X99911611Y-136133221D01*
X99732297Y-136213192D01*
X99591610Y-136237999D01*
X99395759Y-136224180D01*
X99293699Y-136193822D01*
X99183370Y-136116569D01*
X99111667Y-135984151D01*
X99070322Y-135749673D01*
X99831525Y-136775940D02*
X99861882Y-136673880D01*
X99900509Y-136618715D01*
X99986031Y-136555281D01*
X100032927Y-136547013D01*
X100134987Y-136577370D01*
X100190152Y-136615997D01*
X100253585Y-136701519D01*
X100286661Y-136889102D01*
X100256303Y-136991162D01*
X100217677Y-137046326D01*
X100132154Y-137109760D01*
X100085259Y-137118029D01*
X99983199Y-137087671D01*
X99928034Y-137049044D01*
X99864601Y-136963522D01*
X99831525Y-136775940D01*
X99768091Y-136690418D01*
X99712927Y-136651791D01*
X99610866Y-136621433D01*
X99423284Y-136654509D01*
X99337762Y-136717943D01*
X99299135Y-136773107D01*
X99268777Y-136875167D01*
X99301853Y-137062750D01*
X99365287Y-137148272D01*
X99420451Y-137186899D01*
X99522512Y-137217256D01*
X99710094Y-137184180D01*
X99795616Y-137120747D01*
X99834243Y-137065582D01*
X99864601Y-136963522D01*
X110436136Y-153040373D02*
X111078923Y-152274328D01*
X111261315Y-152427373D01*
X111340141Y-152555678D01*
X111351880Y-152689853D01*
X111327140Y-152793418D01*
X111241183Y-152969940D01*
X111149356Y-153079375D01*
X110990442Y-153194680D01*
X110892746Y-153237027D01*
X110758571Y-153248766D01*
X110618527Y-153193418D01*
X110436136Y-153040373D01*
X111238659Y-153713769D02*
X111384572Y-153836205D01*
X111488137Y-153860945D01*
X111555225Y-153855075D01*
X111720008Y-153806858D01*
X111878922Y-153691554D01*
X112123794Y-153399728D01*
X112148533Y-153296162D01*
X112142664Y-153229075D01*
X112100316Y-153131379D01*
X111954403Y-153008943D01*
X111850837Y-152984203D01*
X111783750Y-152990073D01*
X111686054Y-153032420D01*
X111533009Y-153214812D01*
X111508270Y-153318377D01*
X111514139Y-153385465D01*
X111556487Y-153483161D01*
X111702400Y-153605597D01*
X111805965Y-153630336D01*
X111873053Y-153624467D01*
X111970749Y-153582119D01*
X133075667Y-138083175D02*
X132653049Y-137176867D01*
X132868837Y-137076244D01*
X133018434Y-137059027D01*
X133144998Y-137105093D01*
X133228405Y-137171284D01*
X133352061Y-137323789D01*
X133412435Y-137453261D01*
X133449777Y-137646016D01*
X133446868Y-137752456D01*
X133400803Y-137879020D01*
X133291455Y-137982552D01*
X133075667Y-138083175D01*
X134456708Y-137439185D02*
X133938818Y-137680682D01*
X134197763Y-137559934D02*
X133775144Y-136653626D01*
X133749203Y-136823348D01*
X133703138Y-136949912D01*
X133636947Y-137033319D01*
X134595137Y-136271257D02*
X134681452Y-136231007D01*
X134787892Y-136233916D01*
X134851174Y-136256948D01*
X134934581Y-136323139D01*
X135058237Y-136475644D01*
X135158861Y-136691432D01*
X135196202Y-136884187D01*
X135193294Y-136990626D01*
X135170261Y-137053908D01*
X135104070Y-137137315D01*
X135017755Y-137177565D01*
X134911316Y-137174656D01*
X134848034Y-137151624D01*
X134764627Y-137085433D01*
X134640970Y-136932928D01*
X134540347Y-136717140D01*
X134503006Y-136524386D01*
X134505914Y-136417946D01*
X134528947Y-136354664D01*
X134595137Y-136271257D01*
X140511018Y-110564015D02*
X141153805Y-109797970D01*
X141336197Y-109951015D01*
X141415023Y-110079320D01*
X141426762Y-110213494D01*
X141402022Y-110317060D01*
X141316065Y-110493582D01*
X141224238Y-110603017D01*
X141065324Y-110718321D01*
X140967628Y-110760669D01*
X140833453Y-110772408D01*
X140693409Y-110717059D01*
X140511018Y-110564015D01*
X141678324Y-111543500D02*
X141240584Y-111176193D01*
X141459454Y-111359847D02*
X142102241Y-110593802D01*
X141937458Y-110642019D01*
X141803283Y-110653758D01*
X141699718Y-110629019D01*
X142407890Y-112155679D02*
X141970150Y-111788372D01*
X142189020Y-111972026D02*
X142831808Y-111205981D01*
X142667024Y-111254198D01*
X142532850Y-111265937D01*
X142429284Y-111241197D01*
X106389827Y-127096846D02*
X105393632Y-127009690D01*
X105414384Y-126772501D01*
X105474272Y-126634338D01*
X105577449Y-126547763D01*
X105676475Y-126508625D01*
X105870376Y-126477789D01*
X106012690Y-126490240D01*
X106198291Y-126554278D01*
X106289016Y-126610017D01*
X106375591Y-126713193D01*
X106410578Y-126859657D01*
X106389827Y-127096846D01*
X106522636Y-125578835D02*
X106472833Y-126148089D01*
X106497734Y-125863462D02*
X105501539Y-125776306D01*
X105635552Y-125883633D01*
X105722128Y-125986809D01*
X105761265Y-126085835D01*
X105654519Y-125120477D02*
X105611231Y-125068889D01*
X105572094Y-124969863D01*
X105592845Y-124732674D01*
X105648584Y-124641948D01*
X105700172Y-124598661D01*
X105799198Y-124559524D01*
X105894074Y-124567824D01*
X106032237Y-124627713D01*
X106551688Y-125246770D01*
X106605641Y-124630078D01*
X111769788Y-112420778D02*
X110830096Y-112078758D01*
X110911529Y-111855022D01*
X111005136Y-111737067D01*
X111127204Y-111680145D01*
X111232985Y-111667972D01*
X111428261Y-111688371D01*
X111562503Y-111737231D01*
X111725205Y-111847125D01*
X111798413Y-111924446D01*
X111855334Y-112046513D01*
X111851222Y-112197042D01*
X111769788Y-112420778D01*
X112290962Y-110988866D02*
X112095522Y-111525833D01*
X112193242Y-111257349D02*
X111253549Y-110915329D01*
X111355218Y-111053684D01*
X111412139Y-111175752D01*
X111424313Y-111281533D01*
X111465276Y-110333615D02*
X111677003Y-109751900D01*
X111920974Y-110195424D01*
X111969834Y-110061183D01*
X112047155Y-109987975D01*
X112108189Y-109959514D01*
X112213970Y-109947340D01*
X112437706Y-110028774D01*
X112510914Y-110106094D01*
X112539375Y-110167128D01*
X112551549Y-110272909D01*
X112453829Y-110541393D01*
X112376508Y-110614601D01*
X112315474Y-110643061D01*
X125829762Y-105966491D02*
X125742606Y-104970296D01*
X125979796Y-104949545D01*
X126126259Y-104984532D01*
X126229436Y-105071107D01*
X126285174Y-105161832D01*
X126349213Y-105347434D01*
X126361664Y-105489747D01*
X126330827Y-105683649D01*
X126291690Y-105782675D01*
X126205115Y-105885851D01*
X126066951Y-105945740D01*
X125829762Y-105966491D01*
X127347773Y-105833682D02*
X126778519Y-105883486D01*
X127063146Y-105858584D02*
X126975990Y-104862389D01*
X126893565Y-105013003D01*
X126806990Y-105116179D01*
X126716265Y-105171918D01*
X128143550Y-105094848D02*
X128201654Y-105758977D01*
X127873159Y-104736096D02*
X127698224Y-105468415D01*
X128314916Y-105414462D01*
X146394827Y-126979092D02*
X145398632Y-126891936D01*
X145419384Y-126654747D01*
X145479272Y-126516584D01*
X145582449Y-126430009D01*
X145681475Y-126390871D01*
X145875376Y-126360035D01*
X146017690Y-126372486D01*
X146203291Y-126436524D01*
X146294016Y-126492263D01*
X146380591Y-126595439D01*
X146415578Y-126741903D01*
X146394827Y-126979092D01*
X146527636Y-125461081D02*
X146477833Y-126030335D01*
X146502734Y-125745708D02*
X145506539Y-125658552D01*
X145640552Y-125765879D01*
X145727128Y-125869055D01*
X145766265Y-125968081D01*
X145610296Y-124472606D02*
X145568794Y-124946985D01*
X146039022Y-125035925D01*
X145995734Y-124984337D01*
X145956597Y-124885311D01*
X145977348Y-124648122D01*
X146033087Y-124557397D01*
X146084675Y-124514109D01*
X146183701Y-124474972D01*
X146420890Y-124495723D01*
X146511615Y-124551462D01*
X146554903Y-124603050D01*
X146594040Y-124702076D01*
X146573289Y-124939265D01*
X146517550Y-125029990D01*
X146465962Y-125073278D01*
X113301083Y-140271588D02*
X114167109Y-139771588D01*
X114286156Y-139977784D01*
X114316346Y-140125312D01*
X114281486Y-140255409D01*
X114222817Y-140344268D01*
X114081669Y-140480745D01*
X113957951Y-140552174D01*
X113769185Y-140606172D01*
X113662896Y-140612552D01*
X113532799Y-140577693D01*
X113420131Y-140477784D01*
X113301083Y-140271588D01*
X114062988Y-141591245D02*
X113777274Y-141096374D01*
X113920131Y-141343810D02*
X114786156Y-140843810D01*
X114614819Y-140832760D01*
X114484722Y-140797900D01*
X114395863Y-140739231D01*
X115357585Y-141833553D02*
X115262347Y-141668596D01*
X115173488Y-141609927D01*
X115108440Y-141592497D01*
X114937103Y-141581447D01*
X114748336Y-141635446D01*
X114418421Y-141825922D01*
X114359752Y-141914780D01*
X114342323Y-141979829D01*
X114348702Y-142086117D01*
X114443940Y-142251074D01*
X114532799Y-142309743D01*
X114597848Y-142327173D01*
X114704136Y-142320793D01*
X114910332Y-142201746D01*
X114969001Y-142112887D01*
X114986431Y-142047839D01*
X114980051Y-141941551D01*
X114884813Y-141776593D01*
X114795955Y-141717924D01*
X114730906Y-141700494D01*
X114624618Y-141706874D01*
X131239590Y-119409669D02*
X132179283Y-119067648D01*
X132260716Y-119291385D01*
X132264829Y-119441913D01*
X132207908Y-119563981D01*
X132134700Y-119641302D01*
X131971998Y-119751196D01*
X131837756Y-119800056D01*
X131642480Y-119820455D01*
X131536699Y-119808281D01*
X131414631Y-119751360D01*
X131321024Y-119633405D01*
X131239590Y-119409669D01*
X131760764Y-120841581D02*
X131565324Y-120304614D01*
X131663044Y-120573098D02*
X132602736Y-120231077D01*
X132435921Y-120190443D01*
X132313853Y-120133522D01*
X132236533Y-120060314D01*
X132814463Y-120812792D02*
X133042477Y-121439254D01*
X131956204Y-121378548D01*
M02*
