G04 #@! TF.GenerationSoftware,KiCad,Pcbnew,5.1.5+dfsg1-2build2*
G04 #@! TF.CreationDate,2022-01-20T19:04:38+01:00*
G04 #@! TF.ProjectId,LED-02,4c45442d-3032-42e6-9b69-6361645f7063,rev?*
G04 #@! TF.SameCoordinates,Original*
G04 #@! TF.FileFunction,Soldermask,Bot*
G04 #@! TF.FilePolarity,Negative*
%FSLAX46Y46*%
G04 Gerber Fmt 4.6, Leading zero omitted, Abs format (unit mm)*
G04 Created by KiCad (PCBNEW 5.1.5+dfsg1-2build2) date 2022-01-20 19:04:38*
%MOMM*%
%LPD*%
G04 APERTURE LIST*
%ADD10C,0.100000*%
G04 APERTURE END LIST*
D10*
G36*
X138176000Y-150114000D02*
G01*
X115824000Y-150114000D01*
X115824000Y-148082000D01*
X138176000Y-148082000D01*
X138176000Y-150114000D01*
G37*
X138176000Y-150114000D02*
X115824000Y-150114000D01*
X115824000Y-148082000D01*
X138176000Y-148082000D01*
X138176000Y-150114000D01*
G36*
X138176000Y-105918000D02*
G01*
X115824000Y-105918000D01*
X115824000Y-103886000D01*
X138176000Y-103886000D01*
X138176000Y-105918000D01*
G37*
X138176000Y-105918000D02*
X115824000Y-105918000D01*
X115824000Y-103886000D01*
X138176000Y-103886000D01*
X138176000Y-105918000D01*
G36*
X149860000Y-128778000D02*
G01*
X104140000Y-128778000D01*
X104140000Y-125476000D01*
X149860000Y-125476000D01*
X149860000Y-128778000D01*
G37*
X149860000Y-128778000D02*
X104140000Y-128778000D01*
X104140000Y-125476000D01*
X149860000Y-125476000D01*
X149860000Y-128778000D01*
G36*
X127966536Y-141650800D02*
G01*
X127997738Y-141660265D01*
X128026486Y-141675631D01*
X128051687Y-141696313D01*
X128072369Y-141721514D01*
X128087735Y-141750262D01*
X128097200Y-141781464D01*
X128101000Y-141820046D01*
X128101000Y-143675954D01*
X128097200Y-143714536D01*
X128087735Y-143745738D01*
X128072369Y-143774486D01*
X128051687Y-143799687D01*
X128026486Y-143820369D01*
X127997738Y-143835735D01*
X127966536Y-143845200D01*
X127927954Y-143849000D01*
X126072046Y-143849000D01*
X126033464Y-143845200D01*
X126002262Y-143835735D01*
X125973514Y-143820369D01*
X125948313Y-143799687D01*
X125927631Y-143774486D01*
X125912265Y-143745738D01*
X125902800Y-143714536D01*
X125899000Y-143675954D01*
X125899000Y-141820046D01*
X125902800Y-141781464D01*
X125912265Y-141750262D01*
X125927631Y-141721514D01*
X125948313Y-141696313D01*
X125973514Y-141675631D01*
X126002262Y-141660265D01*
X126033464Y-141650800D01*
X126072046Y-141647000D01*
X127927954Y-141647000D01*
X127966536Y-141650800D01*
G37*
G36*
X107646536Y-139618800D02*
G01*
X107677738Y-139628265D01*
X107706486Y-139643631D01*
X107731687Y-139664313D01*
X107752369Y-139689514D01*
X107767735Y-139718262D01*
X107777200Y-139749464D01*
X107781000Y-139788046D01*
X107781000Y-141643954D01*
X107777200Y-141682536D01*
X107767735Y-141713738D01*
X107752369Y-141742486D01*
X107731687Y-141767687D01*
X107706486Y-141788369D01*
X107677738Y-141803735D01*
X107646536Y-141813200D01*
X107607954Y-141817000D01*
X105752046Y-141817000D01*
X105713464Y-141813200D01*
X105682262Y-141803735D01*
X105653514Y-141788369D01*
X105628313Y-141767687D01*
X105607631Y-141742486D01*
X105592265Y-141713738D01*
X105582800Y-141682536D01*
X105579000Y-141643954D01*
X105579000Y-139788046D01*
X105582800Y-139749464D01*
X105592265Y-139718262D01*
X105607631Y-139689514D01*
X105628313Y-139664313D01*
X105653514Y-139643631D01*
X105682262Y-139628265D01*
X105713464Y-139618800D01*
X105752046Y-139615000D01*
X107607954Y-139615000D01*
X107646536Y-139618800D01*
G37*
G36*
X152096536Y-119552800D02*
G01*
X152127738Y-119562265D01*
X152156486Y-119577631D01*
X152181687Y-119598313D01*
X152202369Y-119623514D01*
X152217735Y-119652262D01*
X152227200Y-119683464D01*
X152231000Y-119722046D01*
X152231000Y-121577954D01*
X152227200Y-121616536D01*
X152217735Y-121647738D01*
X152202369Y-121676486D01*
X152181687Y-121701687D01*
X152156486Y-121722369D01*
X152127738Y-121737735D01*
X152096536Y-121747200D01*
X152057954Y-121751000D01*
X150202046Y-121751000D01*
X150163464Y-121747200D01*
X150132262Y-121737735D01*
X150103514Y-121722369D01*
X150078313Y-121701687D01*
X150057631Y-121676486D01*
X150042265Y-121647738D01*
X150032800Y-121616536D01*
X150029000Y-121577954D01*
X150029000Y-119722046D01*
X150032800Y-119683464D01*
X150042265Y-119652262D01*
X150057631Y-119623514D01*
X150078313Y-119598313D01*
X150103514Y-119577631D01*
X150132262Y-119562265D01*
X150163464Y-119552800D01*
X150202046Y-119549000D01*
X152057954Y-119549000D01*
X152096536Y-119552800D01*
G37*
G36*
X121108536Y-107360800D02*
G01*
X121139738Y-107370265D01*
X121168486Y-107385631D01*
X121193687Y-107406313D01*
X121214369Y-107431514D01*
X121229735Y-107460262D01*
X121239200Y-107491464D01*
X121243000Y-107530046D01*
X121243000Y-109385954D01*
X121239200Y-109424536D01*
X121229735Y-109455738D01*
X121214369Y-109484486D01*
X121193687Y-109509687D01*
X121168486Y-109530369D01*
X121139738Y-109545735D01*
X121108536Y-109555200D01*
X121069954Y-109559000D01*
X119214046Y-109559000D01*
X119175464Y-109555200D01*
X119144262Y-109545735D01*
X119115514Y-109530369D01*
X119090313Y-109509687D01*
X119069631Y-109484486D01*
X119054265Y-109455738D01*
X119044800Y-109424536D01*
X119041000Y-109385954D01*
X119041000Y-107530046D01*
X119044800Y-107491464D01*
X119054265Y-107460262D01*
X119069631Y-107431514D01*
X119090313Y-107406313D01*
X119115514Y-107385631D01*
X119144262Y-107370265D01*
X119175464Y-107360800D01*
X119214046Y-107357000D01*
X121069954Y-107357000D01*
X121108536Y-107360800D01*
G37*
G36*
X129744536Y-96184800D02*
G01*
X129775738Y-96194265D01*
X129804486Y-96209631D01*
X129829687Y-96230313D01*
X129850369Y-96255514D01*
X129865735Y-96284262D01*
X129875200Y-96315464D01*
X129879000Y-96354046D01*
X129879000Y-98209954D01*
X129875200Y-98248536D01*
X129865735Y-98279738D01*
X129850369Y-98308486D01*
X129829687Y-98333687D01*
X129804486Y-98354369D01*
X129775738Y-98369735D01*
X129744536Y-98379200D01*
X129705954Y-98383000D01*
X127850046Y-98383000D01*
X127811464Y-98379200D01*
X127780262Y-98369735D01*
X127751514Y-98354369D01*
X127726313Y-98333687D01*
X127705631Y-98308486D01*
X127690265Y-98279738D01*
X127680800Y-98248536D01*
X127677000Y-98209954D01*
X127677000Y-96354046D01*
X127680800Y-96315464D01*
X127690265Y-96284262D01*
X127705631Y-96255514D01*
X127726313Y-96230313D01*
X127751514Y-96209631D01*
X127780262Y-96194265D01*
X127811464Y-96184800D01*
X127850046Y-96181000D01*
X129705954Y-96181000D01*
X129744536Y-96184800D01*
G37*
M02*
