EESchema Schematic File Version 4
EELAYER 30 0
EELAYER END
$Descr A4 11693 8268
encoding utf-8
Sheet 1 1
Title ""
Date ""
Rev ""
Comp ""
Comment1 ""
Comment2 ""
Comment3 ""
Comment4 ""
$EndDescr
$Comp
L Regulator_Linear:AMS1117-3.3 U1
U 1 1 5D753C0D
P 2350 1700
F 0 "U1" H 2350 1942 50  0000 C CNN
F 1 "AMS1117-3.3" H 2350 1851 50  0000 C CNN
F 2 "Package_TO_SOT_SMD:SOT-223-3_TabPin2" H 2350 1900 50  0001 C CNN
F 3 "http://www.advanced-monolithic.com/pdf/ds1117.pdf" H 2450 1450 50  0001 C CNN
	1    2350 1700
	1    0    0    -1  
$EndComp
$Comp
L Device:CP C3
U 1 1 5D754703
P 2950 1900
F 0 "C3" H 3068 1946 50  0000 L CNN
F 1 "4u7" H 3068 1855 50  0000 L CNN
F 2 "Capacitor_Tantalum_SMD:CP_EIA-3216-18_Kemet-A_Pad1.58x1.35mm_HandSolder" H 2988 1750 50  0001 C CNN
F 3 "~" H 2950 1900 50  0001 C CNN
	1    2950 1900
	1    0    0    -1  
$EndComp
$Comp
L Device:C C1
U 1 1 5D754EC0
P 2000 1900
F 0 "C1" H 1750 1900 50  0000 L CNN
F 1 "100nF" H 1750 1800 50  0000 L CNN
F 2 "Capacitor_SMD:C_0603_1608Metric_Pad1.05x0.95mm_HandSolder" H 2038 1750 50  0001 C CNN
F 3 "~" H 2000 1900 50  0001 C CNN
	1    2000 1900
	1    0    0    -1  
$EndComp
$Comp
L Device:C C2
U 1 1 5D755C9B
P 2700 1900
F 0 "C2" H 2700 2000 50  0000 L CNN
F 1 "100nF" H 2450 1800 50  0000 L CNN
F 2 "Capacitor_SMD:C_0603_1608Metric_Pad1.05x0.95mm_HandSolder" H 2738 1750 50  0001 C CNN
F 3 "~" H 2700 1900 50  0001 C CNN
	1    2700 1900
	1    0    0    -1  
$EndComp
$Comp
L power:GND #PWR06
U 1 1 5D75B329
P 2350 2150
F 0 "#PWR06" H 2350 1900 50  0001 C CNN
F 1 "GND" H 2355 1977 50  0000 C CNN
F 2 "" H 2350 2150 50  0001 C CNN
F 3 "" H 2350 2150 50  0001 C CNN
	1    2350 2150
	1    0    0    -1  
$EndComp
Wire Wire Line
	2000 2050 2000 2100
Wire Wire Line
	2000 2100 2350 2100
Wire Wire Line
	2950 2100 2950 2050
Wire Wire Line
	2700 2050 2700 2100
Connection ~ 2700 2100
Wire Wire Line
	2700 2100 2950 2100
Wire Wire Line
	2350 2000 2350 2100
Connection ~ 2350 2100
Wire Wire Line
	2350 2100 2700 2100
Wire Wire Line
	2350 2100 2350 2150
Wire Wire Line
	2050 1700 2000 1700
Wire Wire Line
	2000 1700 2000 1750
Wire Wire Line
	2650 1700 2700 1700
Wire Wire Line
	2700 1700 2700 1750
Wire Wire Line
	2700 1700 2950 1700
Wire Wire Line
	2950 1700 2950 1750
Connection ~ 2700 1700
$Comp
L power:+3V3 #PWR08
U 1 1 5D75D416
P 3000 1650
F 0 "#PWR08" H 3000 1500 50  0001 C CNN
F 1 "+3V3" H 3015 1823 50  0000 C CNN
F 2 "" H 3000 1650 50  0001 C CNN
F 3 "" H 3000 1650 50  0001 C CNN
	1    3000 1650
	1    0    0    -1  
$EndComp
Wire Wire Line
	3000 1650 3000 1700
Wire Wire Line
	3000 1700 2950 1700
Connection ~ 2950 1700
$Comp
L power:+5V #PWR05
U 1 1 5D75E8B0
P 1800 1650
F 0 "#PWR05" H 1800 1500 50  0001 C CNN
F 1 "+5V" H 1815 1823 50  0000 C CNN
F 2 "" H 1800 1650 50  0001 C CNN
F 3 "" H 1800 1650 50  0001 C CNN
	1    1800 1650
	1    0    0    -1  
$EndComp
Wire Wire Line
	1800 1650 1800 1700
Wire Wire Line
	1800 1700 2000 1700
Connection ~ 2000 1700
$Comp
L Connector_Generic:Conn_01x02 J1
U 1 1 5D765442
P 1050 1950
F 0 "J1" H 1050 1750 50  0000 C CNN
F 1 "PWR_5V" V 1150 1900 50  0000 C CNN
F 2 "Connector_PinHeader_2.54mm:PinHeader_1x02_P2.54mm_Vertical" H 1050 1950 50  0001 C CNN
F 3 "~" H 1050 1950 50  0001 C CNN
	1    1050 1950
	-1   0    0    1   
$EndComp
$Comp
L power:+5V #PWR03
U 1 1 5D766272
P 1450 1650
F 0 "#PWR03" H 1450 1500 50  0001 C CNN
F 1 "+5V" H 1465 1823 50  0000 C CNN
F 2 "" H 1450 1650 50  0001 C CNN
F 3 "" H 1450 1650 50  0001 C CNN
	1    1450 1650
	1    0    0    -1  
$EndComp
Wire Wire Line
	1450 1650 1450 1850
Wire Wire Line
	1450 1850 1300 1850
$Comp
L power:GND #PWR04
U 1 1 5D766A71
P 1450 2150
F 0 "#PWR04" H 1450 1900 50  0001 C CNN
F 1 "GND" H 1455 1977 50  0000 C CNN
F 2 "" H 1450 2150 50  0001 C CNN
F 3 "" H 1450 2150 50  0001 C CNN
	1    1450 2150
	1    0    0    -1  
$EndComp
Wire Wire Line
	1450 2150 1450 1950
Wire Wire Line
	1450 1950 1300 1950
$Comp
L Device:C C5
U 1 1 5D7693DC
P 5000 1600
F 0 "C5" V 4950 1500 50  0000 C CNN
F 1 "100nF" V 5050 1400 50  0000 C CNN
F 2 "Capacitor_SMD:C_0603_1608Metric_Pad1.05x0.95mm_HandSolder" H 5038 1450 50  0001 C CNN
F 3 "~" H 5000 1600 50  0001 C CNN
	1    5000 1600
	0    1    1    0   
$EndComp
$Comp
L Device:C C4
U 1 1 5D7697AF
P 5000 1400
F 0 "C4" V 4950 1300 50  0000 C CNN
F 1 "47uF" V 5050 1250 50  0000 C CNN
F 2 "Capacitor_SMD:C_1206_3216Metric_Pad1.42x1.75mm_HandSolder" H 5038 1250 50  0001 C CNN
F 3 "~" H 5000 1400 50  0001 C CNN
	1    5000 1400
	0    1    1    0   
$EndComp
$Comp
L power:GND #PWR012
U 1 1 5D76E297
P 5200 4450
F 0 "#PWR012" H 5200 4200 50  0001 C CNN
F 1 "GND" H 5205 4277 50  0000 C CNN
F 2 "" H 5200 4450 50  0001 C CNN
F 3 "" H 5200 4450 50  0001 C CNN
	1    5200 4450
	1    0    0    -1  
$EndComp
Wire Wire Line
	5150 1400 5200 1400
Wire Wire Line
	5200 1400 5200 1600
Wire Wire Line
	5150 1600 5200 1600
Connection ~ 5200 1600
Wire Wire Line
	5200 1600 5200 1650
$Comp
L power:GND #PWR09
U 1 1 5D77FFA0
P 4700 1400
F 0 "#PWR09" H 4700 1150 50  0001 C CNN
F 1 "GND" V 4705 1272 50  0000 R CNN
F 2 "" H 4700 1400 50  0001 C CNN
F 3 "" H 4700 1400 50  0001 C CNN
	1    4700 1400
	0    1    1    0   
$EndComp
$Comp
L power:GND #PWR010
U 1 1 5D781695
P 4700 1600
F 0 "#PWR010" H 4700 1350 50  0001 C CNN
F 1 "GND" V 4705 1472 50  0000 R CNN
F 2 "" H 4700 1600 50  0001 C CNN
F 3 "" H 4700 1600 50  0001 C CNN
	1    4700 1600
	0    1    1    0   
$EndComp
$Comp
L power:+3V3 #PWR011
U 1 1 5D781935
P 5200 1300
F 0 "#PWR011" H 5200 1150 50  0001 C CNN
F 1 "+3V3" H 5215 1473 50  0000 C CNN
F 2 "" H 5200 1300 50  0001 C CNN
F 3 "" H 5200 1300 50  0001 C CNN
	1    5200 1300
	1    0    0    -1  
$EndComp
Wire Wire Line
	5200 1300 5200 1400
Connection ~ 5200 1400
$Comp
L power:GND #PWR01
U 1 1 5D78E6C0
P 1350 3250
F 0 "#PWR01" H 1350 3000 50  0001 C CNN
F 1 "GND" H 1355 3077 50  0000 C CNN
F 2 "" H 1350 3250 50  0001 C CNN
F 3 "" H 1350 3250 50  0001 C CNN
	1    1350 3250
	1    0    0    -1  
$EndComp
Wire Wire Line
	1300 3200 1350 3200
Wire Wire Line
	1350 3200 1350 3250
$Comp
L Device:R R2
U 1 1 5D79127E
P 1550 3000
F 0 "R2" V 1550 3000 50  0000 C CNN
F 1 "330R" V 1700 3000 50  0000 C CNN
F 2 "Resistor_SMD:R_0603_1608Metric_Pad1.05x0.95mm_HandSolder" V 1480 3000 50  0001 C CNN
F 3 "~" H 1550 3000 50  0001 C CNN
	1    1550 3000
	0    1    1    0   
$EndComp
$Comp
L Device:R R5
U 1 1 5D791539
P 1850 3100
F 0 "R5" V 1850 3100 50  0000 C CNN
F 1 "330R" V 1950 3100 50  0000 C CNN
F 2 "Resistor_SMD:R_0603_1608Metric_Pad1.05x0.95mm_HandSolder" V 1780 3100 50  0001 C CNN
F 3 "~" H 1850 3100 50  0001 C CNN
	1    1850 3100
	0    1    1    0   
$EndComp
Wire Wire Line
	1400 3000 1300 3000
Wire Wire Line
	1300 3100 1700 3100
Wire Wire Line
	5800 1950 5950 1950
Wire Wire Line
	5800 2150 5950 2150
Text Label 5950 1950 0    50   ~ 0
TXD0
Text Label 5950 2150 0    50   ~ 0
RXD0
Wire Wire Line
	1700 3000 2100 3000
Wire Wire Line
	2000 3100 2100 3100
Text Label 2100 3100 0    50   ~ 0
RXD0
Text Label 2100 3000 0    50   ~ 0
TXD0
$Comp
L Connector_Generic:Conn_01x05 J2
U 1 1 5D79780F
P 1100 3000
F 0 "J2" H 1100 2700 50  0000 C CNN
F 1 "Programming" V 1200 3000 50  0000 C CNN
F 2 "Connector_PinSocket_2.54mm:PinSocket_1x05_P2.54mm_Horizontal" H 1100 3000 50  0001 C CNN
F 3 "~" H 1100 3000 50  0001 C CNN
	1    1100 3000
	-1   0    0    1   
$EndComp
$Comp
L Device:R R4
U 1 1 5D79816B
P 1850 2900
F 0 "R4" V 1850 2900 50  0000 C CNN
F 1 "330R" V 1700 2900 50  0000 C CNN
F 2 "Resistor_SMD:R_0603_1608Metric_Pad1.05x0.95mm_HandSolder" V 1780 2900 50  0001 C CNN
F 3 "~" H 1850 2900 50  0001 C CNN
	1    1850 2900
	0    1    1    0   
$EndComp
$Comp
L Device:R R1
U 1 1 5D7985EB
P 1550 2800
F 0 "R1" V 1550 2800 50  0000 C CNN
F 1 "330R" V 1434 2800 50  0000 C CNN
F 2 "Resistor_SMD:R_0603_1608Metric_Pad1.05x0.95mm_HandSolder" V 1480 2800 50  0001 C CNN
F 3 "~" H 1550 2800 50  0001 C CNN
	1    1550 2800
	0    1    1    0   
$EndComp
Wire Wire Line
	1300 2800 1400 2800
Wire Wire Line
	1300 2900 1700 2900
Wire Wire Line
	2000 2900 2100 2900
Wire Wire Line
	1700 2800 2100 2800
Text Label 2100 2900 0    50   ~ 0
DTR
Text Label 2100 2800 0    50   ~ 0
RTS
Wire Wire Line
	5800 1850 5950 1850
Text Label 5950 1850 0    50   ~ 0
BOOT
$Comp
L SMRT_PWR_PLG-00-rescue:MOC3042M-Relay_SolidState U2
U 1 1 5D7AAF9D
P 2000 5850
F 0 "U2" H 2000 6175 50  0000 C CNN
F 1 "MOC3042M" H 2000 6084 50  0000 C CNN
F 2 "Package_DIP:DIP-6_W7.62mm_LongPads" H 1800 5650 50  0001 L CIN
F 3 "http://www.fairchildsemi.com/ds/MO/MOC3031M.pdf" H 1965 5850 50  0001 L CNN
	1    2000 5850
	1    0    0    -1  
$EndComp
$Comp
L Device:R R8
U 1 1 5D7ADD58
P 2500 5950
F 0 "R8" V 2500 5950 50  0000 C CNN
F 1 "220R/0.5W" V 2400 5950 50  0000 C CNN
F 2 "Resistor_THT:R_Axial_DIN0207_L6.3mm_D2.5mm_P10.16mm_Horizontal" V 2430 5950 50  0001 C CNN
F 3 "~" H 2500 5950 50  0001 C CNN
	1    2500 5950
	0    -1   -1   0   
$EndComp
$Comp
L Device:R R7
U 1 1 5D7B1D05
P 1500 5750
F 0 "R7" V 1500 5750 50  0000 C CNN
F 1 "220R" V 1384 5750 50  0000 C CNN
F 2 "Resistor_SMD:R_0603_1608Metric_Pad1.05x0.95mm_HandSolder" V 1430 5750 50  0001 C CNN
F 3 "~" H 1500 5750 50  0001 C CNN
	1    1500 5750
	0    1    1    0   
$EndComp
Wire Wire Line
	1650 5750 1700 5750
Wire Wire Line
	2300 5950 2350 5950
Wire Wire Line
	3150 5300 3150 5500
Text Label 2000 5300 0    50   ~ 0
LOUT
Wire Wire Line
	3150 5850 3150 5800
Text Label 2000 5100 0    50   ~ 0
LIN
Wire Wire Line
	2650 5950 2700 5950
Wire Wire Line
	1900 5300 3150 5300
Wire Wire Line
	2700 5950 2700 5100
Wire Wire Line
	3000 5750 2300 5750
Text Label 5950 2050 0    50   ~ 0
GPIO_POWER_SWITCH
Wire Wire Line
	5800 2950 5950 2950
Wire Wire Line
	5800 2850 5950 2850
Text Label 5950 2850 0    50   ~ 0
UI_RXD_PIN
Text Label 5950 2950 0    50   ~ 0
UI_TXD_PIN
$Comp
L Connector_Generic:Conn_01x03 J3
U 1 1 5D7F7676
P 1100 3950
F 0 "J3" H 1100 3750 50  0000 C CNN
F 1 "User_Interface" V 1200 3950 50  0000 C CNN
F 2 "Connector_PinSocket_2.54mm:PinSocket_1x03_P2.54mm_Horizontal" H 1100 3950 50  0001 C CNN
F 3 "~" H 1100 3950 50  0001 C CNN
	1    1100 3950
	-1   0    0    1   
$EndComp
$Comp
L Device:R R3
U 1 1 5D7F83FB
P 1550 3850
F 0 "R3" V 1550 3850 50  0000 C CNN
F 1 "330R" V 1434 3850 50  0000 C CNN
F 2 "Resistor_SMD:R_0603_1608Metric_Pad1.05x0.95mm_HandSolder" V 1480 3850 50  0001 C CNN
F 3 "~" H 1550 3850 50  0001 C CNN
	1    1550 3850
	0    1    1    0   
$EndComp
$Comp
L Device:R R6
U 1 1 5D7F8DB1
P 1850 3950
F 0 "R6" V 1850 3950 50  0000 C CNN
F 1 "330R" V 1950 3950 50  0000 C CNN
F 2 "Resistor_SMD:R_0603_1608Metric_Pad1.05x0.95mm_HandSolder" V 1780 3950 50  0001 C CNN
F 3 "~" H 1850 3950 50  0001 C CNN
	1    1850 3950
	0    1    1    0   
$EndComp
Wire Wire Line
	1300 3850 1400 3850
Wire Wire Line
	1300 3950 1700 3950
$Comp
L power:GND #PWR02
U 1 1 5D7FC01F
P 1350 4100
F 0 "#PWR02" H 1350 3850 50  0001 C CNN
F 1 "GND" H 1355 3927 50  0000 C CNN
F 2 "" H 1350 4100 50  0001 C CNN
F 3 "" H 1350 4100 50  0001 C CNN
	1    1350 4100
	1    0    0    -1  
$EndComp
Wire Wire Line
	1300 4050 1350 4050
Wire Wire Line
	1350 4050 1350 4100
Wire Wire Line
	1700 3850 2100 3850
Wire Wire Line
	2000 3950 2100 3950
Text Label 2100 3950 0    50   ~ 0
UI_RXD_PIN
Text Label 2100 3850 0    50   ~ 0
UI_TXD_PIN
$Comp
L Transistor_BJT:DTC114E Q1
U 1 1 5D81092D
P 3150 2650
F 0 "Q1" H 3338 2696 50  0000 L CNN
F 1 "KRC402E" H 3338 2605 50  0000 L CNN
F 2 "Package_TO_SOT_SMD:SC-59_Handsoldering" H 3150 2650 50  0001 L CNN
F 3 "" H 3150 2650 50  0001 L CNN
	1    3150 2650
	1    0    0    -1  
$EndComp
$Comp
L Transistor_BJT:DTC114E Q2
U 1 1 5D82C928
P 3150 3250
F 0 "Q2" H 3338 3204 50  0000 L CNN
F 1 "KRC402E" H 3338 3295 50  0000 L CNN
F 2 "Package_TO_SOT_SMD:SC-59_Handsoldering" H 3150 3250 50  0001 L CNN
F 3 "" H 3150 3250 50  0001 L CNN
	1    3150 3250
	1    0    0    1   
$EndComp
Wire Wire Line
	2900 2650 2850 2650
Wire Wire Line
	2900 3250 2800 3250
Wire Wire Line
	3250 3050 3250 3000
Wire Wire Line
	3250 3000 2850 3000
Wire Wire Line
	2850 3000 2850 2650
Connection ~ 2850 2650
Wire Wire Line
	2850 2650 2650 2650
Wire Wire Line
	3250 2850 3250 2900
Wire Wire Line
	3250 2900 2800 2900
Wire Wire Line
	2800 2900 2800 3250
Connection ~ 2800 3250
Wire Wire Line
	2800 3250 2650 3250
Wire Wire Line
	3250 2450 3250 2400
Wire Wire Line
	3250 2400 3600 2400
Wire Wire Line
	3250 3450 3250 3500
Wire Wire Line
	3250 3500 3650 3500
Text Label 3650 3500 0    50   ~ 0
BOOT
Text Label 3600 2400 0    50   ~ 0
EN
Wire Wire Line
	4600 1850 4450 1850
Text Label 4450 1850 2    50   ~ 0
EN
Text Label 2650 2650 2    50   ~ 0
DTR
Text Label 2650 3250 2    50   ~ 0
RTS
$Comp
L Switch:SW_Push SW1
U 1 1 5D764B48
P 6900 2350
F 0 "SW1" H 7000 2450 50  0000 C CNN
F 1 "manual_sw" H 6850 2300 50  0000 C CNN
F 2 "Button_Switch_THT:SW_PUSH_6mm_H5mm" H 6900 2550 50  0001 C CNN
F 3 "~" H 6900 2550 50  0001 C CNN
	1    6900 2350
	1    0    0    -1  
$EndComp
$Comp
L power:GND #PWR013
U 1 1 5D766948
P 7150 2400
F 0 "#PWR013" H 7150 2150 50  0001 C CNN
F 1 "GND" H 7155 2227 50  0000 C CNN
F 2 "" H 7150 2400 50  0001 C CNN
F 3 "" H 7150 2400 50  0001 C CNN
	1    7150 2400
	1    0    0    -1  
$EndComp
Wire Wire Line
	7150 2400 7150 2350
Wire Wire Line
	7150 2350 7100 2350
Text Label 5950 2350 0    50   ~ 0
BTN_MANUAL_SWITCH
Wire Wire Line
	5800 2350 6700 2350
$Comp
L Device:R R9
U 1 1 5D7E5CF8
P 5200 5150
F 0 "R9" V 5200 5150 50  0000 C CNN
F 1 "330R" V 5084 5150 50  0000 C CNN
F 2 "Resistor_SMD:R_0603_1608Metric_Pad1.05x0.95mm_HandSolder" V 5130 5150 50  0001 C CNN
F 3 "~" H 5200 5150 50  0001 C CNN
	1    5200 5150
	0    1    1    0   
$EndComp
Wire Wire Line
	5800 3050 5950 3050
Text Label 5950 3050 0    50   ~ 0
BTN_LED_BT_ON
Wire Wire Line
	5050 5150 4850 5150
Text Label 4850 5150 2    50   ~ 0
BTN_LED_BT_ON
$Comp
L Device:R R10
U 1 1 5D7EBDD7
P 5200 5450
F 0 "R10" V 5200 5450 50  0000 C CNN
F 1 "330R" V 5084 5450 50  0000 C CNN
F 2 "Resistor_SMD:R_0603_1608Metric_Pad1.05x0.95mm_HandSolder" V 5130 5450 50  0001 C CNN
F 3 "~" H 5200 5450 50  0001 C CNN
	1    5200 5450
	0    1    1    0   
$EndComp
Wire Wire Line
	5050 5450 4850 5450
Wire Wire Line
	5800 3150 5950 3150
Text Label 5950 3150 0    50   ~ 0
BTN_LED_MANUAL_ON
Text Label 4850 5450 2    50   ~ 0
BTN_LED_MANUAL_ON
$Comp
L Device:LED D1
U 1 1 5D7F0934
P 5550 5150
F 0 "D1" H 5543 4895 50  0000 C CNN
F 1 "Blue" H 5543 4986 50  0000 C CNN
F 2 "LED_SMD:LED_1210_3225Metric_Pad1.42x2.65mm_HandSolder" H 5550 5150 50  0001 C CNN
F 3 "~" H 5550 5150 50  0001 C CNN
	1    5550 5150
	-1   0    0    1   
$EndComp
$Comp
L Device:LED D2
U 1 1 5D7F0F90
P 5550 5450
F 0 "D2" H 5550 5350 50  0000 C CNN
F 1 "Yellow" H 5550 5550 50  0000 C CNN
F 2 "LED_SMD:LED_1210_3225Metric_Pad1.42x2.65mm_HandSolder" H 5550 5450 50  0001 C CNN
F 3 "~" H 5550 5450 50  0001 C CNN
	1    5550 5450
	-1   0    0    1   
$EndComp
Wire Wire Line
	5350 5150 5400 5150
Wire Wire Line
	5350 5450 5400 5450
$Comp
L power:GND #PWR014
U 1 1 5D7F63CD
P 5750 5150
F 0 "#PWR014" H 5750 4900 50  0001 C CNN
F 1 "GND" V 5755 5022 50  0000 R CNN
F 2 "" H 5750 5150 50  0001 C CNN
F 3 "" H 5750 5150 50  0001 C CNN
	1    5750 5150
	0    -1   -1   0   
$EndComp
$Comp
L power:GND #PWR015
U 1 1 5D7F67E9
P 5750 5450
F 0 "#PWR015" H 5750 5200 50  0001 C CNN
F 1 "GND" V 5755 5322 50  0000 R CNN
F 2 "" H 5750 5450 50  0001 C CNN
F 3 "" H 5750 5450 50  0001 C CNN
	1    5750 5450
	0    -1   -1   0   
$EndComp
Wire Wire Line
	5750 5150 5700 5150
Wire Wire Line
	5700 5450 5750 5450
$Comp
L Device:Fuse F1
U 1 1 5D7FFA19
P 2400 5100
F 0 "F1" V 2203 5100 50  0000 C CNN
F 1 "Fuse" V 2294 5100 50  0000 C CNN
F 2 "Fuse:Fuseholder_Cylinder-5x20mm_Schurter_0031_8201_Horizontal_Open" V 2330 5100 50  0001 C CNN
F 3 "~" H 2400 5100 50  0001 C CNN
	1    2400 5100
	0    1    1    0   
$EndComp
Wire Wire Line
	1900 5100 2250 5100
Wire Wire Line
	2550 5100 2700 5100
Connection ~ 2700 5100
$Comp
L Device:R R11
U 1 1 5D811468
P 5200 5800
F 0 "R11" V 5200 5800 50  0000 C CNN
F 1 "330R" V 5084 5800 50  0000 C CNN
F 2 "Resistor_SMD:R_0603_1608Metric_Pad1.05x0.95mm_HandSolder" V 5130 5800 50  0001 C CNN
F 3 "~" H 5200 5800 50  0001 C CNN
	1    5200 5800
	0    1    1    0   
$EndComp
$Comp
L Device:LED D3
U 1 1 5D811756
P 5550 5800
F 0 "D3" H 5550 5900 50  0000 C CNN
F 1 "Red" H 5550 6000 50  0000 C CNN
F 2 "LED_SMD:LED_1210_3225Metric_Pad1.42x2.65mm_HandSolder" H 5550 5800 50  0001 C CNN
F 3 "~" H 5550 5800 50  0001 C CNN
	1    5550 5800
	-1   0    0    1   
$EndComp
$Comp
L power:GND #PWR016
U 1 1 5D811C6C
P 5750 5800
F 0 "#PWR016" H 5750 5550 50  0001 C CNN
F 1 "GND" V 5755 5672 50  0000 R CNN
F 2 "" H 5750 5800 50  0001 C CNN
F 3 "" H 5750 5800 50  0001 C CNN
	1    5750 5800
	0    -1   -1   0   
$EndComp
Wire Wire Line
	5350 5800 5400 5800
Wire Wire Line
	5700 5800 5750 5800
Wire Wire Line
	5050 5800 4850 5800
Wire Wire Line
	5800 3250 5950 3250
Text Label 5950 3250 0    50   ~ 0
BTN_LED_BTN_PRESSED
Text Label 4850 5800 2    50   ~ 0
BTN_LED_BTN_PRESSED
Wire Wire Line
	4850 1400 4700 1400
Wire Wire Line
	4700 1600 4850 1600
Wire Wire Line
	3450 5850 3150 5850
Wire Wire Line
	2700 5100 3450 5100
Wire Wire Line
	3450 5100 3450 5850
$Comp
L Triac_Thyristor:BT139-600 Q3
U 1 1 5D7AA09E
P 3150 5650
F 0 "Q3" H 3000 5750 50  0000 L CNN
F 1 "BTA16-600" V 3300 5500 50  0000 L CNN
F 2 "Package_TO_SOT_THT:TO-220-3_Vertical" H 3350 5575 50  0001 L CIN
F 3 "https://www.rapidonline.com/pdf/47-3240.pdf" H 3150 5650 50  0001 L CNN
	1    3150 5650
	1    0    0    -1  
$EndComp
$Comp
L Connector_Generic:Conn_01x01 J4
U 1 1 5D8740AD
P 1700 5100
F 0 "J4" H 1850 5100 50  0000 C CNN
F 1 "PWR_220V_IN" H 1900 5000 50  0000 C CNN
F 2 "Connector_Wire:SolderWirePad_1x01_Drill1.2mm" H 1700 5100 50  0001 C CNN
F 3 "~" H 1700 5100 50  0001 C CNN
	1    1700 5100
	-1   0    0    1   
$EndComp
$Comp
L Connector_Generic:Conn_01x01 J5
U 1 1 5D874695
P 1700 5300
F 0 "J5" H 1850 5300 50  0000 C CNN
F 1 "PWR_220V_OUT" H 1900 5400 50  0000 C CNN
F 2 "Connector_Wire:SolderWirePad_1x01_Drill1.2mm" H 1700 5300 50  0001 C CNN
F 3 "~" H 1700 5300 50  0001 C CNN
	1    1700 5300
	-1   0    0    1   
$EndComp
$Comp
L Mechanical:MountingHole H1
U 1 1 5D899E96
P 5250 7300
F 0 "H1" H 5350 7346 50  0000 L CNN
F 1 "MountingHole" H 5350 7255 50  0000 L CNN
F 2 "MountingHole:MountingHole_3.2mm_M3" H 5250 7300 50  0001 C CNN
F 3 "~" H 5250 7300 50  0001 C CNN
	1    5250 7300
	1    0    0    -1  
$EndComp
$Comp
L Mechanical:MountingHole H2
U 1 1 5D89A8B6
P 5250 7550
F 0 "H2" H 5350 7596 50  0000 L CNN
F 1 "MountingHole" H 5350 7505 50  0000 L CNN
F 2 "MountingHole:MountingHole_3.2mm_M3" H 5250 7550 50  0001 C CNN
F 3 "~" H 5250 7550 50  0001 C CNN
	1    5250 7550
	1    0    0    -1  
$EndComp
$Comp
L Mechanical:MountingHole H3
U 1 1 5D89AB74
P 6200 7300
F 0 "H3" H 6300 7346 50  0000 L CNN
F 1 "MountingHole" H 6300 7255 50  0000 L CNN
F 2 "MountingHole:MountingHole_3.2mm_M3" H 6200 7300 50  0001 C CNN
F 3 "~" H 6200 7300 50  0001 C CNN
	1    6200 7300
	1    0    0    -1  
$EndComp
$Comp
L Mechanical:MountingHole H4
U 1 1 5D89ADDF
P 6200 7550
F 0 "H4" H 6300 7596 50  0000 L CNN
F 1 "MountingHole" H 6300 7505 50  0000 L CNN
F 2 "MountingHole:MountingHole_3.2mm_M3" H 6200 7550 50  0001 C CNN
F 3 "~" H 6200 7550 50  0001 C CNN
	1    6200 7550
	1    0    0    -1  
$EndComp
$Comp
L Connector_Generic:Conn_01x02 J6
U 1 1 5D8A8402
P 1100 5850
F 0 "J6" H 1018 5525 50  0000 C CNN
F 1 "PWR_SW_EN" V 1200 5850 50  0000 C CNN
F 2 "Connector_PinHeader_2.54mm:PinHeader_1x02_P2.54mm_Vertical" H 1100 5850 50  0001 C CNN
F 3 "~" H 1100 5850 50  0001 C CNN
	1    1100 5850
	-1   0    0    1   
$EndComp
Wire Wire Line
	1300 5750 1350 5750
Wire Wire Line
	1300 5850 1400 5850
Wire Wire Line
	1400 5850 1400 5950
Wire Wire Line
	1400 5950 1700 5950
$Comp
L Connector_Generic:Conn_01x02 J7
U 1 1 5D8B32BC
P 7750 2050
F 0 "J7" H 7668 1725 50  0000 C CNN
F 1 "PWR_SW_EN" V 7850 2050 50  0000 C CNN
F 2 "Connector_PinSocket_2.54mm:PinSocket_1x02_P2.54mm_Vertical" H 7750 2050 50  0001 C CNN
F 3 "~" H 7750 2050 50  0001 C CNN
	1    7750 2050
	1    0    0    -1  
$EndComp
Wire Wire Line
	5800 2050 7550 2050
$Comp
L power:GND #PWR0101
U 1 1 5D8B7453
P 7500 2200
F 0 "#PWR0101" H 7500 1950 50  0001 C CNN
F 1 "GND" H 7505 2027 50  0000 C CNN
F 2 "" H 7500 2200 50  0001 C CNN
F 3 "" H 7500 2200 50  0001 C CNN
	1    7500 2200
	1    0    0    -1  
$EndComp
Wire Wire Line
	7550 2150 7500 2150
Wire Wire Line
	7500 2150 7500 2200
NoConn ~ 5800 2750
$Comp
L power:PWR_FLAG #FLG0101
U 1 1 5D948DC6
P 1300 1650
F 0 "#FLG0101" H 1300 1725 50  0001 C CNN
F 1 "PWR_FLAG" H 1150 1800 50  0000 C CNN
F 2 "" H 1300 1650 50  0001 C CNN
F 3 "~" H 1300 1650 50  0001 C CNN
	1    1300 1650
	1    0    0    -1  
$EndComp
Wire Wire Line
	1300 1650 1300 1850
Connection ~ 1300 1850
Wire Wire Line
	1300 1850 1250 1850
$Comp
L power:PWR_FLAG #FLG0102
U 1 1 5D9539A0
P 1300 2150
F 0 "#FLG0102" H 1300 2225 50  0001 C CNN
F 1 "PWR_FLAG" H 1450 2300 50  0000 C CNN
F 2 "" H 1300 2150 50  0001 C CNN
F 3 "~" H 1300 2150 50  0001 C CNN
	1    1300 2150
	-1   0    0    1   
$EndComp
Wire Wire Line
	1300 2150 1300 1950
Connection ~ 1300 1950
Wire Wire Line
	1300 1950 1250 1950
Text Label 2350 5750 0    50   ~ 0
PWR_220_CNTRL
Text Label 2700 5100 0    50   ~ 0
LIN_FUSED
$Comp
L Connector:TestPoint TP9
U 1 1 5D91B66F
P 5850 2250
F 0 "TP9" V 5850 2450 50  0000 L CNN
F 1 "TestPoint" V 5750 2750 50  0001 L CNN
F 2 "TestPoint:TestPoint_Pad_D1.5mm" H 6050 2250 50  0001 C CNN
F 3 "~" H 6050 2250 50  0001 C CNN
	1    5850 2250
	0    1    1    0   
$EndComp
Wire Wire Line
	5850 2250 5800 2250
$Comp
L Connector:TestPoint TP10
U 1 1 5D91FEA8
P 5850 2450
F 0 "TP10" V 5850 2650 50  0000 L CNN
F 1 "TestPoint" V 5895 2638 50  0001 L CNN
F 2 "TestPoint:TestPoint_Pad_D1.5mm" H 6050 2450 50  0001 C CNN
F 3 "~" H 6050 2450 50  0001 C CNN
	1    5850 2450
	0    1    1    0   
$EndComp
Wire Wire Line
	5850 2450 5800 2450
$Comp
L Connector:TestPoint TP11
U 1 1 5D923ADE
P 5850 2550
F 0 "TP11" V 5850 2750 50  0000 L CNN
F 1 "TestPoint" V 5895 2738 50  0001 L CNN
F 2 "TestPoint:TestPoint_Pad_D1.5mm" H 6050 2550 50  0001 C CNN
F 3 "~" H 6050 2550 50  0001 C CNN
	1    5850 2550
	0    1    1    0   
$EndComp
Wire Wire Line
	5850 2550 5800 2550
$Comp
L Connector:TestPoint TP12
U 1 1 5D9274CF
P 5850 2650
F 0 "TP12" V 5850 2850 50  0000 L CNN
F 1 "TestPoint" V 5895 2838 50  0001 L CNN
F 2 "TestPoint:TestPoint_Pad_D1.5mm" H 6050 2650 50  0001 C CNN
F 3 "~" H 6050 2650 50  0001 C CNN
	1    5850 2650
	0    1    1    0   
$EndComp
Wire Wire Line
	5800 2650 5850 2650
$Comp
L RF_Module:ESP32-WROOM-32 U3
U 1 1 5D75383F
P 5200 3050
F 0 "U3" H 5350 4500 50  0000 C CNN
F 1 "ESP32-WROOM-32" H 5650 4400 50  0000 C CNN
F 2 "RF_Module:ESP32-WROOM-32" H 5200 1550 50  0001 C CNN
F 3 "https://www.espressif.com/sites/default/files/documentation/esp32-wroom-32_datasheet_en.pdf" H 4900 3100 50  0001 C CNN
	1    5200 3050
	1    0    0    -1  
$EndComp
$Comp
L Connector:TestPoint TP3
U 1 1 5D931A9C
P 4550 3050
F 0 "TP3" V 4550 3300 50  0000 C CNN
F 1 "TestPoint" V 4654 3122 50  0001 C CNN
F 2 "TestPoint:TestPoint_Pad_D1.5mm" H 4750 3050 50  0001 C CNN
F 3 "~" H 4750 3050 50  0001 C CNN
	1    4550 3050
	0    -1   -1   0   
$EndComp
$Comp
L Connector:TestPoint TP4
U 1 1 5D93255B
P 4550 3150
F 0 "TP4" V 4550 3400 50  0000 C CNN
F 1 "TestPoint" V 4654 3222 50  0001 C CNN
F 2 "TestPoint:TestPoint_Pad_D1.5mm" H 4750 3150 50  0001 C CNN
F 3 "~" H 4750 3150 50  0001 C CNN
	1    4550 3150
	0    -1   -1   0   
$EndComp
$Comp
L Connector:TestPoint TP5
U 1 1 5D9327AC
P 4550 3250
F 0 "TP5" V 4550 3500 50  0000 C CNN
F 1 "TestPoint" V 4654 3322 50  0001 C CNN
F 2 "TestPoint:TestPoint_Pad_D1.5mm" H 4750 3250 50  0001 C CNN
F 3 "~" H 4750 3250 50  0001 C CNN
	1    4550 3250
	0    -1   -1   0   
$EndComp
$Comp
L Connector:TestPoint TP6
U 1 1 5D93350F
P 4550 3350
F 0 "TP6" V 4550 3600 50  0000 C CNN
F 1 "TestPoint" V 4654 3422 50  0001 C CNN
F 2 "TestPoint:TestPoint_Pad_D1.5mm" H 4750 3350 50  0001 C CNN
F 3 "~" H 4750 3350 50  0001 C CNN
	1    4550 3350
	0    -1   -1   0   
$EndComp
$Comp
L Connector:TestPoint TP7
U 1 1 5D9337D0
P 4550 3450
F 0 "TP7" V 4550 3700 50  0000 C CNN
F 1 "TestPoint" V 4654 3522 50  0001 C CNN
F 2 "TestPoint:TestPoint_Pad_D1.5mm" H 4750 3450 50  0001 C CNN
F 3 "~" H 4750 3450 50  0001 C CNN
	1    4550 3450
	0    -1   -1   0   
$EndComp
$Comp
L Connector:TestPoint TP8
U 1 1 5D9342B6
P 4550 3550
F 0 "TP8" V 4550 3800 50  0000 C CNN
F 1 "TestPoint" V 4654 3622 50  0001 C CNN
F 2 "TestPoint:TestPoint_Pad_D1.5mm" H 4750 3550 50  0001 C CNN
F 3 "~" H 4750 3550 50  0001 C CNN
	1    4550 3550
	0    -1   -1   0   
$EndComp
Wire Wire Line
	4550 3550 4600 3550
Wire Wire Line
	4550 3450 4600 3450
Wire Wire Line
	4550 3350 4600 3350
Wire Wire Line
	4550 3250 4600 3250
Wire Wire Line
	4550 3150 4600 3150
Wire Wire Line
	4550 3050 4600 3050
$Comp
L Connector:TestPoint TP13
U 1 1 5D94DCFC
P 5850 3350
F 0 "TP13" V 5850 3550 50  0000 L CNN
F 1 "TestPoint" V 5895 3538 50  0001 L CNN
F 2 "TestPoint:TestPoint_Pad_D1.5mm" H 6050 3350 50  0001 C CNN
F 3 "~" H 6050 3350 50  0001 C CNN
	1    5850 3350
	0    1    1    0   
$EndComp
$Comp
L Connector:TestPoint TP14
U 1 1 5D94E328
P 5850 3450
F 0 "TP14" V 5850 3650 50  0000 L CNN
F 1 "TestPoint" V 5895 3638 50  0001 L CNN
F 2 "TestPoint:TestPoint_Pad_D1.5mm" H 6050 3450 50  0001 C CNN
F 3 "~" H 6050 3450 50  0001 C CNN
	1    5850 3450
	0    1    1    0   
$EndComp
Wire Wire Line
	5850 3350 5800 3350
Wire Wire Line
	5800 3450 5850 3450
$Comp
L Connector:TestPoint TP1
U 1 1 5D95C555
P 4550 2050
F 0 "TP1" V 4550 2300 50  0000 C CNN
F 1 "TestPoint" V 4550 2400 50  0001 C CNN
F 2 "TestPoint:TestPoint_Pad_D1.5mm" H 4750 2050 50  0001 C CNN
F 3 "~" H 4750 2050 50  0001 C CNN
	1    4550 2050
	0    -1   -1   0   
$EndComp
$Comp
L Connector:TestPoint TP2
U 1 1 5D95CA02
P 4550 2150
F 0 "TP2" V 4550 2400 50  0000 C CNN
F 1 "TestPoint" V 4550 2500 50  0001 C CNN
F 2 "TestPoint:TestPoint_Pad_D1.5mm" H 4750 2150 50  0001 C CNN
F 3 "~" H 4750 2150 50  0001 C CNN
	1    4550 2150
	0    -1   -1   0   
$EndComp
Wire Wire Line
	4550 2150 4600 2150
Wire Wire Line
	4550 2050 4600 2050
$Comp
L Connector:TestPoint TP15
U 1 1 5D96A2E8
P 5850 3550
F 0 "TP15" V 5850 3750 50  0000 L CNN
F 1 "TestPoint" V 5895 3738 50  0001 L CNN
F 2 "TestPoint:TestPoint_Pad_D1.5mm" H 6050 3550 50  0001 C CNN
F 3 "~" H 6050 3550 50  0001 C CNN
	1    5850 3550
	0    1    1    0   
$EndComp
$Comp
L Connector:TestPoint TP16
U 1 1 5D96A480
P 5850 3650
F 0 "TP16" V 5850 3850 50  0000 L CNN
F 1 "TestPoint" V 5895 3838 50  0001 L CNN
F 2 "TestPoint:TestPoint_Pad_D1.5mm" H 6050 3650 50  0001 C CNN
F 3 "~" H 6050 3650 50  0001 C CNN
	1    5850 3650
	0    1    1    0   
$EndComp
$Comp
L Connector:TestPoint TP17
U 1 1 5D96A6C9
P 5850 3750
F 0 "TP17" V 5850 3950 50  0000 L CNN
F 1 "TestPoint" V 5895 3938 50  0001 L CNN
F 2 "TestPoint:TestPoint_Pad_D1.5mm" H 6050 3750 50  0001 C CNN
F 3 "~" H 6050 3750 50  0001 C CNN
	1    5850 3750
	0    1    1    0   
$EndComp
$Comp
L Connector:TestPoint TP18
U 1 1 5D96A88D
P 5850 3850
F 0 "TP18" V 5850 4050 50  0000 L CNN
F 1 "TestPoint" V 5895 4038 50  0001 L CNN
F 2 "TestPoint:TestPoint_Pad_D1.5mm" H 6050 3850 50  0001 C CNN
F 3 "~" H 6050 3850 50  0001 C CNN
	1    5850 3850
	0    1    1    0   
$EndComp
$Comp
L Connector:TestPoint TP19
U 1 1 5D96AFE1
P 5850 3950
F 0 "TP19" V 5850 4150 50  0000 L CNN
F 1 "TestPoint" V 5895 4138 50  0001 L CNN
F 2 "TestPoint:TestPoint_Pad_D1.5mm" H 6050 3950 50  0001 C CNN
F 3 "~" H 6050 3950 50  0001 C CNN
	1    5850 3950
	0    1    1    0   
$EndComp
$Comp
L Connector:TestPoint TP20
U 1 1 5D96B198
P 5850 4050
F 0 "TP20" V 5850 4250 50  0000 L CNN
F 1 "TestPoint" V 5895 4238 50  0001 L CNN
F 2 "TestPoint:TestPoint_Pad_D1.5mm" H 6050 4050 50  0001 C CNN
F 3 "~" H 6050 4050 50  0001 C CNN
	1    5850 4050
	0    1    1    0   
$EndComp
$Comp
L Connector:TestPoint TP21
U 1 1 5D96B37A
P 5850 4150
F 0 "TP21" V 5850 4350 50  0000 L CNN
F 1 "TestPoint" V 5895 4338 50  0001 L CNN
F 2 "TestPoint:TestPoint_Pad_D1.5mm" H 6050 4150 50  0001 C CNN
F 3 "~" H 6050 4150 50  0001 C CNN
	1    5850 4150
	0    1    1    0   
$EndComp
Wire Wire Line
	5850 3550 5800 3550
Wire Wire Line
	5800 3650 5850 3650
Wire Wire Line
	5800 3750 5850 3750
Wire Wire Line
	5800 3850 5850 3850
Wire Wire Line
	5800 3950 5850 3950
Wire Wire Line
	5800 4050 5850 4050
Wire Wire Line
	5800 4150 5850 4150
Text Notes 800  7050 0    591  ~ 118
DEPRECATED!
Text Notes 1950 4850 0    79   ~ 0
Swapped triac terminals!!!
Text Notes 2550 3600 0    79   ~ 0
Missing pull-up resistors
$EndSCHEMATC
