(export (version D)
  (design
    (source /home/martin/host/mnt/data/elektronika/moje_projekty/smart_power_plug/hw/SMRT_PWR_PLG-01.sch)
    (date "Fri Nov  8 20:23:26 2019")
    (tool "Eeschema 5.1.4-e60b266~84~ubuntu18.04.1")
    (sheet (number 1) (name /) (tstamps /)
      (title_block
        (title)
        (company)
        (rev)
        (date)
        (source SMRT_PWR_PLG-01.sch)
        (comment (number 1) (value ""))
        (comment (number 2) (value ""))
        (comment (number 3) (value ""))
        (comment (number 4) (value "")))))
  (components
    (comp (ref U1)
      (value AMS1117-3.3)
      (footprint Package_TO_SOT_SMD:SOT-223-3_TabPin2)
      (datasheet http://www.advanced-monolithic.com/pdf/ds1117.pdf)
      (libsource (lib Regulator_Linear) (part AMS1117-3.3) (description "1A Low Dropout regulator, positive, 3.3V fixed output, SOT-223"))
      (sheetpath (names /) (tstamps /))
      (tstamp 5D753C0D))
    (comp (ref C3)
      (value 4u7)
      (footprint Capacitor_Tantalum_SMD:CP_EIA-3216-18_Kemet-A_Pad1.58x1.35mm_HandSolder)
      (datasheet ~)
      (libsource (lib Device) (part CP) (description "Polarized capacitor"))
      (sheetpath (names /) (tstamps /))
      (tstamp 5D754703))
    (comp (ref C1)
      (value 100nF)
      (footprint Capacitor_SMD:C_0603_1608Metric_Pad1.05x0.95mm_HandSolder)
      (datasheet ~)
      (libsource (lib Device) (part C) (description "Unpolarized capacitor"))
      (sheetpath (names /) (tstamps /))
      (tstamp 5D754EC0))
    (comp (ref C2)
      (value 100nF)
      (footprint Capacitor_SMD:C_0603_1608Metric_Pad1.05x0.95mm_HandSolder)
      (datasheet ~)
      (libsource (lib Device) (part C) (description "Unpolarized capacitor"))
      (sheetpath (names /) (tstamps /))
      (tstamp 5D755C9B))
    (comp (ref J1)
      (value PWR_5V)
      (footprint Connector_PinHeader_2.54mm:PinHeader_1x02_P2.54mm_Vertical)
      (datasheet ~)
      (libsource (lib Connector_Generic) (part Conn_01x02) (description "Generic connector, single row, 01x02, script generated (kicad-library-utils/schlib/autogen/connector/)"))
      (sheetpath (names /) (tstamps /))
      (tstamp 5D765442))
    (comp (ref C5)
      (value 100nF)
      (footprint Capacitor_SMD:C_0603_1608Metric_Pad1.05x0.95mm_HandSolder)
      (datasheet ~)
      (libsource (lib Device) (part C) (description "Unpolarized capacitor"))
      (sheetpath (names /) (tstamps /))
      (tstamp 5D7693DC))
    (comp (ref C4)
      (value 47uF)
      (footprint Capacitor_SMD:C_1206_3216Metric_Pad1.42x1.75mm_HandSolder)
      (datasheet ~)
      (libsource (lib Device) (part C) (description "Unpolarized capacitor"))
      (sheetpath (names /) (tstamps /))
      (tstamp 5D7697AF))
    (comp (ref R2)
      (value 330R)
      (footprint Resistor_SMD:R_0603_1608Metric_Pad1.05x0.95mm_HandSolder)
      (datasheet ~)
      (libsource (lib Device) (part R) (description Resistor))
      (sheetpath (names /) (tstamps /))
      (tstamp 5D79127E))
    (comp (ref R5)
      (value 330R)
      (footprint Resistor_SMD:R_0603_1608Metric_Pad1.05x0.95mm_HandSolder)
      (datasheet ~)
      (libsource (lib Device) (part R) (description Resistor))
      (sheetpath (names /) (tstamps /))
      (tstamp 5D791539))
    (comp (ref J2)
      (value Programming)
      (footprint Connector_PinSocket_2.54mm:PinSocket_1x05_P2.54mm_Horizontal)
      (datasheet ~)
      (libsource (lib Connector_Generic) (part Conn_01x05) (description "Generic connector, single row, 01x05, script generated (kicad-library-utils/schlib/autogen/connector/)"))
      (sheetpath (names /) (tstamps /))
      (tstamp 5D79780F))
    (comp (ref R4)
      (value 12k)
      (footprint Resistor_SMD:R_0603_1608Metric_Pad1.05x0.95mm_HandSolder)
      (datasheet ~)
      (libsource (lib Device) (part R) (description Resistor))
      (sheetpath (names /) (tstamps /))
      (tstamp 5D79816B))
    (comp (ref R1)
      (value 12k)
      (footprint Resistor_SMD:R_0603_1608Metric_Pad1.05x0.95mm_HandSolder)
      (datasheet ~)
      (libsource (lib Device) (part R) (description Resistor))
      (sheetpath (names /) (tstamps /))
      (tstamp 5D7985EB))
    (comp (ref R8)
      (value 220R/0.5W)
      (footprint Resistor_THT:R_Axial_DIN0207_L6.3mm_D2.5mm_P10.16mm_Horizontal)
      (datasheet ~)
      (libsource (lib Device) (part R) (description Resistor))
      (sheetpath (names /) (tstamps /))
      (tstamp 5D7ADD58))
    (comp (ref R7)
      (value 220R)
      (footprint Resistor_SMD:R_0603_1608Metric_Pad1.05x0.95mm_HandSolder)
      (datasheet ~)
      (libsource (lib Device) (part R) (description Resistor))
      (sheetpath (names /) (tstamps /))
      (tstamp 5D7B1D05))
    (comp (ref J3)
      (value User_Interface)
      (footprint Connector_PinSocket_2.54mm:PinSocket_1x03_P2.54mm_Horizontal)
      (datasheet ~)
      (libsource (lib Connector_Generic) (part Conn_01x03) (description "Generic connector, single row, 01x03, script generated (kicad-library-utils/schlib/autogen/connector/)"))
      (sheetpath (names /) (tstamps /))
      (tstamp 5D7F7676))
    (comp (ref R3)
      (value 330R)
      (footprint Resistor_SMD:R_0603_1608Metric_Pad1.05x0.95mm_HandSolder)
      (datasheet ~)
      (libsource (lib Device) (part R) (description Resistor))
      (sheetpath (names /) (tstamps /))
      (tstamp 5D7F83FB))
    (comp (ref R6)
      (value 330R)
      (footprint Resistor_SMD:R_0603_1608Metric_Pad1.05x0.95mm_HandSolder)
      (datasheet ~)
      (libsource (lib Device) (part R) (description Resistor))
      (sheetpath (names /) (tstamps /))
      (tstamp 5D7F8DB1))
    (comp (ref Q1)
      (value BC817)
      (footprint Package_TO_SOT_SMD:SC-59_Handsoldering)
      (libsource (lib Transistor_BJT) (part BC817) (description "0.8A Ic, 45V Vce, NPN Transistor, SOT-23"))
      (sheetpath (names /) (tstamps /))
      (tstamp 5D81092D))
    (comp (ref Q2)
      (value BC817)
      (footprint Package_TO_SOT_SMD:SC-59_Handsoldering)
      (libsource (lib Transistor_BJT) (part BC817) (description "0.8A Ic, 45V Vce, NPN Transistor, SOT-23"))
      (sheetpath (names /) (tstamps /))
      (tstamp 5D82C928))
    (comp (ref SW1)
      (value manual_sw)
      (footprint Button_Switch_THT:SW_PUSH_6mm_H5mm)
      (datasheet ~)
      (libsource (lib Switch) (part SW_Push) (description "Push button switch, generic, two pins"))
      (sheetpath (names /) (tstamps /))
      (tstamp 5D764B48))
    (comp (ref R9)
      (value 330R)
      (footprint Resistor_SMD:R_0603_1608Metric_Pad1.05x0.95mm_HandSolder)
      (datasheet ~)
      (libsource (lib Device) (part R) (description Resistor))
      (sheetpath (names /) (tstamps /))
      (tstamp 5D7E5CF8))
    (comp (ref R10)
      (value 150R)
      (footprint Resistor_SMD:R_0603_1608Metric_Pad1.05x0.95mm_HandSolder)
      (datasheet ~)
      (libsource (lib Device) (part R) (description Resistor))
      (sheetpath (names /) (tstamps /))
      (tstamp 5D7EBDD7))
    (comp (ref D1)
      (value Blue)
      (footprint LED_SMD:LED_1210_3225Metric_Pad1.42x2.65mm_HandSolder)
      (datasheet ~)
      (libsource (lib Device) (part LED) (description "Light emitting diode"))
      (sheetpath (names /) (tstamps /))
      (tstamp 5D7F0934))
    (comp (ref D2)
      (value Yellow)
      (footprint LED_SMD:LED_1210_3225Metric_Pad1.42x2.65mm_HandSolder)
      (datasheet ~)
      (libsource (lib Device) (part LED) (description "Light emitting diode"))
      (sheetpath (names /) (tstamps /))
      (tstamp 5D7F0F90))
    (comp (ref F1)
      (value Fuse)
      (footprint Fuse:Fuseholder_Cylinder-5x20mm_Schurter_0031_8201_Horizontal_Open)
      (datasheet ~)
      (libsource (lib Device) (part Fuse) (description Fuse))
      (sheetpath (names /) (tstamps /))
      (tstamp 5D7FFA19))
    (comp (ref R11)
      (value 150R)
      (footprint Resistor_SMD:R_0603_1608Metric_Pad1.05x0.95mm_HandSolder)
      (datasheet ~)
      (libsource (lib Device) (part R) (description Resistor))
      (sheetpath (names /) (tstamps /))
      (tstamp 5D811468))
    (comp (ref D3)
      (value Red)
      (footprint LED_SMD:LED_1210_3225Metric_Pad1.42x2.65mm_HandSolder)
      (datasheet ~)
      (libsource (lib Device) (part LED) (description "Light emitting diode"))
      (sheetpath (names /) (tstamps /))
      (tstamp 5D811756))
    (comp (ref Q3)
      (value BTA16-600)
      (footprint Package_TO_SOT_THT:TO-220-3_Vertical)
      (datasheet https://www.rapidonline.com/pdf/47-3240.pdf)
      (libsource (lib Triac_Thyristor) (part BT139-600) (description "16A RMS, 600V Off-State Voltage, 4Q Triac, TO-220"))
      (sheetpath (names /) (tstamps /))
      (tstamp 5D7AA09E))
    (comp (ref J4)
      (value PWR_220V_IN)
      (footprint Connector_Wire:SolderWirePad_1x01_Drill1.2mm)
      (datasheet ~)
      (libsource (lib Connector_Generic) (part Conn_01x01) (description "Generic connector, single row, 01x01, script generated (kicad-library-utils/schlib/autogen/connector/)"))
      (sheetpath (names /) (tstamps /))
      (tstamp 5D8740AD))
    (comp (ref J5)
      (value PWR_220V_OUT)
      (footprint Connector_Wire:SolderWirePad_1x01_Drill1.2mm)
      (datasheet ~)
      (libsource (lib Connector_Generic) (part Conn_01x01) (description "Generic connector, single row, 01x01, script generated (kicad-library-utils/schlib/autogen/connector/)"))
      (sheetpath (names /) (tstamps /))
      (tstamp 5D874695))
    (comp (ref H1)
      (value MountingHole)
      (footprint MountingHole:MountingHole_3.2mm_M3)
      (datasheet ~)
      (libsource (lib Mechanical) (part MountingHole) (description "Mounting Hole without connection"))
      (sheetpath (names /) (tstamps /))
      (tstamp 5D899E96))
    (comp (ref H2)
      (value MountingHole)
      (footprint MountingHole:MountingHole_3.2mm_M3)
      (datasheet ~)
      (libsource (lib Mechanical) (part MountingHole) (description "Mounting Hole without connection"))
      (sheetpath (names /) (tstamps /))
      (tstamp 5D89A8B6))
    (comp (ref H3)
      (value MountingHole)
      (footprint MountingHole:MountingHole_3.2mm_M3)
      (datasheet ~)
      (libsource (lib Mechanical) (part MountingHole) (description "Mounting Hole without connection"))
      (sheetpath (names /) (tstamps /))
      (tstamp 5D89AB74))
    (comp (ref H4)
      (value MountingHole)
      (footprint MountingHole:MountingHole_3.2mm_M3)
      (datasheet ~)
      (libsource (lib Mechanical) (part MountingHole) (description "Mounting Hole without connection"))
      (sheetpath (names /) (tstamps /))
      (tstamp 5D89ADDF))
    (comp (ref J6)
      (value PWR_SW_EN)
      (footprint Connector_PinHeader_2.54mm:PinHeader_1x02_P2.54mm_Vertical)
      (datasheet ~)
      (libsource (lib Connector_Generic) (part Conn_01x02) (description "Generic connector, single row, 01x02, script generated (kicad-library-utils/schlib/autogen/connector/)"))
      (sheetpath (names /) (tstamps /))
      (tstamp 5D8A8402))
    (comp (ref J7)
      (value PWR_SW_EN)
      (footprint Connector_PinSocket_2.54mm:PinSocket_1x02_P2.54mm_Vertical)
      (datasheet ~)
      (libsource (lib Connector_Generic) (part Conn_01x02) (description "Generic connector, single row, 01x02, script generated (kicad-library-utils/schlib/autogen/connector/)"))
      (sheetpath (names /) (tstamps /))
      (tstamp 5D8B32BC))
    (comp (ref TP9)
      (value TestPoint)
      (footprint TestPoint:TestPoint_Pad_D1.5mm)
      (datasheet ~)
      (libsource (lib Connector) (part TestPoint) (description "test point"))
      (sheetpath (names /) (tstamps /))
      (tstamp 5D91B66F))
    (comp (ref TP10)
      (value TestPoint)
      (footprint TestPoint:TestPoint_Pad_D1.5mm)
      (datasheet ~)
      (libsource (lib Connector) (part TestPoint) (description "test point"))
      (sheetpath (names /) (tstamps /))
      (tstamp 5D91FEA8))
    (comp (ref TP11)
      (value TestPoint)
      (footprint TestPoint:TestPoint_Pad_D1.5mm)
      (datasheet ~)
      (libsource (lib Connector) (part TestPoint) (description "test point"))
      (sheetpath (names /) (tstamps /))
      (tstamp 5D923ADE))
    (comp (ref TP12)
      (value TestPoint)
      (footprint TestPoint:TestPoint_Pad_D1.5mm)
      (datasheet ~)
      (libsource (lib Connector) (part TestPoint) (description "test point"))
      (sheetpath (names /) (tstamps /))
      (tstamp 5D9274CF))
    (comp (ref U3)
      (value ESP32-WROOM-32)
      (footprint RF_Module:ESP32-WROOM-32)
      (datasheet https://www.espressif.com/sites/default/files/documentation/esp32-wroom-32_datasheet_en.pdf)
      (libsource (lib RF_Module) (part ESP32-WROOM-32) (description "RF Module, ESP32-D0WDQ6 SoC, Wi-Fi 802.11b/g/n, Bluetooth, BLE, 32-bit, 2.7-3.6V, onboard antenna, SMD"))
      (sheetpath (names /) (tstamps /))
      (tstamp 5D75383F))
    (comp (ref TP3)
      (value TestPoint)
      (footprint TestPoint:TestPoint_Pad_D1.5mm)
      (datasheet ~)
      (libsource (lib Connector) (part TestPoint) (description "test point"))
      (sheetpath (names /) (tstamps /))
      (tstamp 5D931A9C))
    (comp (ref TP4)
      (value TestPoint)
      (footprint TestPoint:TestPoint_Pad_D1.5mm)
      (datasheet ~)
      (libsource (lib Connector) (part TestPoint) (description "test point"))
      (sheetpath (names /) (tstamps /))
      (tstamp 5D93255B))
    (comp (ref TP5)
      (value TestPoint)
      (footprint TestPoint:TestPoint_Pad_D1.5mm)
      (datasheet ~)
      (libsource (lib Connector) (part TestPoint) (description "test point"))
      (sheetpath (names /) (tstamps /))
      (tstamp 5D9327AC))
    (comp (ref TP6)
      (value TestPoint)
      (footprint TestPoint:TestPoint_Pad_D1.5mm)
      (datasheet ~)
      (libsource (lib Connector) (part TestPoint) (description "test point"))
      (sheetpath (names /) (tstamps /))
      (tstamp 5D93350F))
    (comp (ref TP7)
      (value TestPoint)
      (footprint TestPoint:TestPoint_Pad_D1.5mm)
      (datasheet ~)
      (libsource (lib Connector) (part TestPoint) (description "test point"))
      (sheetpath (names /) (tstamps /))
      (tstamp 5D9337D0))
    (comp (ref TP8)
      (value TestPoint)
      (footprint TestPoint:TestPoint_Pad_D1.5mm)
      (datasheet ~)
      (libsource (lib Connector) (part TestPoint) (description "test point"))
      (sheetpath (names /) (tstamps /))
      (tstamp 5D9342B6))
    (comp (ref TP13)
      (value TestPoint)
      (footprint TestPoint:TestPoint_Pad_D1.5mm)
      (datasheet ~)
      (libsource (lib Connector) (part TestPoint) (description "test point"))
      (sheetpath (names /) (tstamps /))
      (tstamp 5D94DCFC))
    (comp (ref TP14)
      (value TestPoint)
      (footprint TestPoint:TestPoint_Pad_D1.5mm)
      (datasheet ~)
      (libsource (lib Connector) (part TestPoint) (description "test point"))
      (sheetpath (names /) (tstamps /))
      (tstamp 5D94E328))
    (comp (ref TP1)
      (value TestPoint)
      (footprint TestPoint:TestPoint_Pad_D1.5mm)
      (datasheet ~)
      (libsource (lib Connector) (part TestPoint) (description "test point"))
      (sheetpath (names /) (tstamps /))
      (tstamp 5D95C555))
    (comp (ref TP2)
      (value TestPoint)
      (footprint TestPoint:TestPoint_Pad_D1.5mm)
      (datasheet ~)
      (libsource (lib Connector) (part TestPoint) (description "test point"))
      (sheetpath (names /) (tstamps /))
      (tstamp 5D95CA02))
    (comp (ref TP15)
      (value TestPoint)
      (footprint TestPoint:TestPoint_Pad_D1.5mm)
      (datasheet ~)
      (libsource (lib Connector) (part TestPoint) (description "test point"))
      (sheetpath (names /) (tstamps /))
      (tstamp 5D96A2E8))
    (comp (ref TP16)
      (value TestPoint)
      (footprint TestPoint:TestPoint_Pad_D1.5mm)
      (datasheet ~)
      (libsource (lib Connector) (part TestPoint) (description "test point"))
      (sheetpath (names /) (tstamps /))
      (tstamp 5D96A480))
    (comp (ref TP17)
      (value TestPoint)
      (footprint TestPoint:TestPoint_Pad_D1.5mm)
      (datasheet ~)
      (libsource (lib Connector) (part TestPoint) (description "test point"))
      (sheetpath (names /) (tstamps /))
      (tstamp 5D96A6C9))
    (comp (ref TP18)
      (value TestPoint)
      (footprint TestPoint:TestPoint_Pad_D1.5mm)
      (datasheet ~)
      (libsource (lib Connector) (part TestPoint) (description "test point"))
      (sheetpath (names /) (tstamps /))
      (tstamp 5D96A88D))
    (comp (ref TP19)
      (value TestPoint)
      (footprint TestPoint:TestPoint_Pad_D1.5mm)
      (datasheet ~)
      (libsource (lib Connector) (part TestPoint) (description "test point"))
      (sheetpath (names /) (tstamps /))
      (tstamp 5D96AFE1))
    (comp (ref TP20)
      (value TestPoint)
      (footprint TestPoint:TestPoint_Pad_D1.5mm)
      (datasheet ~)
      (libsource (lib Connector) (part TestPoint) (description "test point"))
      (sheetpath (names /) (tstamps /))
      (tstamp 5D96B198))
    (comp (ref TP21)
      (value TestPoint)
      (footprint TestPoint:TestPoint_Pad_D1.5mm)
      (datasheet ~)
      (libsource (lib Connector) (part TestPoint) (description "test point"))
      (sheetpath (names /) (tstamps /))
      (tstamp 5D96B37A))
    (comp (ref U2)
      (value MOC3042M)
      (footprint Package_DIP:DIP-6_W7.62mm_LongPads)
      (datasheet http://www.fairchildsemi.com/ds/MO/MOC3031M.pdf)
      (libsource (lib Relay_SolidState) (part MOC3042M) (description "Zero Cross Opto-Triac, Vdrm 400V, Ift 10mA, DIP6"))
      (sheetpath (names /) (tstamps /))
      (tstamp 5D7AAF9D))
    (comp (ref R12)
      (value 47k)
      (footprint Resistor_SMD:R_0603_1608Metric_Pad1.05x0.95mm_HandSolder)
      (datasheet ~)
      (libsource (lib Device) (part R) (description Resistor))
      (sheetpath (names /) (tstamps /))
      (tstamp 5DBFF55F))
    (comp (ref R13)
      (value 47k)
      (footprint Resistor_SMD:R_0603_1608Metric_Pad1.05x0.95mm_HandSolder)
      (datasheet ~)
      (libsource (lib Device) (part R) (description Resistor))
      (sheetpath (names /) (tstamps /))
      (tstamp 5DC00506))
    (comp (ref C6)
      (value 1uF)
      (footprint Capacitor_SMD:C_0603_1608Metric_Pad1.05x0.95mm_HandSolder)
      (datasheet ~)
      (libsource (lib Device) (part C) (description "Unpolarized capacitor"))
      (sheetpath (names /) (tstamps /))
      (tstamp 5DC6021F)))
  (libparts
    (libpart (lib Connector) (part TestPoint)
      (description "test point")
      (docs ~)
      (footprints
        (fp Pin*)
        (fp Test*))
      (fields
        (field (name Reference) TP)
        (field (name Value) TestPoint))
      (pins
        (pin (num 1) (name 1) (type passive))))
    (libpart (lib Connector_Generic) (part Conn_01x01)
      (description "Generic connector, single row, 01x01, script generated (kicad-library-utils/schlib/autogen/connector/)")
      (docs ~)
      (footprints
        (fp Connector*:*_1x??_*))
      (fields
        (field (name Reference) J)
        (field (name Value) Conn_01x01))
      (pins
        (pin (num 1) (name Pin_1) (type passive))))
    (libpart (lib Connector_Generic) (part Conn_01x02)
      (description "Generic connector, single row, 01x02, script generated (kicad-library-utils/schlib/autogen/connector/)")
      (docs ~)
      (footprints
        (fp Connector*:*_1x??_*))
      (fields
        (field (name Reference) J)
        (field (name Value) Conn_01x02))
      (pins
        (pin (num 1) (name Pin_1) (type passive))
        (pin (num 2) (name Pin_2) (type passive))))
    (libpart (lib Connector_Generic) (part Conn_01x03)
      (description "Generic connector, single row, 01x03, script generated (kicad-library-utils/schlib/autogen/connector/)")
      (docs ~)
      (footprints
        (fp Connector*:*_1x??_*))
      (fields
        (field (name Reference) J)
        (field (name Value) Conn_01x03))
      (pins
        (pin (num 1) (name Pin_1) (type passive))
        (pin (num 2) (name Pin_2) (type passive))
        (pin (num 3) (name Pin_3) (type passive))))
    (libpart (lib Connector_Generic) (part Conn_01x05)
      (description "Generic connector, single row, 01x05, script generated (kicad-library-utils/schlib/autogen/connector/)")
      (docs ~)
      (footprints
        (fp Connector*:*_1x??_*))
      (fields
        (field (name Reference) J)
        (field (name Value) Conn_01x05))
      (pins
        (pin (num 1) (name Pin_1) (type passive))
        (pin (num 2) (name Pin_2) (type passive))
        (pin (num 3) (name Pin_3) (type passive))
        (pin (num 4) (name Pin_4) (type passive))
        (pin (num 5) (name Pin_5) (type passive))))
    (libpart (lib Device) (part C)
      (description "Unpolarized capacitor")
      (docs ~)
      (footprints
        (fp C_*))
      (fields
        (field (name Reference) C)
        (field (name Value) C))
      (pins
        (pin (num 1) (name ~) (type passive))
        (pin (num 2) (name ~) (type passive))))
    (libpart (lib Device) (part CP)
      (description "Polarized capacitor")
      (docs ~)
      (footprints
        (fp CP_*))
      (fields
        (field (name Reference) C)
        (field (name Value) CP))
      (pins
        (pin (num 1) (name ~) (type passive))
        (pin (num 2) (name ~) (type passive))))
    (libpart (lib Device) (part Fuse)
      (description Fuse)
      (docs ~)
      (footprints
        (fp *Fuse*))
      (fields
        (field (name Reference) F)
        (field (name Value) Fuse))
      (pins
        (pin (num 1) (name ~) (type passive))
        (pin (num 2) (name ~) (type passive))))
    (libpart (lib Device) (part LED)
      (description "Light emitting diode")
      (docs ~)
      (footprints
        (fp LED*)
        (fp LED_SMD:*)
        (fp LED_THT:*))
      (fields
        (field (name Reference) D)
        (field (name Value) LED))
      (pins
        (pin (num 1) (name K) (type passive))
        (pin (num 2) (name A) (type passive))))
    (libpart (lib Device) (part R)
      (description Resistor)
      (docs ~)
      (footprints
        (fp R_*))
      (fields
        (field (name Reference) R)
        (field (name Value) R))
      (pins
        (pin (num 1) (name ~) (type passive))
        (pin (num 2) (name ~) (type passive))))
    (libpart (lib Mechanical) (part MountingHole)
      (description "Mounting Hole without connection")
      (docs ~)
      (footprints
        (fp MountingHole*))
      (fields
        (field (name Reference) H)
        (field (name Value) MountingHole)))
    (libpart (lib RF_Module) (part ESP32-WROOM-32)
      (aliases
        (alias ESP32-WROOM-32D))
      (description "RF Module, ESP32-D0WDQ6 SoC, Wi-Fi 802.11b/g/n, Bluetooth, BLE, 32-bit, 2.7-3.6V, onboard antenna, SMD")
      (docs https://www.espressif.com/sites/default/files/documentation/esp32-wroom-32_datasheet_en.pdf)
      (footprints
        (fp ESP32?WROOM?32*))
      (fields
        (field (name Reference) U)
        (field (name Value) ESP32-WROOM-32)
        (field (name Footprint) RF_Module:ESP32-WROOM-32))
      (pins
        (pin (num 1) (name GND) (type power_in))
        (pin (num 2) (name VDD) (type power_in))
        (pin (num 3) (name EN) (type input))
        (pin (num 4) (name SENSOR_VP) (type input))
        (pin (num 5) (name SENSOR_VN) (type input))
        (pin (num 6) (name IO34) (type input))
        (pin (num 7) (name IO35) (type input))
        (pin (num 8) (name IO32) (type BiDi))
        (pin (num 9) (name IO33) (type BiDi))
        (pin (num 10) (name IO25) (type BiDi))
        (pin (num 11) (name IO26) (type BiDi))
        (pin (num 12) (name IO27) (type BiDi))
        (pin (num 13) (name IO14) (type BiDi))
        (pin (num 14) (name IO12) (type BiDi))
        (pin (num 15) (name GND) (type passive))
        (pin (num 16) (name IO13) (type BiDi))
        (pin (num 17) (name SHD/SD2) (type BiDi))
        (pin (num 18) (name SWP/SD3) (type BiDi))
        (pin (num 19) (name SCS/CMD) (type BiDi))
        (pin (num 20) (name SCK/CLK) (type BiDi))
        (pin (num 21) (name SDO/SD0) (type BiDi))
        (pin (num 22) (name SDI/SD1) (type BiDi))
        (pin (num 23) (name IO15) (type BiDi))
        (pin (num 24) (name IO2) (type BiDi))
        (pin (num 25) (name IO0) (type BiDi))
        (pin (num 26) (name IO4) (type BiDi))
        (pin (num 27) (name IO16) (type BiDi))
        (pin (num 28) (name IO17) (type BiDi))
        (pin (num 29) (name IO5) (type BiDi))
        (pin (num 30) (name IO18) (type BiDi))
        (pin (num 31) (name IO19) (type BiDi))
        (pin (num 32) (name NC) (type NotConnected))
        (pin (num 33) (name IO21) (type BiDi))
        (pin (num 34) (name RXD0/IO3) (type BiDi))
        (pin (num 35) (name TXD0/IO1) (type BiDi))
        (pin (num 36) (name IO22) (type BiDi))
        (pin (num 37) (name IO23) (type BiDi))
        (pin (num 38) (name GND) (type passive))))
    (libpart (lib Regulator_Linear) (part AP1117-15)
      (aliases
        (alias AP1117-18)
        (alias AP1117-25)
        (alias AP1117-33)
        (alias AP1117-50)
        (alias LD1117S33TR_SOT223)
        (alias LD1117S12TR_SOT223)
        (alias LD1117S18TR_SOT223)
        (alias LD1117S25TR_SOT223)
        (alias LD1117S50TR_SOT223)
        (alias NCP1117-12_SOT223)
        (alias NCP1117-1.5_SOT223)
        (alias NCP1117-1.8_SOT223)
        (alias NCP1117-2.0_SOT223)
        (alias NCP1117-2.5_SOT223)
        (alias NCP1117-2.85_SOT223)
        (alias NCP1117-3.3_SOT223)
        (alias NCP1117-5.0_SOT223)
        (alias AMS1117-1.5)
        (alias AMS1117-1.8)
        (alias AMS1117-2.5)
        (alias AMS1117-2.85)
        (alias AMS1117-3.3)
        (alias AMS1117-5.0))
      (description "1A Low Dropout regulator, positive, 1.5V fixed output, SOT-223")
      (docs http://www.diodes.com/datasheets/AP1117.pdf)
      (footprints
        (fp SOT?223*TabPin2*))
      (fields
        (field (name Reference) U)
        (field (name Value) AP1117-15)
        (field (name Footprint) Package_TO_SOT_SMD:SOT-223-3_TabPin2))
      (pins
        (pin (num 1) (name GND) (type power_in))
        (pin (num 2) (name VO) (type power_out))
        (pin (num 3) (name VI) (type power_in))))
    (libpart (lib Relay_SolidState) (part MOC3031M)
      (aliases
        (alias MOC3032M)
        (alias MOC3033M)
        (alias MOC3041M)
        (alias MOC3042M)
        (alias MOC3043M)
        (alias MOC3081M)
        (alias MOC3082M)
        (alias MOC3083M)
        (alias MOC3061M)
        (alias MOC3062M)
        (alias MOC3063M)
        (alias MOC3162M)
        (alias MOC3163M))
      (description "Zero Cross Opto-Triac, Vdrm 250V, Ift 15mA, DIP6")
      (docs http://www.fairchildsemi.com/ds/MO/MOC3031M.pdf)
      (footprints
        (fp DIP*W7.62mm*)
        (fp SMDIP*W9.53mm*)
        (fp DIP*W10.16mm*))
      (fields
        (field (name Reference) U)
        (field (name Value) MOC3031M))
      (pins
        (pin (num 1) (name ~) (type passive))
        (pin (num 2) (name ~) (type passive))
        (pin (num 3) (name NC) (type NotConnected))
        (pin (num 4) (name ~) (type passive))
        (pin (num 5) (name NC) (type NotConnected))
        (pin (num 6) (name ~) (type passive))))
    (libpart (lib Switch) (part SW_Push)
      (description "Push button switch, generic, two pins")
      (docs ~)
      (fields
        (field (name Reference) SW)
        (field (name Value) SW_Push))
      (pins
        (pin (num 1) (name 1) (type passive))
        (pin (num 2) (name 2) (type passive))))
    (libpart (lib Transistor_BJT) (part BC817)
      (aliases
        (alias BC818)
        (alias BC847)
        (alias BC848)
        (alias BC849)
        (alias BC850)
        (alias MMBT3904)
        (alias MMBT5550L)
        (alias MMBT5551L))
      (description "0.8A Ic, 45V Vce, NPN Transistor, SOT-23")
      (docs http://www.fairchildsemi.com/ds/BC/BC817.pdf)
      (footprints
        (fp SOT?23*))
      (fields
        (field (name Reference) Q)
        (field (name Value) BC817)
        (field (name Footprint) Package_TO_SOT_SMD:SOT-23))
      (pins
        (pin (num 1) (name B) (type input))
        (pin (num 2) (name E) (type passive))
        (pin (num 3) (name C) (type passive))))
    (libpart (lib Triac_Thyristor) (part TIC226)
      (aliases
        (alias TIC206)
        (alias BT138-600)
        (alias BT138-800)
        (alias TIC216)
        (alias BT136-500)
        (alias BT136-600)
        (alias BT136-800)
        (alias BT139-600))
      (description "8A RMS, 400-800V Off-State Voltage, Triac, TO-220")
      (docs http://pdf.datasheetcatalog.com/datasheet/PowerInnovations/mXuqxvy.pdf)
      (footprints
        (fp TO?220*))
      (fields
        (field (name Reference) Q)
        (field (name Value) TIC226)
        (field (name Footprint) Package_TO_SOT_THT:TO-220-3_Vertical))
      (pins
        (pin (num 1) (name A1) (type passive))
        (pin (num 2) (name A2) (type passive))
        (pin (num 3) (name G) (type input)))))
  (libraries
    (library (logical Connector)
      (uri /usr/share/kicad/library/Connector.lib))
    (library (logical Connector_Generic)
      (uri /usr/share/kicad/library/Connector_Generic.lib))
    (library (logical Device)
      (uri /usr/share/kicad/library/Device.lib))
    (library (logical Mechanical)
      (uri /usr/share/kicad/library/Mechanical.lib))
    (library (logical RF_Module)
      (uri /usr/share/kicad/library/RF_Module.lib))
    (library (logical Regulator_Linear)
      (uri /usr/share/kicad/library/Regulator_Linear.lib))
    (library (logical Relay_SolidState)
      (uri /usr/share/kicad/library/Relay_SolidState.lib))
    (library (logical Switch)
      (uri /usr/share/kicad/library/Switch.lib))
    (library (logical Transistor_BJT)
      (uri /usr/share/kicad/library/Transistor_BJT.lib))
    (library (logical Triac_Thyristor)
      (uri /usr/share/kicad/library/Triac_Thyristor.lib)))
  (nets
    (net (code 1) (name "Net-(TP9-Pad1)")
      (node (ref TP9) (pin 1))
      (node (ref U3) (pin 26)))
    (net (code 2) (name "Net-(TP16-Pad1)")
      (node (ref U3) (pin 11))
      (node (ref TP16) (pin 1)))
    (net (code 3) (name "Net-(TP15-Pad1)")
      (node (ref U3) (pin 10))
      (node (ref TP15) (pin 1)))
    (net (code 4) (name "Net-(TP12-Pad1)")
      (node (ref TP12) (pin 1))
      (node (ref U3) (pin 13)))
    (net (code 5) (name "Net-(TP11-Pad1)")
      (node (ref TP11) (pin 1))
      (node (ref U3) (pin 16)))
    (net (code 6) (name "Net-(TP10-Pad1)")
      (node (ref U3) (pin 14))
      (node (ref TP10) (pin 1)))
    (net (code 8) (name "Net-(U3-Pad23)")
      (node (ref U3) (pin 23)))
    (net (code 9) (name "Net-(U3-Pad32)")
      (node (ref U3) (pin 32)))
    (net (code 10) (name "Net-(TP4-Pad1)")
      (node (ref U3) (pin 22))
      (node (ref TP4) (pin 1)))
    (net (code 11) (name "Net-(TP7-Pad1)")
      (node (ref U3) (pin 20))
      (node (ref TP7) (pin 1)))
    (net (code 12) (name "Net-(TP8-Pad1)")
      (node (ref U3) (pin 19))
      (node (ref TP8) (pin 1)))
    (net (code 13) (name "Net-(TP6-Pad1)")
      (node (ref U3) (pin 18))
      (node (ref TP6) (pin 1)))
    (net (code 14) (name "Net-(TP5-Pad1)")
      (node (ref U3) (pin 17))
      (node (ref TP5) (pin 1)))
    (net (code 15) (name /BTN_LED_BTN_PRESSED)
      (node (ref U3) (pin 33))
      (node (ref R11) (pin 2)))
    (net (code 16) (name GND)
      (node (ref U3) (pin 38))
      (node (ref C6) (pin 2))
      (node (ref SW1) (pin 2))
      (node (ref D2) (pin 1))
      (node (ref D1) (pin 1))
      (node (ref J2) (pin 1))
      (node (ref C2) (pin 2))
      (node (ref C1) (pin 2))
      (node (ref C3) (pin 2))
      (node (ref J1) (pin 1))
      (node (ref C5) (pin 2))
      (node (ref C4) (pin 2))
      (node (ref U1) (pin 1))
      (node (ref J3) (pin 1))
      (node (ref U3) (pin 15))
      (node (ref U3) (pin 1))
      (node (ref J7) (pin 2))
      (node (ref D3) (pin 1)))
    (net (code 17) (name "Net-(D3-Pad2)")
      (node (ref D3) (pin 2))
      (node (ref R11) (pin 1)))
    (net (code 18) (name "Net-(J6-Pad2)")
      (node (ref J6) (pin 2))
      (node (ref R7) (pin 2)))
    (net (code 19) (name "Net-(J6-Pad1)")
      (node (ref U2) (pin 2))
      (node (ref J6) (pin 1)))
    (net (code 20) (name /LIN_FUSED)
      (node (ref Q3) (pin 2))
      (node (ref R8) (pin 2))
      (node (ref F1) (pin 1)))
    (net (code 21) (name "Net-(Q3-Pad3)")
      (node (ref Q3) (pin 3))
      (node (ref U2) (pin 4)))
    (net (code 22) (name /BOOT)
      (node (ref Q2) (pin 3))
      (node (ref R13) (pin 2))
      (node (ref U3) (pin 25)))
    (net (code 23) (name +3V3)
      (node (ref U1) (pin 2))
      (node (ref C3) (pin 1))
      (node (ref R12) (pin 2))
      (node (ref C2) (pin 1))
      (node (ref R13) (pin 1))
      (node (ref C4) (pin 1))
      (node (ref C5) (pin 1))
      (node (ref U3) (pin 2)))
    (net (code 24) (name "Net-(R8-Pad1)")
      (node (ref R8) (pin 1))
      (node (ref U2) (pin 6)))
    (net (code 25) (name "Net-(U2-Pad5)")
      (node (ref U2) (pin 5)))
    (net (code 26) (name "Net-(U2-Pad3)")
      (node (ref U2) (pin 3)))
    (net (code 27) (name "Net-(R7-Pad1)")
      (node (ref R7) (pin 1))
      (node (ref U2) (pin 1)))
    (net (code 28) (name "Net-(Q1-Pad1)")
      (node (ref Q1) (pin 1))
      (node (ref R4) (pin 1)))
    (net (code 29) (name "Net-(Q2-Pad1)")
      (node (ref R1) (pin 1))
      (node (ref Q2) (pin 1)))
    (net (code 30) (name "Net-(TP21-Pad1)")
      (node (ref TP21) (pin 1))
      (node (ref U3) (pin 7)))
    (net (code 31) (name "Net-(TP19-Pad1)")
      (node (ref TP19) (pin 1))
      (node (ref U3) (pin 9)))
    (net (code 32) (name "Net-(TP3-Pad1)")
      (node (ref TP3) (pin 1))
      (node (ref U3) (pin 21)))
    (net (code 33) (name "Net-(TP18-Pad1)")
      (node (ref U3) (pin 8))
      (node (ref TP18) (pin 1)))
    (net (code 34) (name "Net-(TP20-Pad1)")
      (node (ref U3) (pin 6))
      (node (ref TP20) (pin 1)))
    (net (code 35) (name "Net-(TP2-Pad1)")
      (node (ref TP2) (pin 1))
      (node (ref U3) (pin 5)))
    (net (code 36) (name "Net-(TP1-Pad1)")
      (node (ref TP1) (pin 1))
      (node (ref U3) (pin 4)))
    (net (code 37) (name "Net-(TP14-Pad1)")
      (node (ref U3) (pin 37))
      (node (ref TP14) (pin 1)))
    (net (code 38) (name "Net-(TP13-Pad1)")
      (node (ref TP13) (pin 1))
      (node (ref U3) (pin 36)))
    (net (code 39) (name "Net-(TP17-Pad1)")
      (node (ref U3) (pin 12))
      (node (ref TP17) (pin 1)))
    (net (code 40) (name "Net-(D2-Pad2)")
      (node (ref R10) (pin 1))
      (node (ref D2) (pin 2)))
    (net (code 41) (name /TXD0)
      (node (ref R2) (pin 1))
      (node (ref U3) (pin 35)))
    (net (code 42) (name "Net-(J2-Pad3)")
      (node (ref J2) (pin 3))
      (node (ref R2) (pin 2)))
    (net (code 43) (name "Net-(J2-Pad2)")
      (node (ref J2) (pin 2))
      (node (ref R5) (pin 2)))
    (net (code 44) (name /RXD0)
      (node (ref R5) (pin 1))
      (node (ref U3) (pin 34)))
    (net (code 45) (name +5V)
      (node (ref J1) (pin 2))
      (node (ref U1) (pin 3))
      (node (ref C1) (pin 1)))
    (net (code 46) (name /RTS)
      (node (ref J2) (pin 5))
      (node (ref Q1) (pin 2))
      (node (ref R1) (pin 2)))
    (net (code 47) (name /DTR)
      (node (ref R4) (pin 2))
      (node (ref Q2) (pin 2))
      (node (ref J2) (pin 4)))
    (net (code 48) (name /EN)
      (node (ref Q1) (pin 3))
      (node (ref U3) (pin 3))
      (node (ref C6) (pin 1))
      (node (ref R12) (pin 1)))
    (net (code 49) (name "Net-(D1-Pad2)")
      (node (ref D1) (pin 2))
      (node (ref R9) (pin 1)))
    (net (code 50) (name /BTN_LED_MANUAL_ON)
      (node (ref U3) (pin 31))
      (node (ref R10) (pin 2)))
    (net (code 51) (name /BTN_LED_BT_ON)
      (node (ref U3) (pin 30))
      (node (ref R9) (pin 2)))
    (net (code 52) (name /BTN_MANUAL_SWITCH)
      (node (ref SW1) (pin 1))
      (node (ref U3) (pin 29)))
    (net (code 53) (name /GPIO_POWER_SWITCH)
      (node (ref U3) (pin 24))
      (node (ref J7) (pin 1)))
    (net (code 54) (name /LIN)
      (node (ref F1) (pin 2))
      (node (ref J4) (pin 1)))
    (net (code 55) (name /LOUT)
      (node (ref J5) (pin 1))
      (node (ref Q3) (pin 1)))
    (net (code 56) (name "Net-(J3-Pad2)")
      (node (ref J3) (pin 2))
      (node (ref R6) (pin 2)))
    (net (code 57) (name /UI_TXD_PIN)
      (node (ref R3) (pin 1))
      (node (ref U3) (pin 28)))
    (net (code 58) (name /UI_RXD_PIN)
      (node (ref U3) (pin 27))
      (node (ref R6) (pin 1)))
    (net (code 59) (name "Net-(J3-Pad3)")
      (node (ref R3) (pin 2))
      (node (ref J3) (pin 3)))))