EESchema Schematic File Version 4
EELAYER 30 0
EELAYER END
$Descr A4 11693 8268
encoding utf-8
Sheet 1 1
Title ""
Date ""
Rev ""
Comp ""
Comment1 ""
Comment2 ""
Comment3 ""
Comment4 ""
$EndDescr
$Comp
L Regulator_Linear:AMS1117-3.3 U1
U 1 1 5D753C0D
P 2350 1700
F 0 "U1" H 2350 1942 50  0000 C CNN
F 1 "AMS1117-3.3" H 2350 1851 50  0000 C CNN
F 2 "Package_TO_SOT_SMD:SOT-223-3_TabPin2" H 2350 1900 50  0001 C CNN
F 3 "http://www.advanced-monolithic.com/pdf/ds1117.pdf" H 2450 1450 50  0001 C CNN
	1    2350 1700
	1    0    0    -1  
$EndComp
$Comp
L Device:CP C3
U 1 1 5D754703
P 2950 1900
F 0 "C3" H 3068 1946 50  0000 L CNN
F 1 "4u7" H 3068 1855 50  0000 L CNN
F 2 "Capacitor_Tantalum_SMD:CP_EIA-3216-18_Kemet-A_Pad1.58x1.35mm_HandSolder" H 2988 1750 50  0001 C CNN
F 3 "~" H 2950 1900 50  0001 C CNN
	1    2950 1900
	1    0    0    -1  
$EndComp
$Comp
L Device:C C1
U 1 1 5D754EC0
P 2000 1900
F 0 "C1" H 1750 1900 50  0000 L CNN
F 1 "100nF" H 1750 1800 50  0000 L CNN
F 2 "Capacitor_SMD:C_0603_1608Metric_Pad1.05x0.95mm_HandSolder" H 2038 1750 50  0001 C CNN
F 3 "~" H 2000 1900 50  0001 C CNN
	1    2000 1900
	1    0    0    -1  
$EndComp
$Comp
L Device:C C2
U 1 1 5D755C9B
P 2700 1900
F 0 "C2" H 2700 2000 50  0000 L CNN
F 1 "100nF" H 2450 1800 50  0000 L CNN
F 2 "Capacitor_SMD:C_0603_1608Metric_Pad1.05x0.95mm_HandSolder" H 2738 1750 50  0001 C CNN
F 3 "~" H 2700 1900 50  0001 C CNN
	1    2700 1900
	1    0    0    -1  
$EndComp
$Comp
L power:GND #PWR06
U 1 1 5D75B329
P 2350 2150
F 0 "#PWR06" H 2350 1900 50  0001 C CNN
F 1 "GND" H 2355 1977 50  0000 C CNN
F 2 "" H 2350 2150 50  0001 C CNN
F 3 "" H 2350 2150 50  0001 C CNN
	1    2350 2150
	1    0    0    -1  
$EndComp
Wire Wire Line
	2000 2050 2000 2100
Wire Wire Line
	2000 2100 2350 2100
Wire Wire Line
	2950 2100 2950 2050
Wire Wire Line
	2700 2050 2700 2100
Connection ~ 2700 2100
Wire Wire Line
	2700 2100 2950 2100
Wire Wire Line
	2350 2000 2350 2100
Connection ~ 2350 2100
Wire Wire Line
	2350 2100 2700 2100
Wire Wire Line
	2350 2100 2350 2150
Wire Wire Line
	2050 1700 2000 1700
Wire Wire Line
	2000 1700 2000 1750
Wire Wire Line
	2650 1700 2700 1700
Wire Wire Line
	2700 1700 2700 1750
Wire Wire Line
	2700 1700 2950 1700
Wire Wire Line
	2950 1700 2950 1750
Connection ~ 2700 1700
$Comp
L power:+3V3 #PWR08
U 1 1 5D75D416
P 3000 1650
F 0 "#PWR08" H 3000 1500 50  0001 C CNN
F 1 "+3V3" H 3015 1823 50  0000 C CNN
F 2 "" H 3000 1650 50  0001 C CNN
F 3 "" H 3000 1650 50  0001 C CNN
	1    3000 1650
	1    0    0    -1  
$EndComp
Wire Wire Line
	3000 1650 3000 1700
Wire Wire Line
	3000 1700 2950 1700
Connection ~ 2950 1700
$Comp
L power:+5V #PWR05
U 1 1 5D75E8B0
P 1800 1650
F 0 "#PWR05" H 1800 1500 50  0001 C CNN
F 1 "+5V" H 1815 1823 50  0000 C CNN
F 2 "" H 1800 1650 50  0001 C CNN
F 3 "" H 1800 1650 50  0001 C CNN
	1    1800 1650
	1    0    0    -1  
$EndComp
Wire Wire Line
	1800 1650 1800 1700
Wire Wire Line
	1800 1700 2000 1700
Connection ~ 2000 1700
$Comp
L Connector_Generic:Conn_01x02 J1
U 1 1 5D765442
P 1050 1950
F 0 "J1" H 1050 1750 50  0000 C CNN
F 1 "PWR_5V" V 1150 1900 50  0000 C CNN
F 2 "Connector_PinHeader_2.54mm:PinHeader_1x02_P2.54mm_Vertical" H 1050 1950 50  0001 C CNN
F 3 "~" H 1050 1950 50  0001 C CNN
	1    1050 1950
	-1   0    0    1   
$EndComp
$Comp
L power:+5V #PWR03
U 1 1 5D766272
P 1450 1650
F 0 "#PWR03" H 1450 1500 50  0001 C CNN
F 1 "+5V" H 1465 1823 50  0000 C CNN
F 2 "" H 1450 1650 50  0001 C CNN
F 3 "" H 1450 1650 50  0001 C CNN
	1    1450 1650
	1    0    0    -1  
$EndComp
Wire Wire Line
	1450 1650 1450 1850
Wire Wire Line
	1450 1850 1300 1850
$Comp
L power:GND #PWR04
U 1 1 5D766A71
P 1450 2150
F 0 "#PWR04" H 1450 1900 50  0001 C CNN
F 1 "GND" H 1455 1977 50  0000 C CNN
F 2 "" H 1450 2150 50  0001 C CNN
F 3 "" H 1450 2150 50  0001 C CNN
	1    1450 2150
	1    0    0    -1  
$EndComp
Wire Wire Line
	1450 2150 1450 1950
Wire Wire Line
	1450 1950 1300 1950
$Comp
L Device:C C5
U 1 1 5D7693DC
P 7100 1400
F 0 "C5" V 7050 1300 50  0000 C CNN
F 1 "100nF" V 7150 1200 50  0000 C CNN
F 2 "Capacitor_SMD:C_0603_1608Metric_Pad1.05x0.95mm_HandSolder" H 7138 1250 50  0001 C CNN
F 3 "~" H 7100 1400 50  0001 C CNN
	1    7100 1400
	0    1    1    0   
$EndComp
$Comp
L Device:C C4
U 1 1 5D7697AF
P 7100 1200
F 0 "C4" V 7050 1100 50  0000 C CNN
F 1 "47uF" V 7150 1050 50  0000 C CNN
F 2 "Capacitor_SMD:C_1206_3216Metric_Pad1.42x1.75mm_HandSolder" H 7138 1050 50  0001 C CNN
F 3 "~" H 7100 1200 50  0001 C CNN
	1    7100 1200
	0    1    1    0   
$EndComp
$Comp
L power:GND #PWR012
U 1 1 5D76E297
P 7300 4250
F 0 "#PWR012" H 7300 4000 50  0001 C CNN
F 1 "GND" H 7305 4077 50  0000 C CNN
F 2 "" H 7300 4250 50  0001 C CNN
F 3 "" H 7300 4250 50  0001 C CNN
	1    7300 4250
	1    0    0    -1  
$EndComp
Wire Wire Line
	7250 1200 7300 1200
Wire Wire Line
	7300 1200 7300 1400
Wire Wire Line
	7250 1400 7300 1400
Connection ~ 7300 1400
Wire Wire Line
	7300 1400 7300 1450
$Comp
L power:GND #PWR09
U 1 1 5D77FFA0
P 6800 1200
F 0 "#PWR09" H 6800 950 50  0001 C CNN
F 1 "GND" V 6805 1072 50  0000 R CNN
F 2 "" H 6800 1200 50  0001 C CNN
F 3 "" H 6800 1200 50  0001 C CNN
	1    6800 1200
	0    1    1    0   
$EndComp
$Comp
L power:GND #PWR010
U 1 1 5D781695
P 6800 1400
F 0 "#PWR010" H 6800 1150 50  0001 C CNN
F 1 "GND" V 6805 1272 50  0000 R CNN
F 2 "" H 6800 1400 50  0001 C CNN
F 3 "" H 6800 1400 50  0001 C CNN
	1    6800 1400
	0    1    1    0   
$EndComp
$Comp
L power:+3V3 #PWR011
U 1 1 5D781935
P 7300 1100
F 0 "#PWR011" H 7300 950 50  0001 C CNN
F 1 "+3V3" H 7315 1273 50  0000 C CNN
F 2 "" H 7300 1100 50  0001 C CNN
F 3 "" H 7300 1100 50  0001 C CNN
	1    7300 1100
	1    0    0    -1  
$EndComp
Wire Wire Line
	7300 1100 7300 1200
Connection ~ 7300 1200
$Comp
L power:GND #PWR01
U 1 1 5D78E6C0
P 1350 3250
F 0 "#PWR01" H 1350 3000 50  0001 C CNN
F 1 "GND" H 1355 3077 50  0000 C CNN
F 2 "" H 1350 3250 50  0001 C CNN
F 3 "" H 1350 3250 50  0001 C CNN
	1    1350 3250
	1    0    0    -1  
$EndComp
Wire Wire Line
	1300 3200 1350 3200
Wire Wire Line
	1350 3200 1350 3250
$Comp
L Device:R R2
U 1 1 5D79127E
P 1550 3000
F 0 "R2" V 1550 3000 50  0000 C CNN
F 1 "330R" V 1700 3000 50  0000 C CNN
F 2 "Resistor_SMD:R_0603_1608Metric_Pad1.05x0.95mm_HandSolder" V 1480 3000 50  0001 C CNN
F 3 "~" H 1550 3000 50  0001 C CNN
	1    1550 3000
	0    1    1    0   
$EndComp
$Comp
L Device:R R5
U 1 1 5D791539
P 1850 3100
F 0 "R5" V 1850 3100 50  0000 C CNN
F 1 "330R" V 1950 3100 50  0000 C CNN
F 2 "Resistor_SMD:R_0603_1608Metric_Pad1.05x0.95mm_HandSolder" V 1780 3100 50  0001 C CNN
F 3 "~" H 1850 3100 50  0001 C CNN
	1    1850 3100
	0    1    1    0   
$EndComp
Wire Wire Line
	1400 3000 1300 3000
Wire Wire Line
	1300 3100 1700 3100
Wire Wire Line
	7900 1750 8050 1750
Wire Wire Line
	7900 1950 8050 1950
Text Label 8050 1750 0    50   ~ 0
TXD0
Text Label 8050 1950 0    50   ~ 0
RXD0
Wire Wire Line
	1700 3000 2100 3000
Wire Wire Line
	2000 3100 2100 3100
Text Label 2100 3100 0    50   ~ 0
RXD0
Text Label 2100 3000 0    50   ~ 0
TXD0
$Comp
L Connector_Generic:Conn_01x05 J2
U 1 1 5D79780F
P 1100 3000
F 0 "J2" H 1100 2700 50  0000 C CNN
F 1 "Programming" V 1200 3000 50  0000 C CNN
F 2 "Connector_PinSocket_2.54mm:PinSocket_1x05_P2.54mm_Horizontal" H 1100 3000 50  0001 C CNN
F 3 "~" H 1100 3000 50  0001 C CNN
	1    1100 3000
	-1   0    0    1   
$EndComp
$Comp
L Device:R R4
U 1 1 5D79816B
P 4100 2700
F 0 "R4" V 4100 2700 50  0000 C CNN
F 1 "12k" V 4200 2700 50  0000 C CNN
F 2 "Resistor_SMD:R_0603_1608Metric_Pad1.05x0.95mm_HandSolder" V 4030 2700 50  0001 C CNN
F 3 "~" H 4100 2700 50  0001 C CNN
	1    4100 2700
	0    1    1    0   
$EndComp
$Comp
L Device:R R1
U 1 1 5D7985EB
P 4100 3300
F 0 "R1" V 4100 3300 50  0000 C CNN
F 1 "12k" V 4200 3300 50  0000 C CNN
F 2 "Resistor_SMD:R_0603_1608Metric_Pad1.05x0.95mm_HandSolder" V 4030 3300 50  0001 C CNN
F 3 "~" H 4100 3300 50  0001 C CNN
	1    4100 3300
	0    1    1    0   
$EndComp
Text Label 2100 2900 0    50   ~ 0
DTR
Text Label 2100 2800 0    50   ~ 0
RTS
Wire Wire Line
	7900 1650 8050 1650
Text Label 8050 1650 0    50   ~ 0
BOOT
$Comp
L Device:R R8
U 1 1 5D7ADD58
P 2500 5650
F 0 "R8" V 2500 5650 50  0000 C CNN
F 1 "220R/0.5W" V 2400 5650 50  0000 C CNN
F 2 "Resistor_THT:R_Axial_DIN0207_L6.3mm_D2.5mm_P10.16mm_Horizontal" V 2430 5650 50  0001 C CNN
F 3 "~" H 2500 5650 50  0001 C CNN
	1    2500 5650
	0    -1   -1   0   
$EndComp
$Comp
L Device:R R7
U 1 1 5D7B1D05
P 1500 5650
F 0 "R7" V 1500 5650 50  0000 C CNN
F 1 "220R" V 1384 5650 50  0000 C CNN
F 2 "Resistor_SMD:R_0603_1608Metric_Pad1.05x0.95mm_HandSolder" V 1430 5650 50  0001 C CNN
F 3 "~" H 1500 5650 50  0001 C CNN
	1    1500 5650
	0    1    1    0   
$EndComp
Wire Wire Line
	1650 5650 1700 5650
Wire Wire Line
	2300 5650 2350 5650
Text Label 2000 5300 0    50   ~ 0
LOUT
Text Label 2000 5100 0    50   ~ 0
LIN
Wire Wire Line
	2650 5650 2700 5650
Wire Wire Line
	1900 5300 3150 5300
Wire Wire Line
	2700 5650 2700 5100
Wire Wire Line
	3000 5750 2900 5750
Text Label 8050 1850 0    50   ~ 0
GPIO_POWER_SWITCH
Wire Wire Line
	7900 2750 8050 2750
Wire Wire Line
	7900 2650 8050 2650
Text Label 8050 2650 0    50   ~ 0
UI_RXD_PIN
Text Label 8050 2750 0    50   ~ 0
UI_TXD_PIN
$Comp
L Connector_Generic:Conn_01x03 J3
U 1 1 5D7F7676
P 1100 3950
F 0 "J3" H 1100 3750 50  0000 C CNN
F 1 "User_Interface" V 1200 3950 50  0000 C CNN
F 2 "Connector_PinSocket_2.54mm:PinSocket_1x03_P2.54mm_Horizontal" H 1100 3950 50  0001 C CNN
F 3 "~" H 1100 3950 50  0001 C CNN
	1    1100 3950
	-1   0    0    1   
$EndComp
$Comp
L Device:R R3
U 1 1 5D7F83FB
P 1550 3850
F 0 "R3" V 1550 3850 50  0000 C CNN
F 1 "330R" V 1434 3850 50  0000 C CNN
F 2 "Resistor_SMD:R_0603_1608Metric_Pad1.05x0.95mm_HandSolder" V 1480 3850 50  0001 C CNN
F 3 "~" H 1550 3850 50  0001 C CNN
	1    1550 3850
	0    1    1    0   
$EndComp
$Comp
L Device:R R6
U 1 1 5D7F8DB1
P 1850 3950
F 0 "R6" V 1850 3950 50  0000 C CNN
F 1 "330R" V 1950 3950 50  0000 C CNN
F 2 "Resistor_SMD:R_0603_1608Metric_Pad1.05x0.95mm_HandSolder" V 1780 3950 50  0001 C CNN
F 3 "~" H 1850 3950 50  0001 C CNN
	1    1850 3950
	0    1    1    0   
$EndComp
Wire Wire Line
	1300 3850 1400 3850
Wire Wire Line
	1300 3950 1700 3950
$Comp
L power:GND #PWR02
U 1 1 5D7FC01F
P 1350 4100
F 0 "#PWR02" H 1350 3850 50  0001 C CNN
F 1 "GND" H 1355 3927 50  0000 C CNN
F 2 "" H 1350 4100 50  0001 C CNN
F 3 "" H 1350 4100 50  0001 C CNN
	1    1350 4100
	1    0    0    -1  
$EndComp
Wire Wire Line
	1300 4050 1350 4050
Wire Wire Line
	1350 4050 1350 4100
Wire Wire Line
	1700 3850 2100 3850
Wire Wire Line
	2000 3950 2100 3950
Text Label 2100 3950 0    50   ~ 0
UI_RXD_PIN
Text Label 2100 3850 0    50   ~ 0
UI_TXD_PIN
$Comp
L Transistor_BJT:BC817 Q1
U 1 1 5D81092D
P 4500 2700
F 0 "Q1" H 4300 2900 50  0000 L CNN
F 1 "BC817" H 4200 2800 50  0000 L CNN
F 2 "Package_TO_SOT_SMD:SC-59_Handsoldering" H 4500 2700 50  0001 L CNN
F 3 "" H 4500 2700 50  0001 L CNN
	1    4500 2700
	1    0    0    -1  
$EndComp
$Comp
L Transistor_BJT:BC817 Q2
U 1 1 5D82C928
P 4500 3300
F 0 "Q2" H 4300 3150 50  0000 L CNN
F 1 "BC817" H 4200 3250 50  0000 L CNN
F 2 "Package_TO_SOT_SMD:SC-59_Handsoldering" H 4500 3300 50  0001 L CNN
F 3 "" H 4500 3300 50  0001 L CNN
	1    4500 3300
	1    0    0    1   
$EndComp
Wire Wire Line
	4600 3100 4600 3050
Wire Wire Line
	3850 3050 3850 2700
Wire Wire Line
	3850 2700 3650 2700
Wire Wire Line
	4600 2900 4600 2950
Wire Wire Line
	3800 2950 3800 3300
Wire Wire Line
	3800 3300 3650 3300
Wire Wire Line
	4600 2500 4600 2450
Wire Wire Line
	4600 2450 4800 2450
Wire Wire Line
	4600 3500 4600 3550
Wire Wire Line
	4600 3550 4800 3550
Text Label 5000 3550 0    50   ~ 0
BOOT
Text Label 4950 2450 0    50   ~ 0
EN
Wire Wire Line
	6700 1650 6550 1650
Text Label 6550 1650 2    50   ~ 0
EN
Text Label 3650 2700 2    50   ~ 0
DTR
Text Label 3650 3300 2    50   ~ 0
RTS
$Comp
L Switch:SW_Push SW1
U 1 1 5D764B48
P 9000 2150
F 0 "SW1" H 9100 2250 50  0000 C CNN
F 1 "manual_sw" H 8950 2100 50  0000 C CNN
F 2 "Button_Switch_THT:SW_PUSH_6mm_H5mm" H 9000 2350 50  0001 C CNN
F 3 "~" H 9000 2350 50  0001 C CNN
	1    9000 2150
	1    0    0    -1  
$EndComp
$Comp
L power:GND #PWR013
U 1 1 5D766948
P 9250 2200
F 0 "#PWR013" H 9250 1950 50  0001 C CNN
F 1 "GND" H 9255 2027 50  0000 C CNN
F 2 "" H 9250 2200 50  0001 C CNN
F 3 "" H 9250 2200 50  0001 C CNN
	1    9250 2200
	1    0    0    -1  
$EndComp
Wire Wire Line
	9250 2200 9250 2150
Wire Wire Line
	9250 2150 9200 2150
Text Label 8050 2150 0    50   ~ 0
BTN_MANUAL_SWITCH
Wire Wire Line
	7900 2150 8800 2150
$Comp
L Device:R R9
U 1 1 5D7E5CF8
P 7800 5200
F 0 "R9" V 7800 5200 50  0000 C CNN
F 1 "330R" V 7684 5200 50  0000 C CNN
F 2 "Resistor_SMD:R_0603_1608Metric_Pad1.05x0.95mm_HandSolder" V 7730 5200 50  0001 C CNN
F 3 "~" H 7800 5200 50  0001 C CNN
	1    7800 5200
	0    1    1    0   
$EndComp
Wire Wire Line
	7900 2850 8050 2850
Text Label 8050 2850 0    50   ~ 0
BTN_LED_BT_ON
Wire Wire Line
	7650 5200 7450 5200
Text Label 7450 5200 2    50   ~ 0
BTN_LED_BT_ON
$Comp
L Device:R R10
U 1 1 5D7EBDD7
P 7800 5500
F 0 "R10" V 7800 5500 50  0000 C CNN
F 1 "150R" V 7684 5500 50  0000 C CNN
F 2 "Resistor_SMD:R_0603_1608Metric_Pad1.05x0.95mm_HandSolder" V 7730 5500 50  0001 C CNN
F 3 "~" H 7800 5500 50  0001 C CNN
	1    7800 5500
	0    1    1    0   
$EndComp
Wire Wire Line
	7650 5500 7450 5500
Wire Wire Line
	7900 2950 8050 2950
Text Label 8050 2950 0    50   ~ 0
BTN_LED_MANUAL_ON
Text Label 7450 5500 2    50   ~ 0
BTN_LED_MANUAL_ON
$Comp
L Device:LED D1
U 1 1 5D7F0934
P 8150 5200
F 0 "D1" H 8143 4945 50  0000 C CNN
F 1 "Blue" H 8143 5036 50  0000 C CNN
F 2 "LED_SMD:LED_1210_3225Metric_Pad1.42x2.65mm_HandSolder" H 8150 5200 50  0001 C CNN
F 3 "~" H 8150 5200 50  0001 C CNN
	1    8150 5200
	-1   0    0    1   
$EndComp
$Comp
L Device:LED D2
U 1 1 5D7F0F90
P 8150 5500
F 0 "D2" H 8150 5400 50  0000 C CNN
F 1 "Yellow" H 8150 5600 50  0000 C CNN
F 2 "LED_SMD:LED_1210_3225Metric_Pad1.42x2.65mm_HandSolder" H 8150 5500 50  0001 C CNN
F 3 "~" H 8150 5500 50  0001 C CNN
	1    8150 5500
	-1   0    0    1   
$EndComp
Wire Wire Line
	7950 5200 8000 5200
Wire Wire Line
	7950 5500 8000 5500
$Comp
L power:GND #PWR014
U 1 1 5D7F63CD
P 8350 5200
F 0 "#PWR014" H 8350 4950 50  0001 C CNN
F 1 "GND" V 8355 5072 50  0000 R CNN
F 2 "" H 8350 5200 50  0001 C CNN
F 3 "" H 8350 5200 50  0001 C CNN
	1    8350 5200
	0    -1   -1   0   
$EndComp
$Comp
L power:GND #PWR015
U 1 1 5D7F67E9
P 8350 5500
F 0 "#PWR015" H 8350 5250 50  0001 C CNN
F 1 "GND" V 8355 5372 50  0000 R CNN
F 2 "" H 8350 5500 50  0001 C CNN
F 3 "" H 8350 5500 50  0001 C CNN
	1    8350 5500
	0    -1   -1   0   
$EndComp
Wire Wire Line
	8350 5200 8300 5200
Wire Wire Line
	8300 5500 8350 5500
$Comp
L Device:Fuse F1
U 1 1 5D7FFA19
P 2400 5100
F 0 "F1" V 2203 5100 50  0000 C CNN
F 1 "Fuse" V 2294 5100 50  0000 C CNN
F 2 "Fuse:Fuseholder_Cylinder-5x20mm_Schurter_0031_8201_Horizontal_Open" V 2330 5100 50  0001 C CNN
F 3 "~" H 2400 5100 50  0001 C CNN
	1    2400 5100
	0    1    1    0   
$EndComp
Wire Wire Line
	1900 5100 2250 5100
Wire Wire Line
	2550 5100 2700 5100
Connection ~ 2700 5100
$Comp
L Device:R R11
U 1 1 5D811468
P 7800 5850
F 0 "R11" V 7800 5850 50  0000 C CNN
F 1 "150R" V 7684 5850 50  0000 C CNN
F 2 "Resistor_SMD:R_0603_1608Metric_Pad1.05x0.95mm_HandSolder" V 7730 5850 50  0001 C CNN
F 3 "~" H 7800 5850 50  0001 C CNN
	1    7800 5850
	0    1    1    0   
$EndComp
$Comp
L Device:LED D3
U 1 1 5D811756
P 8150 5850
F 0 "D3" H 8150 5950 50  0000 C CNN
F 1 "Red" H 8150 6050 50  0000 C CNN
F 2 "LED_SMD:LED_1210_3225Metric_Pad1.42x2.65mm_HandSolder" H 8150 5850 50  0001 C CNN
F 3 "~" H 8150 5850 50  0001 C CNN
	1    8150 5850
	-1   0    0    1   
$EndComp
$Comp
L power:GND #PWR016
U 1 1 5D811C6C
P 8350 5850
F 0 "#PWR016" H 8350 5600 50  0001 C CNN
F 1 "GND" V 8355 5722 50  0000 R CNN
F 2 "" H 8350 5850 50  0001 C CNN
F 3 "" H 8350 5850 50  0001 C CNN
	1    8350 5850
	0    -1   -1   0   
$EndComp
Wire Wire Line
	7950 5850 8000 5850
Wire Wire Line
	8300 5850 8350 5850
Wire Wire Line
	7650 5850 7450 5850
Wire Wire Line
	7900 3050 8050 3050
Text Label 8050 3050 0    50   ~ 0
BTN_LED_BTN_PRESSED
Text Label 7450 5850 2    50   ~ 0
BTN_LED_BTN_PRESSED
Wire Wire Line
	6950 1200 6800 1200
Wire Wire Line
	6800 1400 6950 1400
Wire Wire Line
	2700 5100 3450 5100
$Comp
L Triac_Thyristor:BT139-600 Q3
U 1 1 5D7AA09E
P 3150 5850
F 0 "Q3" H 3000 5950 50  0000 L CNN
F 1 "BTA16-600" V 3300 5700 50  0000 L CNN
F 2 "Package_TO_SOT_THT:TO-220-3_Vertical" H 3350 5775 50  0001 L CIN
F 3 "https://www.rapidonline.com/pdf/47-3240.pdf" H 3150 5850 50  0001 L CNN
	1    3150 5850
	1    0    0    1   
$EndComp
$Comp
L Connector_Generic:Conn_01x01 J4
U 1 1 5D8740AD
P 1700 5100
F 0 "J4" H 1850 5100 50  0000 C CNN
F 1 "PWR_220V_IN" H 1900 5000 50  0000 C CNN
F 2 "Connector_Wire:SolderWirePad_1x01_Drill1.2mm" H 1700 5100 50  0001 C CNN
F 3 "~" H 1700 5100 50  0001 C CNN
	1    1700 5100
	-1   0    0    1   
$EndComp
$Comp
L Connector_Generic:Conn_01x01 J5
U 1 1 5D874695
P 1700 5300
F 0 "J5" H 1850 5300 50  0000 C CNN
F 1 "PWR_220V_OUT" H 1900 5400 50  0000 C CNN
F 2 "Connector_Wire:SolderWirePad_1x01_Drill1.2mm" H 1700 5300 50  0001 C CNN
F 3 "~" H 1700 5300 50  0001 C CNN
	1    1700 5300
	-1   0    0    1   
$EndComp
$Comp
L Mechanical:MountingHole H1
U 1 1 5D899E96
P 5250 7300
F 0 "H1" H 5350 7346 50  0000 L CNN
F 1 "MountingHole" H 5350 7255 50  0000 L CNN
F 2 "MountingHole:MountingHole_3.2mm_M3" H 5250 7300 50  0001 C CNN
F 3 "~" H 5250 7300 50  0001 C CNN
	1    5250 7300
	1    0    0    -1  
$EndComp
$Comp
L Mechanical:MountingHole H2
U 1 1 5D89A8B6
P 5250 7550
F 0 "H2" H 5350 7596 50  0000 L CNN
F 1 "MountingHole" H 5350 7505 50  0000 L CNN
F 2 "MountingHole:MountingHole_3.2mm_M3" H 5250 7550 50  0001 C CNN
F 3 "~" H 5250 7550 50  0001 C CNN
	1    5250 7550
	1    0    0    -1  
$EndComp
$Comp
L Mechanical:MountingHole H3
U 1 1 5D89AB74
P 6200 7300
F 0 "H3" H 6300 7346 50  0000 L CNN
F 1 "MountingHole" H 6300 7255 50  0000 L CNN
F 2 "MountingHole:MountingHole_3.2mm_M3" H 6200 7300 50  0001 C CNN
F 3 "~" H 6200 7300 50  0001 C CNN
	1    6200 7300
	1    0    0    -1  
$EndComp
$Comp
L Mechanical:MountingHole H4
U 1 1 5D89ADDF
P 6200 7550
F 0 "H4" H 6300 7596 50  0000 L CNN
F 1 "MountingHole" H 6300 7505 50  0000 L CNN
F 2 "MountingHole:MountingHole_3.2mm_M3" H 6200 7550 50  0001 C CNN
F 3 "~" H 6200 7550 50  0001 C CNN
	1    6200 7550
	1    0    0    -1  
$EndComp
$Comp
L Connector_Generic:Conn_01x02 J6
U 1 1 5D8A8402
P 1100 5750
F 0 "J6" H 1100 5550 50  0000 C CNN
F 1 "PWR_SW_EN" V 1200 5750 50  0000 C CNN
F 2 "Connector_PinHeader_2.54mm:PinHeader_1x02_P2.54mm_Vertical" H 1100 5750 50  0001 C CNN
F 3 "~" H 1100 5750 50  0001 C CNN
	1    1100 5750
	-1   0    0    1   
$EndComp
Wire Wire Line
	1300 5650 1350 5650
Wire Wire Line
	1300 5750 1400 5750
Wire Wire Line
	1400 5750 1400 5850
Wire Wire Line
	1400 5850 1700 5850
$Comp
L Connector_Generic:Conn_01x02 J7
U 1 1 5D8B32BC
P 9850 1850
F 0 "J7" H 9768 1525 50  0000 C CNN
F 1 "PWR_SW_EN" V 9950 1850 50  0000 C CNN
F 2 "Connector_PinSocket_2.54mm:PinSocket_1x02_P2.54mm_Vertical" H 9850 1850 50  0001 C CNN
F 3 "~" H 9850 1850 50  0001 C CNN
	1    9850 1850
	1    0    0    -1  
$EndComp
Wire Wire Line
	7900 1850 9650 1850
$Comp
L power:GND #PWR0101
U 1 1 5D8B7453
P 9600 2000
F 0 "#PWR0101" H 9600 1750 50  0001 C CNN
F 1 "GND" H 9605 1827 50  0000 C CNN
F 2 "" H 9600 2000 50  0001 C CNN
F 3 "" H 9600 2000 50  0001 C CNN
	1    9600 2000
	1    0    0    -1  
$EndComp
Wire Wire Line
	9650 1950 9600 1950
Wire Wire Line
	9600 1950 9600 2000
NoConn ~ 7900 2550
$Comp
L power:PWR_FLAG #FLG0101
U 1 1 5D948DC6
P 1300 1650
F 0 "#FLG0101" H 1300 1725 50  0001 C CNN
F 1 "PWR_FLAG" H 1150 1800 50  0000 C CNN
F 2 "" H 1300 1650 50  0001 C CNN
F 3 "~" H 1300 1650 50  0001 C CNN
	1    1300 1650
	1    0    0    -1  
$EndComp
Wire Wire Line
	1300 1650 1300 1850
Connection ~ 1300 1850
Wire Wire Line
	1300 1850 1250 1850
$Comp
L power:PWR_FLAG #FLG0102
U 1 1 5D9539A0
P 1300 2150
F 0 "#FLG0102" H 1300 2225 50  0001 C CNN
F 1 "PWR_FLAG" H 1450 2300 50  0000 C CNN
F 2 "" H 1300 2150 50  0001 C CNN
F 3 "~" H 1300 2150 50  0001 C CNN
	1    1300 2150
	-1   0    0    1   
$EndComp
Wire Wire Line
	1300 2150 1300 1950
Connection ~ 1300 1950
Wire Wire Line
	1300 1950 1250 1950
Text Label 2300 5950 0    50   ~ 0
PWR_220_CNTRL
Text Label 2700 5100 0    50   ~ 0
LIN_FUSED
$Comp
L Connector:TestPoint TP9
U 1 1 5D91B66F
P 7950 2050
F 0 "TP9" V 7950 2250 50  0000 L CNN
F 1 "TestPoint" V 7850 2550 50  0001 L CNN
F 2 "TestPoint:TestPoint_Pad_D1.5mm" H 8150 2050 50  0001 C CNN
F 3 "~" H 8150 2050 50  0001 C CNN
	1    7950 2050
	0    1    1    0   
$EndComp
Wire Wire Line
	7950 2050 7900 2050
$Comp
L Connector:TestPoint TP10
U 1 1 5D91FEA8
P 7950 2250
F 0 "TP10" V 7950 2450 50  0000 L CNN
F 1 "TestPoint" V 7995 2438 50  0001 L CNN
F 2 "TestPoint:TestPoint_Pad_D1.5mm" H 8150 2250 50  0001 C CNN
F 3 "~" H 8150 2250 50  0001 C CNN
	1    7950 2250
	0    1    1    0   
$EndComp
Wire Wire Line
	7950 2250 7900 2250
$Comp
L Connector:TestPoint TP11
U 1 1 5D923ADE
P 7950 2350
F 0 "TP11" V 7950 2550 50  0000 L CNN
F 1 "TestPoint" V 7995 2538 50  0001 L CNN
F 2 "TestPoint:TestPoint_Pad_D1.5mm" H 8150 2350 50  0001 C CNN
F 3 "~" H 8150 2350 50  0001 C CNN
	1    7950 2350
	0    1    1    0   
$EndComp
Wire Wire Line
	7950 2350 7900 2350
$Comp
L Connector:TestPoint TP12
U 1 1 5D9274CF
P 7950 2450
F 0 "TP12" V 7950 2650 50  0000 L CNN
F 1 "TestPoint" V 7995 2638 50  0001 L CNN
F 2 "TestPoint:TestPoint_Pad_D1.5mm" H 8150 2450 50  0001 C CNN
F 3 "~" H 8150 2450 50  0001 C CNN
	1    7950 2450
	0    1    1    0   
$EndComp
Wire Wire Line
	7900 2450 7950 2450
$Comp
L RF_Module:ESP32-WROOM-32 U3
U 1 1 5D75383F
P 7300 2850
F 0 "U3" H 7450 4300 50  0000 C CNN
F 1 "ESP32-WROOM-32" H 7750 4200 50  0000 C CNN
F 2 "RF_Module:ESP32-WROOM-32" H 7300 1350 50  0001 C CNN
F 3 "https://www.espressif.com/sites/default/files/documentation/esp32-wroom-32_datasheet_en.pdf" H 7000 2900 50  0001 C CNN
	1    7300 2850
	1    0    0    -1  
$EndComp
$Comp
L Connector:TestPoint TP3
U 1 1 5D931A9C
P 6650 2850
F 0 "TP3" V 6650 3100 50  0000 C CNN
F 1 "TestPoint" V 6754 2922 50  0001 C CNN
F 2 "TestPoint:TestPoint_Pad_D1.5mm" H 6850 2850 50  0001 C CNN
F 3 "~" H 6850 2850 50  0001 C CNN
	1    6650 2850
	0    -1   -1   0   
$EndComp
$Comp
L Connector:TestPoint TP4
U 1 1 5D93255B
P 6650 2950
F 0 "TP4" V 6650 3200 50  0000 C CNN
F 1 "TestPoint" V 6754 3022 50  0001 C CNN
F 2 "TestPoint:TestPoint_Pad_D1.5mm" H 6850 2950 50  0001 C CNN
F 3 "~" H 6850 2950 50  0001 C CNN
	1    6650 2950
	0    -1   -1   0   
$EndComp
$Comp
L Connector:TestPoint TP5
U 1 1 5D9327AC
P 6650 3050
F 0 "TP5" V 6650 3300 50  0000 C CNN
F 1 "TestPoint" V 6754 3122 50  0001 C CNN
F 2 "TestPoint:TestPoint_Pad_D1.5mm" H 6850 3050 50  0001 C CNN
F 3 "~" H 6850 3050 50  0001 C CNN
	1    6650 3050
	0    -1   -1   0   
$EndComp
$Comp
L Connector:TestPoint TP6
U 1 1 5D93350F
P 6650 3150
F 0 "TP6" V 6650 3400 50  0000 C CNN
F 1 "TestPoint" V 6754 3222 50  0001 C CNN
F 2 "TestPoint:TestPoint_Pad_D1.5mm" H 6850 3150 50  0001 C CNN
F 3 "~" H 6850 3150 50  0001 C CNN
	1    6650 3150
	0    -1   -1   0   
$EndComp
$Comp
L Connector:TestPoint TP7
U 1 1 5D9337D0
P 6650 3250
F 0 "TP7" V 6650 3500 50  0000 C CNN
F 1 "TestPoint" V 6754 3322 50  0001 C CNN
F 2 "TestPoint:TestPoint_Pad_D1.5mm" H 6850 3250 50  0001 C CNN
F 3 "~" H 6850 3250 50  0001 C CNN
	1    6650 3250
	0    -1   -1   0   
$EndComp
$Comp
L Connector:TestPoint TP8
U 1 1 5D9342B6
P 6650 3350
F 0 "TP8" V 6650 3600 50  0000 C CNN
F 1 "TestPoint" V 6754 3422 50  0001 C CNN
F 2 "TestPoint:TestPoint_Pad_D1.5mm" H 6850 3350 50  0001 C CNN
F 3 "~" H 6850 3350 50  0001 C CNN
	1    6650 3350
	0    -1   -1   0   
$EndComp
Wire Wire Line
	6650 3350 6700 3350
Wire Wire Line
	6650 3250 6700 3250
Wire Wire Line
	6650 3150 6700 3150
Wire Wire Line
	6650 3050 6700 3050
Wire Wire Line
	6650 2950 6700 2950
Wire Wire Line
	6650 2850 6700 2850
$Comp
L Connector:TestPoint TP13
U 1 1 5D94DCFC
P 7950 3150
F 0 "TP13" V 7950 3350 50  0000 L CNN
F 1 "TestPoint" V 7995 3338 50  0001 L CNN
F 2 "TestPoint:TestPoint_Pad_D1.5mm" H 8150 3150 50  0001 C CNN
F 3 "~" H 8150 3150 50  0001 C CNN
	1    7950 3150
	0    1    1    0   
$EndComp
$Comp
L Connector:TestPoint TP14
U 1 1 5D94E328
P 7950 3250
F 0 "TP14" V 7950 3450 50  0000 L CNN
F 1 "TestPoint" V 7995 3438 50  0001 L CNN
F 2 "TestPoint:TestPoint_Pad_D1.5mm" H 8150 3250 50  0001 C CNN
F 3 "~" H 8150 3250 50  0001 C CNN
	1    7950 3250
	0    1    1    0   
$EndComp
Wire Wire Line
	7950 3150 7900 3150
Wire Wire Line
	7900 3250 7950 3250
$Comp
L Connector:TestPoint TP1
U 1 1 5D95C555
P 6650 1850
F 0 "TP1" V 6650 2100 50  0000 C CNN
F 1 "TestPoint" V 6650 2200 50  0001 C CNN
F 2 "TestPoint:TestPoint_Pad_D1.5mm" H 6850 1850 50  0001 C CNN
F 3 "~" H 6850 1850 50  0001 C CNN
	1    6650 1850
	0    -1   -1   0   
$EndComp
$Comp
L Connector:TestPoint TP2
U 1 1 5D95CA02
P 6650 1950
F 0 "TP2" V 6650 2200 50  0000 C CNN
F 1 "TestPoint" V 6650 2300 50  0001 C CNN
F 2 "TestPoint:TestPoint_Pad_D1.5mm" H 6850 1950 50  0001 C CNN
F 3 "~" H 6850 1950 50  0001 C CNN
	1    6650 1950
	0    -1   -1   0   
$EndComp
Wire Wire Line
	6650 1950 6700 1950
Wire Wire Line
	6650 1850 6700 1850
$Comp
L Connector:TestPoint TP15
U 1 1 5D96A2E8
P 7950 3350
F 0 "TP15" V 7950 3550 50  0000 L CNN
F 1 "TestPoint" V 7995 3538 50  0001 L CNN
F 2 "TestPoint:TestPoint_Pad_D1.5mm" H 8150 3350 50  0001 C CNN
F 3 "~" H 8150 3350 50  0001 C CNN
	1    7950 3350
	0    1    1    0   
$EndComp
$Comp
L Connector:TestPoint TP16
U 1 1 5D96A480
P 7950 3450
F 0 "TP16" V 7950 3650 50  0000 L CNN
F 1 "TestPoint" V 7995 3638 50  0001 L CNN
F 2 "TestPoint:TestPoint_Pad_D1.5mm" H 8150 3450 50  0001 C CNN
F 3 "~" H 8150 3450 50  0001 C CNN
	1    7950 3450
	0    1    1    0   
$EndComp
$Comp
L Connector:TestPoint TP17
U 1 1 5D96A6C9
P 7950 3550
F 0 "TP17" V 7950 3750 50  0000 L CNN
F 1 "TestPoint" V 7995 3738 50  0001 L CNN
F 2 "TestPoint:TestPoint_Pad_D1.5mm" H 8150 3550 50  0001 C CNN
F 3 "~" H 8150 3550 50  0001 C CNN
	1    7950 3550
	0    1    1    0   
$EndComp
$Comp
L Connector:TestPoint TP18
U 1 1 5D96A88D
P 7950 3650
F 0 "TP18" V 7950 3850 50  0000 L CNN
F 1 "TestPoint" V 7995 3838 50  0001 L CNN
F 2 "TestPoint:TestPoint_Pad_D1.5mm" H 8150 3650 50  0001 C CNN
F 3 "~" H 8150 3650 50  0001 C CNN
	1    7950 3650
	0    1    1    0   
$EndComp
$Comp
L Connector:TestPoint TP19
U 1 1 5D96AFE1
P 7950 3750
F 0 "TP19" V 7950 3950 50  0000 L CNN
F 1 "TestPoint" V 7995 3938 50  0001 L CNN
F 2 "TestPoint:TestPoint_Pad_D1.5mm" H 8150 3750 50  0001 C CNN
F 3 "~" H 8150 3750 50  0001 C CNN
	1    7950 3750
	0    1    1    0   
$EndComp
$Comp
L Connector:TestPoint TP20
U 1 1 5D96B198
P 7950 3850
F 0 "TP20" V 7950 4050 50  0000 L CNN
F 1 "TestPoint" V 7995 4038 50  0001 L CNN
F 2 "TestPoint:TestPoint_Pad_D1.5mm" H 8150 3850 50  0001 C CNN
F 3 "~" H 8150 3850 50  0001 C CNN
	1    7950 3850
	0    1    1    0   
$EndComp
$Comp
L Connector:TestPoint TP21
U 1 1 5D96B37A
P 7950 3950
F 0 "TP21" V 7950 4150 50  0000 L CNN
F 1 "TestPoint" V 7995 4138 50  0001 L CNN
F 2 "TestPoint:TestPoint_Pad_D1.5mm" H 8150 3950 50  0001 C CNN
F 3 "~" H 8150 3950 50  0001 C CNN
	1    7950 3950
	0    1    1    0   
$EndComp
Wire Wire Line
	7950 3350 7900 3350
Wire Wire Line
	7900 3450 7950 3450
Wire Wire Line
	7900 3550 7950 3550
Wire Wire Line
	7900 3650 7950 3650
Wire Wire Line
	7900 3750 7950 3750
Wire Wire Line
	7900 3850 7950 3850
Wire Wire Line
	7900 3950 7950 3950
Wire Wire Line
	3150 5300 3150 5700
Wire Wire Line
	3450 6200 3150 6200
Wire Wire Line
	3150 6200 3150 6000
Wire Wire Line
	3450 5100 3450 6200
$Comp
L SMRT_PWR_PLG-01-rescue:MOC3042M-Relay_SolidState U2
U 1 1 5D7AAF9D
P 2000 5750
F 0 "U2" H 2000 6075 50  0000 C CNN
F 1 "MOC3042M" H 2000 5984 50  0000 C CNN
F 2 "Package_DIP:DIP-6_W7.62mm_LongPads" H 1800 5550 50  0001 L CIN
F 3 "http://www.fairchildsemi.com/ds/MO/MOC3031M.pdf" H 1965 5750 50  0001 L CNN
	1    2000 5750
	1    0    0    -1  
$EndComp
Wire Wire Line
	2900 5750 2900 5850
Wire Wire Line
	2900 5850 2300 5850
$Comp
L Device:R R12
U 1 1 5DBFF55F
P 4800 2250
F 0 "R12" V 4800 2250 50  0000 C CNN
F 1 "47k" V 4684 2250 50  0000 C CNN
F 2 "Resistor_SMD:R_0603_1608Metric_Pad1.05x0.95mm_HandSolder" V 4730 2250 50  0001 C CNN
F 3 "~" H 4800 2250 50  0001 C CNN
	1    4800 2250
	-1   0    0    1   
$EndComp
$Comp
L Device:R R13
U 1 1 5DC00506
P 4800 3750
F 0 "R13" V 4800 3750 50  0000 C CNN
F 1 "47k" V 4684 3750 50  0000 C CNN
F 2 "Resistor_SMD:R_0603_1608Metric_Pad1.05x0.95mm_HandSolder" V 4730 3750 50  0001 C CNN
F 3 "~" H 4800 3750 50  0001 C CNN
	1    4800 3750
	-1   0    0    1   
$EndComp
Wire Wire Line
	4800 3600 4800 3550
Connection ~ 4800 3550
Wire Wire Line
	4800 3550 5000 3550
Wire Wire Line
	4800 2400 4800 2450
Connection ~ 4800 2450
Wire Wire Line
	4800 2450 4950 2450
$Comp
L power:+3V3 #PWR0102
U 1 1 5DC0D655
P 4800 2050
F 0 "#PWR0102" H 4800 1900 50  0001 C CNN
F 1 "+3V3" H 4815 2223 50  0000 C CNN
F 2 "" H 4800 2050 50  0001 C CNN
F 3 "" H 4800 2050 50  0001 C CNN
	1    4800 2050
	1    0    0    -1  
$EndComp
Wire Wire Line
	4800 2050 4800 2100
$Comp
L power:+3V3 #PWR0103
U 1 1 5DC13D33
P 4800 3950
F 0 "#PWR0103" H 4800 3800 50  0001 C CNN
F 1 "+3V3" H 4815 4123 50  0000 C CNN
F 2 "" H 4800 3950 50  0001 C CNN
F 3 "" H 4800 3950 50  0001 C CNN
	1    4800 3950
	-1   0    0    1   
$EndComp
Wire Wire Line
	4800 3950 4800 3900
$Comp
L Device:C C6
U 1 1 5DC6021F
P 4800 2650
F 0 "C6" H 4950 2650 50  0000 C CNN
F 1 "1uF" H 5000 2550 50  0000 C CNN
F 2 "Capacitor_SMD:C_0603_1608Metric_Pad1.05x0.95mm_HandSolder" H 4838 2500 50  0001 C CNN
F 3 "~" H 4800 2650 50  0001 C CNN
	1    4800 2650
	1    0    0    -1  
$EndComp
Wire Wire Line
	1300 2800 2100 2800
Wire Wire Line
	1300 2900 2100 2900
Wire Wire Line
	3850 2700 3950 2700
Wire Wire Line
	4250 2700 4300 2700
Wire Wire Line
	3800 2950 4600 2950
Wire Wire Line
	3850 3050 4600 3050
Wire Wire Line
	3800 3300 3950 3300
Wire Wire Line
	4250 3300 4300 3300
Connection ~ 3800 3300
Connection ~ 3850 2700
Wire Wire Line
	4800 2450 4800 2500
$Comp
L power:GND #PWR0104
U 1 1 5DC6B185
P 4800 2850
F 0 "#PWR0104" H 4800 2600 50  0001 C CNN
F 1 "GND" V 4805 2722 50  0000 R CNN
F 2 "" H 4800 2850 50  0001 C CNN
F 3 "" H 4800 2850 50  0001 C CNN
	1    4800 2850
	1    0    0    -1  
$EndComp
Wire Wire Line
	4800 2800 4800 2850
Text Notes 5150 2900 0    50   ~ 0
Timing of DTR and RTS\nis not correct. Therefore\nEN signal have to be\ndelayed a bit (400 us and\nup) -> 100 nF cover that
$EndSCHEMATC
