<?xml version="1.0" encoding="UTF-8" standalone="no"?>
<!-- Created with Inkscape (http://www.inkscape.org/) -->

<svg
   xmlns:osb="http://www.openswatchbook.org/uri/2009/osb"
   xmlns:dc="http://purl.org/dc/elements/1.1/"
   xmlns:cc="http://creativecommons.org/ns#"
   xmlns:rdf="http://www.w3.org/1999/02/22-rdf-syntax-ns#"
   xmlns:svg="http://www.w3.org/2000/svg"
   xmlns="http://www.w3.org/2000/svg"
   xmlns:xlink="http://www.w3.org/1999/xlink"
   xmlns:sodipodi="http://sodipodi.sourceforge.net/DTD/sodipodi-0.dtd"
   xmlns:inkscape="http://www.inkscape.org/namespaces/inkscape"
   width="210mm"
   height="297mm"
   viewBox="0 0 744.09448819 1052.3622047"
   id="svg2"
   version="1.1"
   inkscape:version="0.91 r13725"
   sodipodi:docname="wall_b.svg"
   inkscape:export-filename="/home/k1ll3r/rgb_led_cube_app/DOC/GUI_images_source/wall_b.png"
   inkscape:export-xdpi="6.1100001"
   inkscape:export-ydpi="6.1100001">
  <defs
     id="defs4">
    <linearGradient
       inkscape:collect="always"
       id="linearGradient16623">
      <stop
         style="stop-color:#ffffff;stop-opacity:1"
         offset="0"
         id="stop16625" />
      <stop
         style="stop-color:#ffffff;stop-opacity:0;"
         offset="1"
         id="stop16627" />
    </linearGradient>
    <linearGradient
       id="linearGradient16549"
       osb:paint="solid">
      <stop
         style="stop-color:#585858;stop-opacity:1;"
         offset="0"
         id="stop16551" />
    </linearGradient>
    <marker
       inkscape:stockid="TriangleInL"
       orient="auto"
       refY="0.0"
       refX="0.0"
       id="TriangleInL"
       style="overflow:visible"
       inkscape:isstock="true">
      <path
         id="path4300"
         d="M 5.77,0.0 L -2.88,5.0 L -2.88,-5.0 L 5.77,0.0 z "
         style="fill-rule:evenodd;stroke:#00ff00;stroke-width:1pt;stroke-opacity:1;fill:#00ff00;fill-opacity:1"
         transform="scale(-0.8)" />
    </marker>
    <marker
       inkscape:stockid="Arrow2Lstart"
       orient="auto"
       refY="0.0"
       refX="0.0"
       id="marker12710"
       style="overflow:visible"
       inkscape:isstock="true">
      <path
         id="path12712"
         style="fill-rule:evenodd;stroke-width:0.625;stroke-linejoin:round;stroke:#00ff0c;stroke-opacity:1;fill:#00ff0c;fill-opacity:1"
         d="M 8.7185878,4.0337352 L -2.2072895,0.016013256 L 8.7185884,-4.0017078 C 6.9730900,-1.6296469 6.9831476,1.6157441 8.7185878,4.0337352 z "
         transform="scale(1.1) translate(1,0)" />
    </marker>
    <marker
       inkscape:stockid="Arrow2Lstart"
       orient="auto"
       refY="0.0"
       refX="0.0"
       id="marker12658"
       style="overflow:visible"
       inkscape:isstock="true">
      <path
         id="path12660"
         style="fill-rule:evenodd;stroke-width:0.625;stroke-linejoin:round;stroke:#00ff0c;stroke-opacity:1;fill:#00ff0c;fill-opacity:1"
         d="M 8.7185878,4.0337352 L -2.2072895,0.016013256 L 8.7185884,-4.0017078 C 6.9730900,-1.6296469 6.9831476,1.6157441 8.7185878,4.0337352 z "
         transform="scale(1.1) translate(1,0)" />
    </marker>
    <marker
       inkscape:stockid="EmptyTriangleInL"
       orient="auto"
       refY="0.0"
       refX="0.0"
       id="EmptyTriangleInL"
       style="overflow:visible"
       inkscape:isstock="true">
      <path
         id="path4318"
         d="M 5.77,0.0 L -2.88,5.0 L -2.88,-5.0 L 5.77,0.0 z "
         style="fill-rule:evenodd;fill:#ffffff;stroke:#00ff0c;stroke-width:1pt;stroke-opacity:1"
         transform="scale(-0.8) translate(-6,0)" />
    </marker>
    <marker
       inkscape:stockid="Arrow2Lstart"
       orient="auto"
       refY="0.0"
       refX="0.0"
       id="Arrow2Lstart"
       style="overflow:visible"
       inkscape:isstock="true">
      <path
         id="path4185"
         style="fill-rule:evenodd;stroke-width:0.625;stroke-linejoin:round;stroke:#00ff0c;stroke-opacity:1;fill:#00ff0c;fill-opacity:1"
         d="M 8.7185878,4.0337352 L -2.2072895,0.016013256 L 8.7185884,-4.0017078 C 6.9730900,-1.6296469 6.9831476,1.6157441 8.7185878,4.0337352 z "
         transform="scale(1.1) translate(1,0)" />
    </marker>
    <marker
       inkscape:stockid="Arrow1Sstart"
       orient="auto"
       refY="0.0"
       refX="0.0"
       id="Arrow1Sstart"
       style="overflow:visible"
       inkscape:isstock="true">
      <path
         id="path4179"
         d="M 0.0,0.0 L 5.0,-5.0 L -12.5,0.0 L 5.0,5.0 L 0.0,0.0 z "
         style="fill-rule:evenodd;stroke:#00ff11;stroke-width:1pt;stroke-opacity:1;fill:#00ff11;fill-opacity:1"
         transform="scale(0.2) translate(6,0)" />
    </marker>
    <marker
       inkscape:stockid="Arrow1Mstart"
       orient="auto"
       refY="0.0"
       refX="0.0"
       id="Arrow1Mstart"
       style="overflow:visible"
       inkscape:isstock="true">
      <path
         id="path4173"
         d="M 0.0,0.0 L 5.0,-5.0 L -12.5,0.0 L 5.0,5.0 L 0.0,0.0 z "
         style="fill-rule:evenodd;stroke:#00ff11;stroke-width:1pt;stroke-opacity:1;fill:#00ff11;fill-opacity:1"
         transform="scale(0.4) translate(10,0)" />
    </marker>
    <marker
       inkscape:stockid="Arrow1Lstart"
       orient="auto"
       refY="0.0"
       refX="0.0"
       id="Arrow1Lstart"
       style="overflow:visible"
       inkscape:isstock="true">
      <path
         id="path4167"
         d="M 0.0,0.0 L 5.0,-5.0 L -12.5,0.0 L 5.0,5.0 L 0.0,0.0 z "
         style="fill-rule:evenodd;stroke:#00ff0c;stroke-width:1pt;stroke-opacity:1;fill:#00ff0c;fill-opacity:1"
         transform="scale(0.8) translate(12.5,0)" />
    </marker>
    <inkscape:perspective
       sodipodi:type="inkscape:persp3d"
       inkscape:vp_x="400 : 1000 : 1"
       inkscape:vp_y="-499.99999 : 866.0254 : 0"
       inkscape:vp_z="170 : 610.00001 : 1"
       inkscape:persp3d-origin="614.94776 : 435.9624 : 1"
       id="perspective3359" />
    <radialGradient
       inkscape:collect="always"
       xlink:href="#linearGradient16623"
       id="radialGradient6443"
       gradientUnits="userSpaceOnUse"
       gradientTransform="matrix(1,0,0,1.0714286,0,-29.81567)"
       cx="340"
       cy="412.69934"
       fx="340"
       fy="412.69934"
       r="146.94563" />
    <radialGradient
       inkscape:collect="always"
       xlink:href="#linearGradient16623"
       id="radialGradient6445"
       gradientUnits="userSpaceOnUse"
       gradientTransform="matrix(1,0,0,1.0714286,0,-29.81567)"
       cx="340"
       cy="412.69934"
       fx="340"
       fy="412.69934"
       r="146.94563" />
  </defs>
  <sodipodi:namedview
     id="base"
     pagecolor="#ffffff"
     bordercolor="#666666"
     borderopacity="1.0"
     inkscape:pageopacity="0.0"
     inkscape:pageshadow="2"
     inkscape:zoom="0.64"
     inkscape:cx="139.89789"
     inkscape:cy="653.76442"
     inkscape:document-units="px"
     inkscape:current-layer="layer2"
     showgrid="true"
     inkscape:window-width="1440"
     inkscape:window-height="845"
     inkscape:window-x="0"
     inkscape:window-y="0"
     inkscape:window-maximized="1"
     inkscape:object-nodes="true">
    <inkscape:grid
       type="xygrid"
       id="grid3355" />
  </sodipodi:namedview>
  <metadata
     id="metadata7">
    <rdf:RDF>
      <cc:Work
         rdf:about="">
        <dc:format>image/svg+xml</dc:format>
        <dc:type
           rdf:resource="http://purl.org/dc/dcmitype/StillImage" />
        <dc:title></dc:title>
      </cc:Work>
    </rdf:RDF>
  </metadata>
  <g
     inkscape:label="Border"
     inkscape:groupmode="layer"
     id="layer1"
     sodipodi:insensitive="true">
    <rect
       style="fill:#dcdcdc;fill-opacity:1;fill-rule:evenodd;stroke:#000000;stroke-width:1.56666672px;stroke-linecap:butt;stroke-linejoin:round;stroke-opacity:1"
       id="rect3405"
       width="470"
       height="470"
       x="110"
       y="182.36224"
       inkscape:export-xdpi="12.21"
       inkscape:export-ydpi="12.21" />
  </g>
  <g
     inkscape:groupmode="layer"
     id="layer3"
     inkscape:label="Cube_3D"
     sodipodi:insensitive="true">
    <path
       style="fill:none;fill-rule:evenodd;stroke:#000000;stroke-width:15;stroke-linecap:butt;stroke-linejoin:miter;stroke-miterlimit:4;stroke-dasharray:none;stroke-opacity:1"
       d="m 190,322.3622 260,0"
       id="path4250"
       inkscape:connector-curvature="0" />
    <path
       style="fill:none;fill-rule:evenodd;stroke:#000000;stroke-width:15;stroke-linecap:round;stroke-linejoin:round;stroke-miterlimit:4;stroke-dasharray:none;stroke-opacity:1"
       d="m 450,322.3622 0,260 -260,0"
       id="path4252"
       inkscape:connector-curvature="0" />
    <path
       style="fill:none;fill-rule:evenodd;stroke:#000000;stroke-width:15;stroke-linecap:butt;stroke-linejoin:miter;stroke-miterlimit:4;stroke-dasharray:none;stroke-opacity:1"
       d="m 190,322.3622 0,260"
       id="path4254"
       inkscape:connector-curvature="0" />
    <path
       style="fill:none;fill-rule:evenodd;stroke:#000000;stroke-width:15;stroke-linecap:round;stroke-linejoin:round;stroke-miterlimit:4;stroke-dasharray:none;stroke-opacity:1"
       d="m 190,322.3622 50,-70"
       id="path4273"
       inkscape:connector-curvature="0" />
    <path
       style="fill:none;fill-rule:evenodd;stroke:#000000;stroke-width:15;stroke-linecap:round;stroke-linejoin:round;stroke-miterlimit:4;stroke-dasharray:none;stroke-opacity:1"
       d="m 240,252.3622 260,0"
       id="path4275"
       inkscape:connector-curvature="0" />
    <path
       style="fill:none;fill-rule:evenodd;stroke:#000000;stroke-width:15;stroke-linecap:round;stroke-linejoin:round;stroke-miterlimit:4;stroke-dasharray:none;stroke-opacity:1"
       d="m 450,322.3622 50,-70 0,260 -50,70"
       id="path4277"
       inkscape:connector-curvature="0" />
    <g
       id="g4153">
      <path
         inkscape:connector-curvature="0"
         id="path4279"
         d="m 240,252.3622 0,260 -50,70"
         style="fill:none;fill-rule:evenodd;stroke:#000000;stroke-width:15;stroke-linecap:butt;stroke-linejoin:miter;stroke-miterlimit:4;stroke-dasharray:15, 15;stroke-dashoffset:0;stroke-opacity:1" />
      <path
         inkscape:connector-curvature="0"
         id="path4281"
         d="m 240,512.3622 260,0"
         style="fill:none;fill-rule:evenodd;stroke:#000000;stroke-width:15;stroke-linecap:butt;stroke-linejoin:miter;stroke-miterlimit:4;stroke-dasharray:15, 15;stroke-dashoffset:0;stroke-opacity:1" />
    </g>
  </g>
  <g
     inkscape:groupmode="layer"
     id="layer2"
     inkscape:label="colors">
    <path
       style="fill:#0000ff;fill-opacity:1;stroke:none;stroke-width:15;stroke-linecap:round;stroke-linejoin:round;stroke-miterlimit:4;stroke-dasharray:15, 15;stroke-dashoffset:0;stroke-opacity:1"
       d="m 205.77143,573.84643 c 0,-0.5581 -1.74014,-2.0902 -3.86699,-3.40467 l -3.86699,-2.38993 0,-118.68173 0,-118.68173 122.08641,0 122.0864,0 0,122.0864 0,122.08641 -118.21941,0 c -71.07762,0 -118.21942,-0.40465 -118.21942,-1.01475 z m 13.35435,-18.45028 c 2.52187,-3.41373 4.12951,-6.52114 3.57254,-6.90534 -0.55697,-0.38421 -3.31569,-2.31441 -6.1305,-4.28934 -2.8148,-1.97493 -5.52543,-3.57192 -6.02361,-3.54886 -0.49818,0.0231 -2.83842,2.82394 -5.20052,6.2242 -3.37956,4.86488 -3.96815,6.36897 -2.76213,7.05848 0.84292,0.48192 3.52133,2.39045 5.95201,4.24118 2.43068,1.85074 4.77662,3.37881 5.21321,3.39572 0.43658,0.0169 2.85713,-2.76232 5.379,-6.17604 z m 17.45224,-24.39375 4.46482,-6.29373 -5.75852,-4.16675 c -3.16718,-2.29171 -6.29736,-4.18278 -6.95594,-4.20238 -0.65858,-0.0196 -3.11587,2.74986 -5.46065,6.15438 -3.45243,5.01277 -3.96014,6.36315 -2.66957,7.1004 0.87651,0.50071 3.5824,2.42463 6.01308,4.27536 2.43068,1.85074 4.75299,3.37881 5.16069,3.39571 0.4077,0.0169 2.75044,-2.80143 5.20609,-6.26299 z m 18.91186,-18.56549 0,-8.28641 -3.86699,0 -3.86699,0 0,-6.0767 0,-6.0767 -7.73398,0 -7.73398,0 0,7.73398 0,7.73398 3.86699,0 3.86699,0 0,6.62913 0,6.62912 7.73398,0 7.73398,0 0,-8.2864 z m 29.83107,0 0,-8.28641 -7.73398,0 -7.73398,0 0,8.28641 0,8.2864 7.73398,0 7.73398,0 0,-8.2864 z m 29.83106,0 0,-8.28641 -7.73398,0 -7.73398,0 0,8.28641 0,8.2864 7.73398,0 7.73398,0 0,-8.2864 z m 29.83107,0 0,-8.28641 -7.73398,0 -7.73398,0 0,8.28641 0,8.2864 7.73398,0 7.73398,0 0,-8.2864 z m 30.70811,-0.27622 0.32462,-8.01019 -8.33481,0 -8.33481,0 0,8.33481 0,8.33481 8.01019,-0.32462 8.0102,-0.32461 0.32461,-8.0102 z m 30.05888,0.27622 0,-8.28641 -8.28641,0 -8.28641,0 0,8.28641 0,8.2864 8.28641,0 8.28641,0 0,-8.2864 z m 29.83107,-0.0484 0,-8.33481 -8.0102,0.32462 -8.01019,0.32462 -0.3359,6.50541 c -0.4855,9.40279 -0.38426,9.51496 8.58764,9.51496 l 7.76865,0 0,-8.33481 0,10e-6 z m -187.82524,-42.4885 0,-7.73398 -7.73398,0 -7.73398,0 0,7.73398 0,7.73398 7.73398,0 7.73398,0 0,-7.73398 z m 0,-29.83106 0,-7.73398 -7.73398,0 -7.73398,0 0,7.73398 0,7.73398 7.73398,0 7.73398,0 0,-7.73398 z m 0,-30.3835 0,-8.28641 -7.73398,0 -7.73398,0 0,8.28641 0,8.28641 7.73398,0 7.73398,0 0,-8.28641 z m 0,-29.83107 0,-8.2864 -7.73398,0 -7.73398,0 0,8.2864 0,8.28641 7.73398,0 7.73398,0 0,-8.28641 z m 0,-29.83106 0,-8.28641 -7.73398,0 -7.73398,0 0,8.28641 0,8.2864 7.73398,0 7.73398,0 0,-8.2864 z"
       id="path4472"
       inkscape:connector-curvature="0" />
    <path
       style="fill:url(#radialGradient6443);fill-opacity:1;stroke:none;stroke-width:15;stroke-linecap:round;stroke-linejoin:round;stroke-miterlimit:4;stroke-dasharray:15, 15;stroke-dashoffset:0;stroke-opacity:1"
       d="m 222.42216,290.91361 16.60878,-23.20194 4.36248,0 c 4.24912,0 4.36248,-0.10048 4.36248,-3.86699 l 0,-3.86699 118.32791,0 118.32791,0 -2.04199,3.13681 c -1.1231,1.72525 -9.73634,13.90627 -19.14055,27.06893 l -17.09856,23.93212 -99.18736,0 c -65.38834,0 -99.18736,-0.37649 -99.18736,-1.10485 0,-0.63135 -3.31456,-1.10486 -7.73398,-1.10486 -4.41942,0 -7.73398,0.47351 -7.73398,1.10486 0,0.67509 -5.149,1.10485 -13.23728,1.10485 l -13.23729,0 16.60879,-23.20194 z m 25.33374,-1.10485 0,-7.73398 -7.73398,0 -7.73398,0 0,7.73398 0,7.73398 7.73398,0 7.73398,0 0,-7.73398 z"
       id="path4474"
       inkscape:connector-curvature="0" />
    <path
       style="fill:url(#radialGradient6445);fill-opacity:1;stroke:none;stroke-width:15;stroke-linecap:round;stroke-linejoin:round;stroke-miterlimit:4;stroke-dasharray:15, 15;stroke-dashoffset:0;stroke-opacity:1"
       d="m 457.67822,539.13756 0,-18.41425 3.86699,0 3.86699,0 0,-8.2864 0,-8.28641 -3.86699,0 -3.86699,0 0,-89.31345 0,-89.31347 16.08337,-22.55304 c 8.84586,-12.40418 16.55222,-23.02537 17.12525,-23.60266 0.65264,-0.65749 1.04187,41.13419 1.04187,111.8665 l 0,112.91612 -6.0767,0 -6.0767,0 0,8.28641 c 0,7.53309 0.19968,8.2864 2.19639,8.2864 1.7554,0 -0.38109,3.60478 -10.64095,17.95389 -7.06054,9.87463 -13.02076,18.16104 -13.24494,18.41424 -0.22417,0.25319 -0.40759,-7.82606 -0.40759,-17.95388 z"
       id="path4476"
       inkscape:connector-curvature="0" />
  </g>
  <g
     inkscape:groupmode="layer"
     id="layer4"
     inkscape:label="arrows" />
</svg>
