EESchema Schematic File Version 4
EELAYER 30 0
EELAYER END
$Descr A4 11693 8268
encoding utf-8
Sheet 1 1
Title ""
Date ""
Rev ""
Comp ""
Comment1 ""
Comment2 ""
Comment3 ""
Comment4 ""
$EndDescr
$Comp
L MCU_Microchip_ATmega:ATmega16A-AU U1
U 1 1 61475D99
P 1950 3000
F 0 "U1" H 1500 1050 50  0000 C CNN
F 1 "ATmega16A-AU" H 2250 1050 50  0000 C CNN
F 2 "Package_QFP:TQFP-44_10x10mm_P0.8mm" H 1950 3000 50  0001 C CIN
F 3 "http://ww1.microchip.com/downloads/en/DeviceDoc/Atmel-8154-8-bit-AVR-ATmega16A_Datasheet.pdf" H 1950 3000 50  0001 C CNN
	1    1950 3000
	1    0    0    -1  
$EndComp
$Comp
L Device:R R6
U 1 1 61478ECE
P 3300 4000
F 0 "R6" V 3200 4000 50  0000 C CNN
F 1 "330R" V 3300 4000 50  0000 C CNN
F 2 "Resistor_SMD:R_0603_1608Metric_Pad1.05x0.95mm_HandSolder" V 3230 4000 50  0001 C CNN
F 3 "~" H 3300 4000 50  0001 C CNN
	1    3300 4000
	0    1    1    0   
$EndComp
Wire Wire Line
	2550 4000 3150 4000
Text Label 2550 4000 0    50   ~ 0
TX_PROTECTED
Text Label 3500 4000 0    50   ~ 0
TX
Wire Wire Line
	2550 2500 2600 2500
Text Label 2600 2500 0    50   ~ 0
IO_PWM_0
Wire Wire Line
	2550 4400 2600 4400
Text Label 2600 4400 0    50   ~ 0
IO_PWM_2
Wire Wire Line
	2550 4500 2600 4500
Text Label 2600 4500 0    50   ~ 0
IO_PWM_1
Wire Wire Line
	2550 4700 2600 4700
Text Label 2600 4700 0    50   ~ 0
IO_PWM_3
$Comp
L power:GND #PWR08
U 1 1 6147E065
P 1950 5000
F 0 "#PWR08" H 1950 4750 50  0001 C CNN
F 1 "GND" H 1955 4827 50  0000 C CNN
F 2 "" H 1950 5000 50  0001 C CNN
F 3 "" H 1950 5000 50  0001 C CNN
	1    1950 5000
	1    0    0    -1  
$EndComp
$Comp
L Device:R R1
U 1 1 6147F5B1
P 1050 1100
F 0 "R1" H 1120 1146 50  0000 L CNN
F 1 "10k" H 1120 1055 50  0000 L CNN
F 2 "Resistor_SMD:R_0603_1608Metric_Pad1.05x0.95mm_HandSolder" V 980 1100 50  0001 C CNN
F 3 "~" H 1050 1100 50  0001 C CNN
	1    1050 1100
	1    0    0    -1  
$EndComp
$Comp
L Device:C C1
U 1 1 6147FB33
P 1050 1500
F 0 "C1" H 800 1550 50  0000 L CNN
F 1 "10n" H 800 1450 50  0000 L CNN
F 2 "Capacitor_SMD:C_0603_1608Metric_Pad1.05x0.95mm_HandSolder" H 1088 1350 50  0001 C CNN
F 3 "~" H 1050 1500 50  0001 C CNN
	1    1050 1500
	1    0    0    -1  
$EndComp
Wire Wire Line
	1350 1300 1050 1300
Wire Wire Line
	1050 1300 1050 1250
Wire Wire Line
	1050 1350 1050 1300
Connection ~ 1050 1300
$Comp
L power:+3.3V #PWR01
U 1 1 61481850
P 1050 900
F 0 "#PWR01" H 1050 750 50  0001 C CNN
F 1 "+3.3V" H 1065 1073 50  0000 C CNN
F 2 "" H 1050 900 50  0001 C CNN
F 3 "" H 1050 900 50  0001 C CNN
	1    1050 900 
	1    0    0    -1  
$EndComp
Wire Wire Line
	1050 900  1050 950 
$Comp
L power:GND #PWR02
U 1 1 61483948
P 1050 1700
F 0 "#PWR02" H 1050 1450 50  0001 C CNN
F 1 "GND" H 1055 1527 50  0000 C CNN
F 2 "" H 1050 1700 50  0001 C CNN
F 3 "" H 1050 1700 50  0001 C CNN
	1    1050 1700
	1    0    0    -1  
$EndComp
Wire Wire Line
	1050 1700 1050 1650
$Comp
L power:+3.3V #PWR010
U 1 1 61484C63
P 2000 800
F 0 "#PWR010" H 2000 650 50  0001 C CNN
F 1 "+3.3V" H 2000 950 50  0000 C CNN
F 2 "" H 2000 800 50  0001 C CNN
F 3 "" H 2000 800 50  0001 C CNN
	1    2000 800 
	1    0    0    -1  
$EndComp
$Comp
L Device:C C3
U 1 1 6148585C
P 1700 950
F 0 "C3" V 1448 950 50  0000 C CNN
F 1 "100n" V 1539 950 50  0000 C CNN
F 2 "Capacitor_SMD:C_0603_1608Metric_Pad1.05x0.95mm_HandSolder" H 1738 800 50  0001 C CNN
F 3 "~" H 1700 950 50  0001 C CNN
	1    1700 950 
	0    1    1    0   
$EndComp
Wire Wire Line
	1850 950  1950 950 
Connection ~ 1950 950 
Wire Wire Line
	1950 950  1950 1000
$Comp
L Device:C C4
U 1 1 61486DFB
P 2300 950
F 0 "C4" V 2048 950 50  0000 C CNN
F 1 "100n" V 2139 950 50  0000 C CNN
F 2 "Capacitor_SMD:C_0603_1608Metric_Pad1.05x0.95mm_HandSolder" H 2338 800 50  0001 C CNN
F 3 "~" H 2300 950 50  0001 C CNN
	1    2300 950 
	0    1    1    0   
$EndComp
Wire Wire Line
	2150 950  2050 950 
Connection ~ 2050 950 
Wire Wire Line
	2050 950  2050 1000
$Comp
L power:GND #PWR06
U 1 1 614877AC
P 1500 950
F 0 "#PWR06" H 1500 700 50  0001 C CNN
F 1 "GND" V 1505 822 50  0000 R CNN
F 2 "" H 1500 950 50  0001 C CNN
F 3 "" H 1500 950 50  0001 C CNN
	1    1500 950 
	0    1    1    0   
$EndComp
Wire Wire Line
	1500 950  1550 950 
$Comp
L power:GND #PWR012
U 1 1 61488859
P 2500 950
F 0 "#PWR012" H 2500 700 50  0001 C CNN
F 1 "GND" V 2505 822 50  0000 R CNN
F 2 "" H 2500 950 50  0001 C CNN
F 3 "" H 2500 950 50  0001 C CNN
	1    2500 950 
	0    -1   -1   0   
$EndComp
Wire Wire Line
	2500 950  2450 950 
NoConn ~ 1350 1500
NoConn ~ 1350 1700
$Comp
L Regulator_Linear:AMS1117-3.3 U2
U 1 1 6148CB3B
P 1950 5700
F 0 "U2" H 1950 5942 50  0000 C CNN
F 1 "AMS1117-3.3" H 1950 5851 50  0000 C CNN
F 2 "Package_TO_SOT_SMD:SOT-223-3_TabPin2" H 1950 5900 50  0001 C CNN
F 3 "http://www.advanced-monolithic.com/pdf/ds1117.pdf" H 2050 5450 50  0001 C CNN
	1    1950 5700
	1    0    0    -1  
$EndComp
$Comp
L power:GND #PWR09
U 1 1 6148EF69
P 1950 6200
F 0 "#PWR09" H 1950 5950 50  0001 C CNN
F 1 "GND" H 1955 6027 50  0000 C CNN
F 2 "" H 1950 6200 50  0001 C CNN
F 3 "" H 1950 6200 50  0001 C CNN
	1    1950 6200
	1    0    0    -1  
$EndComp
$Comp
L power:+3.3V #PWR013
U 1 1 6148FDE8
P 2850 5650
F 0 "#PWR013" H 2850 5500 50  0001 C CNN
F 1 "+3.3V" V 2850 5900 50  0000 C CNN
F 2 "" H 2850 5650 50  0001 C CNN
F 3 "" H 2850 5650 50  0001 C CNN
	1    2850 5650
	1    0    0    -1  
$EndComp
$Comp
L Device:C C5
U 1 1 6149194F
P 2300 5900
F 0 "C5" H 2185 5854 50  0000 R CNN
F 1 "100n" H 2185 5945 50  0000 R CNN
F 2 "Capacitor_SMD:C_0603_1608Metric_Pad1.05x0.95mm_HandSolder" H 2338 5750 50  0001 C CNN
F 3 "~" H 2300 5900 50  0001 C CNN
	1    2300 5900
	-1   0    0    1   
$EndComp
$Comp
L Device:C C6
U 1 1 61492EAF
P 2700 5900
F 0 "C6" H 2585 5854 50  0000 R CNN
F 1 "3.3u" H 2585 5945 50  0000 R CNN
F 2 "Capacitor_SMD:C_1812_4532Metric_Pad1.30x3.40mm_HandSolder" H 2738 5750 50  0001 C CNN
F 3 "~" H 2700 5900 50  0001 C CNN
	1    2700 5900
	-1   0    0    1   
$EndComp
$Comp
L Device:C C2
U 1 1 6149330D
P 1600 5900
F 0 "C2" H 1750 5800 50  0000 R CNN
F 1 "100n" H 1900 5900 50  0000 R CNN
F 2 "Capacitor_SMD:C_0603_1608Metric_Pad1.05x0.95mm_HandSolder" H 1638 5750 50  0001 C CNN
F 3 "~" H 1600 5900 50  0001 C CNN
	1    1600 5900
	-1   0    0    1   
$EndComp
Wire Wire Line
	1650 5700 1600 5700
Wire Wire Line
	1600 5750 1600 5700
Connection ~ 1600 5700
Wire Wire Line
	1600 5700 1350 5700
Wire Wire Line
	1600 6050 1600 6100
Wire Wire Line
	1600 6100 1950 6100
Wire Wire Line
	2300 6100 2300 6050
Wire Wire Line
	2700 6050 2700 6100
Wire Wire Line
	2700 6100 2300 6100
Connection ~ 2300 6100
Wire Wire Line
	2850 5650 2850 5700
Wire Wire Line
	2850 5700 2700 5700
Wire Wire Line
	2300 5750 2300 5700
Connection ~ 2300 5700
Wire Wire Line
	2300 5700 2250 5700
Wire Wire Line
	2700 5750 2700 5700
Connection ~ 2700 5700
Wire Wire Line
	2700 5700 2300 5700
Wire Wire Line
	1950 6000 1950 6100
Connection ~ 1950 6100
Wire Wire Line
	1950 6100 2300 6100
Wire Wire Line
	1950 6100 1950 6200
$Comp
L power:VCC #PWR05
U 1 1 61497BE0
P 800 5550
F 0 "#PWR05" H 800 5400 50  0001 C CNN
F 1 "VCC" H 817 5723 50  0000 C CNN
F 2 "" H 800 5550 50  0001 C CNN
F 3 "" H 800 5550 50  0001 C CNN
	1    800  5550
	1    0    0    -1  
$EndComp
$Comp
L Display_Character:SA39-11EWA U3
U 1 1 614A1471
P 8400 1250
F 0 "U3" H 8400 1917 50  0000 C CNN
F 1 "SA39-11EWA" H 8400 1826 50  0000 C CNN
F 2 "Display_7Segment:Sx39-1xxxxx" H 8400 700 50  0001 C CNN
F 3 "http://www.kingbrightusa.com/images/catalog/SPEC/sa39-11ewa.pdf" H 8400 1250 50  0001 C CNN
	1    8400 1250
	1    0    0    -1  
$EndComp
$Comp
L Device:R R2
U 1 1 614AE9DC
P 3250 1300
F 0 "R2" V 3200 1100 50  0000 C CNN
F 1 "220R" V 3250 1300 50  0000 C CNN
F 2 "Resistor_SMD:R_0603_1608Metric_Pad1.05x0.95mm_HandSolder" V 3180 1300 50  0001 C CNN
F 3 "~" H 3250 1300 50  0001 C CNN
	1    3250 1300
	0    1    1    0   
$EndComp
Wire Wire Line
	2550 1300 3100 1300
Wire Wire Line
	2550 1400 3400 1400
Wire Wire Line
	2550 1500 3100 1500
Wire Wire Line
	2550 1600 3400 1600
Wire Wire Line
	2550 1700 3100 1700
Wire Wire Line
	3400 1800 2550 1800
Wire Wire Line
	2550 1900 3100 1900
Wire Wire Line
	3400 2000 2550 2000
$Comp
L Device:R R8
U 1 1 614B8AC0
P 3550 1400
F 0 "R8" V 3500 1550 50  0000 C CNN
F 1 "220R" V 3550 1400 50  0000 C CNN
F 2 "Resistor_SMD:R_0603_1608Metric_Pad1.05x0.95mm_HandSolder" V 3480 1400 50  0001 C CNN
F 3 "~" H 3550 1400 50  0001 C CNN
	1    3550 1400
	0    1    1    0   
$EndComp
$Comp
L Device:R R3
U 1 1 614B8DAD
P 3250 1500
F 0 "R3" V 3200 1300 50  0000 C CNN
F 1 "220R" V 3250 1500 50  0000 C CNN
F 2 "Resistor_SMD:R_0603_1608Metric_Pad1.05x0.95mm_HandSolder" V 3180 1500 50  0001 C CNN
F 3 "~" H 3250 1500 50  0001 C CNN
	1    3250 1500
	0    1    1    0   
$EndComp
$Comp
L Device:R R9
U 1 1 614B9069
P 3550 1600
F 0 "R9" V 3500 1750 50  0000 C CNN
F 1 "220R" V 3550 1600 50  0000 C CNN
F 2 "Resistor_SMD:R_0603_1608Metric_Pad1.05x0.95mm_HandSolder" V 3480 1600 50  0001 C CNN
F 3 "~" H 3550 1600 50  0001 C CNN
	1    3550 1600
	0    1    1    0   
$EndComp
$Comp
L Device:R R4
U 1 1 614B93E5
P 3250 1700
F 0 "R4" V 3200 1500 50  0000 C CNN
F 1 "220R" V 3250 1700 50  0000 C CNN
F 2 "Resistor_SMD:R_0603_1608Metric_Pad1.05x0.95mm_HandSolder" V 3180 1700 50  0001 C CNN
F 3 "~" H 3250 1700 50  0001 C CNN
	1    3250 1700
	0    1    1    0   
$EndComp
$Comp
L Device:R R10
U 1 1 614B9675
P 3550 1800
F 0 "R10" V 3500 2000 50  0000 C CNN
F 1 "220R" V 3550 1800 50  0000 C CNN
F 2 "Resistor_SMD:R_0603_1608Metric_Pad1.05x0.95mm_HandSolder" V 3480 1800 50  0001 C CNN
F 3 "~" H 3550 1800 50  0001 C CNN
	1    3550 1800
	0    1    1    0   
$EndComp
$Comp
L Device:R R5
U 1 1 614B9A29
P 3250 1900
F 0 "R5" V 3200 1700 50  0000 C CNN
F 1 "220R" V 3250 1900 50  0000 C CNN
F 2 "Resistor_SMD:R_0603_1608Metric_Pad1.05x0.95mm_HandSolder" V 3180 1900 50  0001 C CNN
F 3 "~" H 3250 1900 50  0001 C CNN
	1    3250 1900
	0    1    1    0   
$EndComp
$Comp
L Device:R R11
U 1 1 614B9D6C
P 3550 2000
F 0 "R11" V 3500 2200 50  0000 C CNN
F 1 "220R" V 3550 2000 50  0000 C CNN
F 2 "Resistor_SMD:R_0603_1608Metric_Pad1.05x0.95mm_HandSolder" V 3480 2000 50  0001 C CNN
F 3 "~" H 3550 2000 50  0001 C CNN
	1    3550 2000
	0    1    1    0   
$EndComp
$Comp
L Transistor_BJT:BC817 Q6
U 1 1 614BAEBB
P 8650 1900
F 0 "Q6" H 8500 2000 50  0000 L CNN
F 1 "BC817" H 8450 2100 50  0000 L CNN
F 2 "Package_TO_SOT_SMD:SOT-23_Handsoldering" H 8850 1825 50  0001 L CIN
F 3 "http://www.fairchildsemi.com/ds/BC/BC817.pdf" H 8650 1900 50  0001 L CNN
	1    8650 1900
	1    0    0    1   
$EndComp
Wire Wire Line
	2550 3700 2600 3700
Wire Wire Line
	2550 3800 2600 3800
Text Label 2600 3800 0    50   ~ 0
IO_SEGMENT_SEL_H
Text Label 2600 3700 0    50   ~ 0
IO_SEGMENT_SEL_L
$Comp
L Display_Character:SA39-11EWA U4
U 1 1 614D0B5C
P 9400 1250
F 0 "U4" H 9400 1917 50  0000 C CNN
F 1 "SA39-11EWA" H 9400 1826 50  0000 C CNN
F 2 "Display_7Segment:Sx39-1xxxxx" H 9400 700 50  0001 C CNN
F 3 "http://www.kingbrightusa.com/images/catalog/SPEC/sa39-11ewa.pdf" H 9400 1250 50  0001 C CNN
	1    9400 1250
	-1   0    0    -1  
$EndComp
$Comp
L Transistor_BJT:BC817 Q7
U 1 1 614D3184
P 9150 1900
F 0 "Q7" H 9000 2000 50  0000 L CNN
F 1 "BC817" H 8950 2100 50  0000 L CNN
F 2 "Package_TO_SOT_SMD:SOT-23_Handsoldering" H 9350 1825 50  0001 L CIN
F 3 "http://www.fairchildsemi.com/ds/BC/BC817.pdf" H 9150 1900 50  0001 L CNN
	1    9150 1900
	-1   0    0    1   
$EndComp
Wire Wire Line
	8750 2100 8750 2150
$Comp
L power:+3.3V #PWR022
U 1 1 614D8E57
P 8900 2100
F 0 "#PWR022" H 8900 1950 50  0001 C CNN
F 1 "+3.3V" V 8900 2350 50  0000 C CNN
F 2 "" H 8900 2100 50  0001 C CNN
F 3 "" H 8900 2100 50  0001 C CNN
	1    8900 2100
	1    0    0    -1  
$EndComp
Wire Wire Line
	9050 2100 9050 2150
Wire Wire Line
	9050 2150 8900 2150
Wire Wire Line
	8900 2100 8900 2150
Connection ~ 8900 2150
Wire Wire Line
	8900 2150 8750 2150
Wire Wire Line
	8700 1550 8750 1550
Wire Wire Line
	8750 1550 8750 1650
Wire Wire Line
	8700 1650 8750 1650
Connection ~ 8750 1650
Wire Wire Line
	8750 1650 8750 1700
Wire Wire Line
	9100 1550 9050 1550
Wire Wire Line
	9050 1550 9050 1650
Wire Wire Line
	9100 1650 9050 1650
Connection ~ 9050 1650
Wire Wire Line
	9050 1650 9050 1700
$Comp
L Device:R R19
U 1 1 614E6B69
P 8250 1900
F 0 "R19" V 8150 1900 50  0000 C CNN
F 1 "2k2" V 8050 1900 50  0000 C CNN
F 2 "Resistor_SMD:R_0603_1608Metric_Pad1.05x0.95mm_HandSolder" V 8180 1900 50  0001 C CNN
F 3 "~" H 8250 1900 50  0001 C CNN
	1    8250 1900
	0    -1   -1   0   
$EndComp
Wire Wire Line
	8400 1900 8450 1900
$Comp
L Device:R R20
U 1 1 614EA385
P 9550 1900
F 0 "R20" V 9450 1900 50  0000 C CNN
F 1 "2k2" V 9350 1900 50  0000 C CNN
F 2 "Resistor_SMD:R_0603_1608Metric_Pad1.05x0.95mm_HandSolder" V 9480 1900 50  0001 C CNN
F 3 "~" H 9550 1900 50  0001 C CNN
	1    9550 1900
	0    -1   -1   0   
$EndComp
Wire Wire Line
	9350 1900 9400 1900
Wire Wire Line
	8100 1900 8050 1900
Wire Wire Line
	9700 1900 9750 1900
Text Label 9750 1900 0    50   ~ 0
IO_SEGMENT_SEL_L
Text Label 8050 1900 2    50   ~ 0
IO_SEGMENT_SEL_H
Wire Bus Line
	7100 500  10650 500 
Wire Bus Line
	7100 500  4850 500 
Connection ~ 7100 500 
Entry Wire Line
	4750 1300 4850 1200
Wire Wire Line
	4750 1300 3400 1300
Entry Wire Line
	7100 1550 7200 1650
Entry Wire Line
	7100 1450 7200 1550
Entry Wire Line
	7100 1350 7200 1450
Wire Wire Line
	7200 1450 8100 1450
Wire Wire Line
	8100 1550 7200 1550
Wire Wire Line
	8100 1650 7200 1650
Text Label 7250 1650 0    50   ~ 0
IO_SEGMENT_DP
Text Label 7250 1550 0    50   ~ 0
IO_SEGMENT_G
Text Label 7250 1450 0    50   ~ 0
IO_SEGMENT_F
Entry Wire Line
	7100 1250 7200 1350
Entry Wire Line
	7100 1150 7200 1250
Entry Wire Line
	7100 1050 7200 1150
Entry Wire Line
	7100 950  7200 1050
Entry Wire Line
	7100 850  7200 950 
Wire Wire Line
	7200 1350 8100 1350
Wire Wire Line
	8100 1250 7200 1250
Wire Wire Line
	7200 1150 8100 1150
Wire Wire Line
	8100 1050 7200 1050
Wire Wire Line
	7200 950  8100 950 
Text Label 7250 1350 0    50   ~ 0
IO_SEGMENT_E
Text Label 7250 1250 0    50   ~ 0
IO_SEGMENT_D
Text Label 7250 1150 0    50   ~ 0
IO_SEGMENT_C
Text Label 7250 1050 0    50   ~ 0
IO_SEGMENT_B
Text Label 7250 950  0    50   ~ 0
IO_SEGMENT_A
Entry Wire Line
	10550 1650 10650 1550
Entry Wire Line
	10550 1550 10650 1450
Entry Wire Line
	10550 1450 10650 1350
Entry Wire Line
	10550 1350 10650 1250
Entry Wire Line
	10550 1250 10650 1150
Entry Wire Line
	10550 1150 10650 1050
Entry Wire Line
	10550 1050 10650 950 
Entry Wire Line
	10550 950  10650 850 
Wire Wire Line
	10550 950  9700 950 
Wire Wire Line
	9700 1050 10550 1050
Wire Wire Line
	9700 1150 10550 1150
Wire Wire Line
	10550 1250 9700 1250
Wire Wire Line
	10550 1350 9700 1350
Wire Wire Line
	9700 1450 10550 1450
Wire Wire Line
	10550 1550 9700 1550
Wire Wire Line
	9700 1650 10550 1650
Text Label 9750 1650 0    50   ~ 0
IO_SEGMENT_DP
Text Label 9750 1550 0    50   ~ 0
IO_SEGMENT_G
Text Label 9750 1450 0    50   ~ 0
IO_SEGMENT_F
Text Label 9750 1350 0    50   ~ 0
IO_SEGMENT_E
Text Label 9750 1250 0    50   ~ 0
IO_SEGMENT_D
Text Label 9750 1150 0    50   ~ 0
IO_SEGMENT_C
Text Label 9750 1050 0    50   ~ 0
IO_SEGMENT_B
Text Label 9750 950  0    50   ~ 0
IO_SEGMENT_A
Entry Wire Line
	4750 1400 4850 1300
Entry Wire Line
	4750 1500 4850 1400
Entry Wire Line
	4750 1600 4850 1500
Entry Wire Line
	4750 1700 4850 1600
Entry Wire Line
	4750 1900 4850 1800
Entry Wire Line
	4750 2000 4850 1900
Entry Wire Line
	4750 1800 4850 1700
Wire Wire Line
	4750 2000 3700 2000
Wire Wire Line
	3400 1900 4750 1900
Wire Wire Line
	3700 1800 4750 1800
Wire Wire Line
	3400 1700 4750 1700
Wire Wire Line
	3700 1600 4750 1600
Wire Wire Line
	3400 1500 4750 1500
Wire Wire Line
	4750 1400 3700 1400
Text Label 3850 2000 0    50   ~ 0
IO_SEGMENT_DP
$Comp
L Transistor_FET:IRF9540N Q5
U 1 1 6157B3AA
P 9650 3150
F 0 "Q5" H 9854 3196 50  0000 L CNN
F 1 "IRF4905PBF" H 9854 3105 50  0000 L CNN
F 2 "Package_TO_SOT_THT:TO-220-3_Horizontal_TabDown" H 9850 3075 50  0001 L CIN
F 3 "http://www.irf.com/product-info/datasheets/data/irf9540n.pdf" H 9650 3150 50  0001 L CNN
	1    9650 3150
	1    0    0    1   
$EndComp
Text Notes 9800 3300 0    50   ~ 0
Rds_on = 0.02 Ohm
$Comp
L Connector_Generic:Conn_01x04 J2
U 1 1 61588B57
P 850 7500
F 0 "J2" H 768 7817 50  0000 C CNN
F 1 "Input trigger" H 768 7726 50  0000 C CNN
F 2 "Connector_PinHeader_2.54mm:PinHeader_1x04_P2.54mm_Horizontal" H 850 7500 50  0001 C CNN
F 3 "~" H 850 7500 50  0001 C CNN
	1    850  7500
	-1   0    0    -1  
$EndComp
$Comp
L Connector_Generic:Conn_01x02 J1
U 1 1 615979A0
P 850 6450
F 0 "J1" H 900 6150 50  0000 C CNN
F 1 "PWR supply" H 950 6250 50  0000 C CNN
F 2 "Connector_PinHeader_2.54mm:PinHeader_1x02_P2.54mm_Vertical" H 850 6450 50  0001 C CNN
F 3 "~" H 850 6450 50  0001 C CNN
	1    850  6450
	-1   0    0    1   
$EndComp
$Comp
L power:GND #PWR04
U 1 1 61598487
P 1100 6500
F 0 "#PWR04" H 1100 6250 50  0001 C CNN
F 1 "GND" H 1105 6327 50  0000 C CNN
F 2 "" H 1100 6500 50  0001 C CNN
F 3 "" H 1100 6500 50  0001 C CNN
	1    1100 6500
	1    0    0    -1  
$EndComp
Wire Wire Line
	1050 6450 1100 6450
Wire Wire Line
	1100 6450 1100 6500
$Comp
L power:+BATT #PWR03
U 1 1 6159B238
P 1100 6250
F 0 "#PWR03" H 1100 6100 50  0001 C CNN
F 1 "+BATT" H 1115 6423 50  0000 C CNN
F 2 "" H 1100 6250 50  0001 C CNN
F 3 "" H 1100 6250 50  0001 C CNN
	1    1100 6250
	1    0    0    -1  
$EndComp
Wire Wire Line
	1100 6250 1100 6350
Wire Wire Line
	1100 6350 1050 6350
Text Notes 1150 6300 0    50   ~ 0
Hot all times
$Comp
L Diode:B140-E3 D1
U 1 1 615AABC8
P 1500 7150
F 0 "D1" H 1500 6950 50  0000 L CNN
F 1 "B140-E3" H 1350 7050 50  0000 L CNN
F 2 "Diode_SMD:D_SMA" H 1500 6975 50  0001 C CNN
F 3 "http://www.vishay.com/docs/88946/b120.pdf" H 1500 7150 50  0001 C CNN
	1    1500 7150
	0    1    1    0   
$EndComp
$Comp
L Diode:B140-E3 D2
U 1 1 615B658B
P 1850 7150
F 0 "D2" H 1850 6950 50  0000 L CNN
F 1 "B140-E3" H 1700 7050 50  0000 L CNN
F 2 "Diode_SMD:D_SMA" H 1850 6975 50  0001 C CNN
F 3 "http://www.vishay.com/docs/88946/b120.pdf" H 1850 7150 50  0001 C CNN
	1    1850 7150
	0    1    1    0   
$EndComp
$Comp
L Diode:B140-E3 D3
U 1 1 615B719C
P 2200 7150
F 0 "D3" H 2200 6950 50  0000 L CNN
F 1 "B140-E3" H 2050 7050 50  0000 L CNN
F 2 "Diode_SMD:D_SMA" H 2200 6975 50  0001 C CNN
F 3 "http://www.vishay.com/docs/88946/b120.pdf" H 2200 7150 50  0001 C CNN
	1    2200 7150
	0    1    1    0   
$EndComp
$Comp
L Diode:B140-E3 D4
U 1 1 615B790E
P 2550 7150
F 0 "D4" H 2550 6950 50  0000 L CNN
F 1 "B140-E3" H 2400 7050 50  0000 L CNN
F 2 "Diode_SMD:D_SMA" H 2550 6975 50  0001 C CNN
F 3 "http://www.vishay.com/docs/88946/b120.pdf" H 2550 7150 50  0001 C CNN
	1    2550 7150
	0    1    1    0   
$EndComp
Wire Wire Line
	1050 7400 1500 7400
Wire Wire Line
	1500 7300 1500 7400
Connection ~ 1500 7400
Wire Wire Line
	1050 7500 1850 7500
Wire Wire Line
	1050 7600 2200 7600
Wire Wire Line
	1050 7700 2550 7700
Wire Wire Line
	1850 7300 1850 7500
Connection ~ 1850 7500
Wire Wire Line
	2200 7300 2200 7600
Connection ~ 2200 7600
Wire Wire Line
	2550 7300 2550 7700
Connection ~ 2550 7700
$Comp
L power:VCC #PWR011
U 1 1 615D0655
P 2050 6900
F 0 "#PWR011" H 2050 6750 50  0001 C CNN
F 1 "VCC" H 2067 7073 50  0000 C CNN
F 2 "" H 2050 6900 50  0001 C CNN
F 3 "" H 2050 6900 50  0001 C CNN
	1    2050 6900
	1    0    0    -1  
$EndComp
Wire Wire Line
	1500 7000 1500 6950
Wire Wire Line
	1500 6950 1850 6950
Wire Wire Line
	2550 6950 2550 7000
Wire Wire Line
	2050 6900 2050 6950
Connection ~ 2050 6950
Wire Wire Line
	2050 6950 2200 6950
Wire Wire Line
	1850 7000 1850 6950
Connection ~ 1850 6950
Wire Wire Line
	1850 6950 2050 6950
Wire Wire Line
	2200 7000 2200 6950
Connection ~ 2200 6950
Wire Wire Line
	2200 6950 2550 6950
$Comp
L Device:R R12
U 1 1 615E7034
P 3900 7150
F 0 "R12" H 3830 7104 50  0000 R CNN
F 1 "22k" H 3830 7195 50  0000 R CNN
F 2 "Resistor_SMD:R_0603_1608Metric_Pad1.05x0.95mm_HandSolder" V 3830 7150 50  0001 C CNN
F 3 "~" H 3900 7150 50  0001 C CNN
	1    3900 7150
	-1   0    0    1   
$EndComp
$Comp
L Device:R R14
U 1 1 615E8EB9
P 4700 6800
F 0 "R14" H 4630 6754 50  0000 R CNN
F 1 "22k" H 4630 6845 50  0000 R CNN
F 2 "Resistor_SMD:R_0603_1608Metric_Pad1.05x0.95mm_HandSolder" V 4630 6800 50  0001 C CNN
F 3 "~" H 4700 6800 50  0001 C CNN
	1    4700 6800
	-1   0    0    1   
$EndComp
$Comp
L Device:R R16
U 1 1 615E918F
P 5550 6450
F 0 "R16" H 5480 6404 50  0000 R CNN
F 1 "22k" H 5480 6495 50  0000 R CNN
F 2 "Resistor_SMD:R_0603_1608Metric_Pad1.05x0.95mm_HandSolder" V 5480 6450 50  0001 C CNN
F 3 "~" H 5550 6450 50  0001 C CNN
	1    5550 6450
	-1   0    0    1   
$EndComp
$Comp
L Device:R R18
U 1 1 615E9845
P 6400 6150
F 0 "R18" H 6330 6104 50  0000 R CNN
F 1 "22k" H 6330 6195 50  0000 R CNN
F 2 "Resistor_SMD:R_0603_1608Metric_Pad1.05x0.95mm_HandSolder" V 6330 6150 50  0001 C CNN
F 3 "~" H 6400 6150 50  0001 C CNN
	1    6400 6150
	-1   0    0    1   
$EndComp
$Comp
L Transistor_BJT:BC817 Q1
U 1 1 615F9188
P 3900 6750
F 0 "Q1" V 4200 6700 50  0000 L CNN
F 1 "BC817" V 4100 6650 50  0000 L CNN
F 2 "Package_TO_SOT_SMD:SOT-23_Handsoldering" H 4100 6675 50  0001 L CIN
F 3 "http://www.fairchildsemi.com/ds/BC/BC817.pdf" H 3900 6750 50  0001 L CNN
	1    3900 6750
	0    -1   -1   0   
$EndComp
$Comp
L Device:R R7
U 1 1 6160057C
P 3450 6650
F 0 "R7" V 3657 6650 50  0000 C CNN
F 1 "10k" V 3566 6650 50  0000 C CNN
F 2 "Resistor_SMD:R_0603_1608Metric_Pad1.05x0.95mm_HandSolder" V 3380 6650 50  0001 C CNN
F 3 "~" H 3450 6650 50  0001 C CNN
	1    3450 6650
	0    -1   -1   0   
$EndComp
$Comp
L power:+3.3V #PWR014
U 1 1 61605132
P 3250 6600
F 0 "#PWR014" H 3250 6450 50  0001 C CNN
F 1 "+3.3V" V 3250 6850 50  0000 C CNN
F 2 "" H 3250 6600 50  0001 C CNN
F 3 "" H 3250 6600 50  0001 C CNN
	1    3250 6600
	1    0    0    -1  
$EndComp
Wire Wire Line
	3250 6600 3250 6650
Wire Wire Line
	3250 6650 3300 6650
$Comp
L power:GND #PWR016
U 1 1 616150BC
P 4150 6700
F 0 "#PWR016" H 4150 6450 50  0001 C CNN
F 1 "GND" H 4155 6527 50  0000 C CNN
F 2 "" H 4150 6700 50  0001 C CNN
F 3 "" H 4150 6700 50  0001 C CNN
	1    4150 6700
	1    0    0    -1  
$EndComp
Wire Wire Line
	4100 6650 4150 6650
Wire Wire Line
	4150 6650 4150 6700
Wire Wire Line
	3600 6650 3650 6650
Wire Wire Line
	3650 6650 3650 6550
Connection ~ 3650 6650
Wire Wire Line
	3650 6650 3700 6650
Text Label 3650 6550 1    50   ~ 0
IO_INPUT_TRIG_0
$Comp
L Transistor_BJT:BC817 Q2
U 1 1 61641159
P 4700 6400
F 0 "Q2" V 5000 6350 50  0000 L CNN
F 1 "BC817" V 4900 6300 50  0000 L CNN
F 2 "Package_TO_SOT_SMD:SOT-23_Handsoldering" H 4900 6325 50  0001 L CIN
F 3 "http://www.fairchildsemi.com/ds/BC/BC817.pdf" H 4700 6400 50  0001 L CNN
	1    4700 6400
	0    -1   -1   0   
$EndComp
$Comp
L Device:R R13
U 1 1 6164115F
P 4250 6300
F 0 "R13" V 4457 6300 50  0000 C CNN
F 1 "10k" V 4366 6300 50  0000 C CNN
F 2 "Resistor_SMD:R_0603_1608Metric_Pad1.05x0.95mm_HandSolder" V 4180 6300 50  0001 C CNN
F 3 "~" H 4250 6300 50  0001 C CNN
	1    4250 6300
	0    -1   -1   0   
$EndComp
$Comp
L power:+3.3V #PWR015
U 1 1 61641165
P 4050 6250
F 0 "#PWR015" H 4050 6100 50  0001 C CNN
F 1 "+3.3V" V 4050 6500 50  0000 C CNN
F 2 "" H 4050 6250 50  0001 C CNN
F 3 "" H 4050 6250 50  0001 C CNN
	1    4050 6250
	1    0    0    -1  
$EndComp
Wire Wire Line
	4050 6250 4050 6300
Wire Wire Line
	4050 6300 4100 6300
$Comp
L power:GND #PWR018
U 1 1 6164116D
P 4950 6350
F 0 "#PWR018" H 4950 6100 50  0001 C CNN
F 1 "GND" H 4955 6177 50  0000 C CNN
F 2 "" H 4950 6350 50  0001 C CNN
F 3 "" H 4950 6350 50  0001 C CNN
	1    4950 6350
	1    0    0    -1  
$EndComp
Wire Wire Line
	4900 6300 4950 6300
Wire Wire Line
	4950 6300 4950 6350
Wire Wire Line
	4400 6300 4450 6300
Wire Wire Line
	4450 6300 4450 6200
Connection ~ 4450 6300
Wire Wire Line
	4450 6300 4500 6300
Text Label 4450 6200 1    50   ~ 0
IO_INPUT_TRIG_1
$Comp
L Transistor_BJT:BC817 Q3
U 1 1 61646D24
P 5550 6050
F 0 "Q3" V 5850 6000 50  0000 L CNN
F 1 "BC817" V 5750 5950 50  0000 L CNN
F 2 "Package_TO_SOT_SMD:SOT-23_Handsoldering" H 5750 5975 50  0001 L CIN
F 3 "http://www.fairchildsemi.com/ds/BC/BC817.pdf" H 5550 6050 50  0001 L CNN
	1    5550 6050
	0    -1   -1   0   
$EndComp
$Comp
L Device:R R15
U 1 1 61646D2A
P 5100 5950
F 0 "R15" V 5307 5950 50  0000 C CNN
F 1 "10k" V 5216 5950 50  0000 C CNN
F 2 "Resistor_SMD:R_0603_1608Metric_Pad1.05x0.95mm_HandSolder" V 5030 5950 50  0001 C CNN
F 3 "~" H 5100 5950 50  0001 C CNN
	1    5100 5950
	0    -1   -1   0   
$EndComp
$Comp
L power:+3.3V #PWR017
U 1 1 61646D30
P 4900 5900
F 0 "#PWR017" H 4900 5750 50  0001 C CNN
F 1 "+3.3V" V 4900 6150 50  0000 C CNN
F 2 "" H 4900 5900 50  0001 C CNN
F 3 "" H 4900 5900 50  0001 C CNN
	1    4900 5900
	1    0    0    -1  
$EndComp
Wire Wire Line
	4900 5900 4900 5950
Wire Wire Line
	4900 5950 4950 5950
$Comp
L power:GND #PWR020
U 1 1 61646D38
P 5800 6000
F 0 "#PWR020" H 5800 5750 50  0001 C CNN
F 1 "GND" H 5805 5827 50  0000 C CNN
F 2 "" H 5800 6000 50  0001 C CNN
F 3 "" H 5800 6000 50  0001 C CNN
	1    5800 6000
	1    0    0    -1  
$EndComp
Wire Wire Line
	5750 5950 5800 5950
Wire Wire Line
	5800 5950 5800 6000
Wire Wire Line
	5250 5950 5300 5950
Wire Wire Line
	5300 5950 5300 5850
Connection ~ 5300 5950
Wire Wire Line
	5300 5950 5350 5950
Text Label 5300 5850 1    50   ~ 0
IO_INPUT_TRIG_2
$Comp
L Transistor_BJT:BC817 Q4
U 1 1 6164D6CD
P 6400 5750
F 0 "Q4" V 6700 5700 50  0000 L CNN
F 1 "BC817" V 6600 5650 50  0000 L CNN
F 2 "Package_TO_SOT_SMD:SOT-23_Handsoldering" H 6600 5675 50  0001 L CIN
F 3 "http://www.fairchildsemi.com/ds/BC/BC817.pdf" H 6400 5750 50  0001 L CNN
	1    6400 5750
	0    -1   -1   0   
$EndComp
$Comp
L Device:R R17
U 1 1 6164D6D3
P 5950 5650
F 0 "R17" V 6157 5650 50  0000 C CNN
F 1 "10k" V 6066 5650 50  0000 C CNN
F 2 "Resistor_SMD:R_0603_1608Metric_Pad1.05x0.95mm_HandSolder" V 5880 5650 50  0001 C CNN
F 3 "~" H 5950 5650 50  0001 C CNN
	1    5950 5650
	0    -1   -1   0   
$EndComp
$Comp
L power:+3.3V #PWR019
U 1 1 6164D6D9
P 5750 5600
F 0 "#PWR019" H 5750 5450 50  0001 C CNN
F 1 "+3.3V" V 5750 5850 50  0000 C CNN
F 2 "" H 5750 5600 50  0001 C CNN
F 3 "" H 5750 5600 50  0001 C CNN
	1    5750 5600
	1    0    0    -1  
$EndComp
Wire Wire Line
	5750 5600 5750 5650
Wire Wire Line
	5750 5650 5800 5650
$Comp
L power:GND #PWR021
U 1 1 6164D6E1
P 6650 5700
F 0 "#PWR021" H 6650 5450 50  0001 C CNN
F 1 "GND" H 6655 5527 50  0000 C CNN
F 2 "" H 6650 5700 50  0001 C CNN
F 3 "" H 6650 5700 50  0001 C CNN
	1    6650 5700
	1    0    0    -1  
$EndComp
Wire Wire Line
	6600 5650 6650 5650
Wire Wire Line
	6650 5650 6650 5700
Wire Wire Line
	6100 5650 6150 5650
Wire Wire Line
	6150 5650 6150 5550
Connection ~ 6150 5650
Wire Wire Line
	6150 5650 6200 5650
Text Label 6150 5550 1    50   ~ 0
IO_INPUT_TRIG_3
Wire Wire Line
	1500 7400 3900 7400
Wire Wire Line
	3900 7400 3900 7300
Wire Wire Line
	1850 7500 4700 7500
Wire Wire Line
	2550 7700 6400 7700
Wire Wire Line
	2200 7600 5550 7600
Wire Wire Line
	4700 7500 4700 6950
Wire Wire Line
	5550 6600 5550 7600
Wire Wire Line
	6400 6300 6400 7700
Wire Wire Line
	3900 6950 3900 7000
Wire Wire Line
	4700 6600 4700 6650
Wire Wire Line
	5550 6250 5550 6300
Wire Wire Line
	6400 5950 6400 6000
Text Label 2600 3100 0    50   ~ 0
IO_INPUT_TRIG_0
Text Label 2600 3200 0    50   ~ 0
IO_INPUT_TRIG_1
Text Label 2600 3300 0    50   ~ 0
IO_INPUT_TRIG_2
Text Label 2600 3400 0    50   ~ 0
IO_INPUT_TRIG_3
Text Notes 650  7100 0    50   ~ 0
Input trigger\npower up MCU\nand peripherals
$Comp
L Device:C C8
U 1 1 61711B1B
P 9050 2300
F 0 "C8" H 8935 2254 50  0000 R CNN
F 1 "3.3u" H 8935 2345 50  0000 R CNN
F 2 "Capacitor_SMD:C_1812_4532Metric_Pad1.30x3.40mm_HandSolder" H 9088 2150 50  0001 C CNN
F 3 "~" H 9050 2300 50  0001 C CNN
	1    9050 2300
	-1   0    0    1   
$EndComp
Connection ~ 9050 2150
$Comp
L Device:C C7
U 1 1 6171479A
P 8750 2300
F 0 "C7" H 9000 2300 50  0000 R CNN
F 1 "3.3u" H 9050 2400 50  0000 R CNN
F 2 "Capacitor_SMD:C_1812_4532Metric_Pad1.30x3.40mm_HandSolder" H 8788 2150 50  0001 C CNN
F 3 "~" H 8750 2300 50  0001 C CNN
	1    8750 2300
	-1   0    0    1   
$EndComp
Connection ~ 8750 2150
$Comp
L power:GND #PWR028
U 1 1 6171639A
P 9050 2500
F 0 "#PWR028" H 9050 2250 50  0001 C CNN
F 1 "GND" H 9150 2500 50  0000 C CNN
F 2 "" H 9050 2500 50  0001 C CNN
F 3 "" H 9050 2500 50  0001 C CNN
	1    9050 2500
	1    0    0    -1  
$EndComp
Wire Wire Line
	9050 2500 9050 2450
$Comp
L power:GND #PWR027
U 1 1 6171F7A2
P 8750 2500
F 0 "#PWR027" H 8750 2250 50  0001 C CNN
F 1 "GND" H 8850 2500 50  0000 C CNN
F 2 "" H 8750 2500 50  0001 C CNN
F 3 "" H 8750 2500 50  0001 C CNN
	1    8750 2500
	1    0    0    -1  
$EndComp
Wire Wire Line
	8750 2500 8750 2450
$Comp
L Device:R R23
U 1 1 617433B7
P 6250 1050
F 0 "R23" V 5950 1000 50  0000 L CNN
F 1 "10k" V 5950 1200 50  0000 L CNN
F 2 "Resistor_SMD:R_0603_1608Metric_Pad1.05x0.95mm_HandSolder" V 6180 1050 50  0001 C CNN
F 3 "~" H 6250 1050 50  0001 C CNN
	1    6250 1050
	1    0    0    -1  
$EndComp
$Comp
L power:+3.3V #PWR025
U 1 1 61746214
P 6250 900
F 0 "#PWR025" H 6250 750 50  0001 C CNN
F 1 "+3.3V" V 6250 1150 50  0000 C CNN
F 2 "" H 6250 900 50  0001 C CNN
F 3 "" H 6250 900 50  0001 C CNN
	1    6250 900 
	1    0    0    -1  
$EndComp
$Comp
L Device:R R22
U 1 1 6174772A
P 6150 1050
F 0 "R22" V 5850 1000 50  0000 L CNN
F 1 "10k" V 5850 1200 50  0000 L CNN
F 2 "Resistor_SMD:R_0603_1608Metric_Pad1.05x0.95mm_HandSolder" V 6080 1050 50  0001 C CNN
F 3 "~" H 6150 1050 50  0001 C CNN
	1    6150 1050
	1    0    0    -1  
$EndComp
$Comp
L power:+3.3V #PWR024
U 1 1 617479BC
P 6150 900
F 0 "#PWR024" H 6150 750 50  0001 C CNN
F 1 "+3.3V" V 6150 1150 50  0000 C CNN
F 2 "" H 6150 900 50  0001 C CNN
F 3 "" H 6150 900 50  0001 C CNN
	1    6150 900 
	1    0    0    -1  
$EndComp
$Comp
L Device:R R21
U 1 1 61747CF0
P 6050 1050
F 0 "R21" V 5750 1000 50  0000 L CNN
F 1 "10k" V 5750 1200 50  0000 L CNN
F 2 "Resistor_SMD:R_0603_1608Metric_Pad1.05x0.95mm_HandSolder" V 5980 1050 50  0001 C CNN
F 3 "~" H 6050 1050 50  0001 C CNN
	1    6050 1050
	1    0    0    -1  
$EndComp
$Comp
L power:+3.3V #PWR023
U 1 1 61747FD3
P 6050 900
F 0 "#PWR023" H 6050 750 50  0001 C CNN
F 1 "+3.3V" V 6050 1150 50  0000 C CNN
F 2 "" H 6050 900 50  0001 C CNN
F 3 "" H 6050 900 50  0001 C CNN
	1    6050 900 
	1    0    0    -1  
$EndComp
Wire Wire Line
	6250 1200 6250 1250
Wire Wire Line
	6150 1200 6150 1600
Wire Wire Line
	6150 1600 6250 1600
Wire Wire Line
	6050 1200 6050 1950
Wire Wire Line
	6050 1950 6250 1950
$Comp
L power:GND #PWR026
U 1 1 61793C6B
P 6700 2000
F 0 "#PWR026" H 6700 1750 50  0001 C CNN
F 1 "GND" H 6705 1827 50  0000 C CNN
F 2 "" H 6700 2000 50  0001 C CNN
F 3 "" H 6700 2000 50  0001 C CNN
	1    6700 2000
	1    0    0    -1  
$EndComp
Wire Wire Line
	6700 2000 6700 1950
Wire Wire Line
	6700 1950 6650 1950
Wire Wire Line
	6650 1600 6700 1600
Wire Wire Line
	6700 1600 6700 1950
Connection ~ 6700 1950
Wire Wire Line
	6650 1250 6700 1250
Wire Wire Line
	6700 1250 6700 1600
Connection ~ 6700 1600
$Comp
L Switch:SW_Push SW1
U 1 1 617D8854
P 6450 1250
F 0 "SW1" H 6450 1535 50  0000 C CNN
F 1 "UP" H 6450 1444 50  0000 C CNN
F 2 "Button_Switch_THT:SW_PUSH_6mm_H5mm" H 6450 1450 50  0001 C CNN
F 3 "~" H 6450 1450 50  0001 C CNN
	1    6450 1250
	1    0    0    -1  
$EndComp
$Comp
L Switch:SW_Push SW2
U 1 1 617D8CA5
P 6450 1600
F 0 "SW2" H 6450 1885 50  0000 C CNN
F 1 "DOWN" H 6450 1794 50  0000 C CNN
F 2 "Button_Switch_THT:SW_PUSH_6mm_H5mm" H 6450 1800 50  0001 C CNN
F 3 "~" H 6450 1800 50  0001 C CNN
	1    6450 1600
	1    0    0    -1  
$EndComp
$Comp
L Switch:SW_Push SW3
U 1 1 617D90DD
P 6450 1950
F 0 "SW3" H 6450 2235 50  0000 C CNN
F 1 "NEXT" H 6450 2144 50  0000 C CNN
F 2 "Button_Switch_THT:SW_PUSH_6mm_H5mm" H 6450 2150 50  0001 C CNN
F 3 "~" H 6450 2150 50  0001 C CNN
	1    6450 1950
	1    0    0    -1  
$EndComp
Wire Wire Line
	6250 1250 5900 1250
Connection ~ 6250 1250
Wire Wire Line
	6150 1600 5900 1600
Connection ~ 6150 1600
Wire Wire Line
	6050 1950 5900 1950
Connection ~ 6050 1950
Text Label 5900 1250 2    50   ~ 0
IO_INPUT_BTN_UP
Text Label 5900 1600 2    50   ~ 0
IO_INPUT_BTN_DOWN
Text Label 5900 1950 2    50   ~ 0
IO_INPUT_BTN_NEXT
Text Label 2600 2200 0    50   ~ 0
IO_INPUT_BTN_UP
Text Label 2600 2300 0    50   ~ 0
IO_INPUT_BTN_DOWN
Text Label 2600 2400 0    50   ~ 0
IO_INPUT_BTN_NEXT
$Comp
L Device:C C9
U 1 1 61509DCA
P 3350 2900
F 0 "C9" H 3450 3000 50  0000 R CNN
F 1 "10n" H 3500 2800 50  0000 R CNN
F 2 "Capacitor_SMD:C_0603_1608Metric_Pad1.05x0.95mm_HandSolder" H 3388 2750 50  0001 C CNN
F 3 "~" H 3350 2900 50  0001 C CNN
	1    3350 2900
	1    0    0    -1  
$EndComp
$Comp
L Device:C C11
U 1 1 61511B52
P 3600 2900
F 0 "C11" H 3750 3000 50  0000 R CNN
F 1 "10n" H 3750 2800 50  0000 R CNN
F 2 "Capacitor_SMD:C_0603_1608Metric_Pad1.05x0.95mm_HandSolder" H 3638 2750 50  0001 C CNN
F 3 "~" H 3600 2900 50  0001 C CNN
	1    3600 2900
	1    0    0    -1  
$EndComp
$Comp
L Device:C C13
U 1 1 61512118
P 3850 2900
F 0 "C13" H 4000 3000 50  0000 R CNN
F 1 "10n" H 4000 2800 50  0000 R CNN
F 2 "Capacitor_SMD:C_0603_1608Metric_Pad1.05x0.95mm_HandSolder" H 3888 2750 50  0001 C CNN
F 3 "~" H 3850 2900 50  0001 C CNN
	1    3850 2900
	1    0    0    -1  
$EndComp
$Comp
L Device:C C15
U 1 1 61512420
P 4100 2900
F 0 "C15" H 4250 3000 50  0000 R CNN
F 1 "10n" H 4250 2800 50  0000 R CNN
F 2 "Capacitor_SMD:C_0603_1608Metric_Pad1.05x0.95mm_HandSolder" H 4138 2750 50  0001 C CNN
F 3 "~" H 4100 2900 50  0001 C CNN
	1    4100 2900
	1    0    0    -1  
$EndComp
Wire Wire Line
	3350 3100 3350 3050
Wire Wire Line
	2550 3100 3350 3100
Wire Wire Line
	3600 3050 3600 3200
Wire Wire Line
	2550 3200 3600 3200
Wire Wire Line
	3850 3050 3850 3300
Wire Wire Line
	2550 3300 3850 3300
Wire Wire Line
	4100 3050 4100 3400
Wire Wire Line
	2550 3400 4100 3400
$Comp
L power:GND #PWR029
U 1 1 615359AF
P 3700 2700
F 0 "#PWR029" H 3700 2450 50  0001 C CNN
F 1 "GND" H 3705 2527 50  0000 C CNN
F 2 "" H 3700 2700 50  0001 C CNN
F 3 "" H 3700 2700 50  0001 C CNN
	1    3700 2700
	-1   0    0    1   
$EndComp
Wire Wire Line
	3700 2700 3700 2750
Wire Wire Line
	3700 2750 3600 2750
Wire Wire Line
	3600 2750 3350 2750
Connection ~ 3600 2750
Wire Wire Line
	3700 2750 3850 2750
Connection ~ 3700 2750
Wire Wire Line
	3850 2750 4100 2750
Connection ~ 3850 2750
$Comp
L Device:C C10
U 1 1 6156E67B
P 3600 2200
F 0 "C10" V 3550 2150 50  0000 R CNN
F 1 "10n" V 3550 2400 50  0000 R CNN
F 2 "Capacitor_SMD:C_0603_1608Metric_Pad1.05x0.95mm_HandSolder" H 3638 2050 50  0001 C CNN
F 3 "~" H 3600 2200 50  0001 C CNN
	1    3600 2200
	0    1    1    0   
$EndComp
$Comp
L Device:C C12
U 1 1 6157AD8A
P 3850 2300
F 0 "C12" V 3800 2250 50  0000 R CNN
F 1 "10n" V 3800 2500 50  0000 R CNN
F 2 "Capacitor_SMD:C_0603_1608Metric_Pad1.05x0.95mm_HandSolder" H 3888 2150 50  0001 C CNN
F 3 "~" H 3850 2300 50  0001 C CNN
	1    3850 2300
	0    1    1    0   
$EndComp
$Comp
L Device:C C14
U 1 1 6157B084
P 4100 2400
F 0 "C14" V 4150 2350 50  0000 R CNN
F 1 "10n" V 4150 2600 50  0000 R CNN
F 2 "Capacitor_SMD:C_0603_1608Metric_Pad1.05x0.95mm_HandSolder" H 4138 2250 50  0001 C CNN
F 3 "~" H 4100 2400 50  0001 C CNN
	1    4100 2400
	0    1    1    0   
$EndComp
Wire Wire Line
	2550 2200 3450 2200
Wire Wire Line
	2550 2300 3700 2300
Wire Wire Line
	2550 2400 3950 2400
$Comp
L power:GND #PWR030
U 1 1 615A1745
P 4350 2400
F 0 "#PWR030" H 4350 2150 50  0001 C CNN
F 1 "GND" H 4355 2227 50  0000 C CNN
F 2 "" H 4350 2400 50  0001 C CNN
F 3 "" H 4350 2400 50  0001 C CNN
	1    4350 2400
	0    -1   -1   0   
$EndComp
Wire Wire Line
	3750 2200 4300 2200
Wire Wire Line
	4300 2200 4300 2300
Wire Wire Line
	4300 2400 4250 2400
Wire Wire Line
	4300 2400 4350 2400
Connection ~ 4300 2400
Wire Wire Line
	4000 2300 4300 2300
Connection ~ 4300 2300
Wire Wire Line
	4300 2300 4300 2400
Wire Wire Line
	2550 2600 2600 2600
Wire Wire Line
	2550 2700 2600 2700
Wire Wire Line
	2550 2800 2600 2800
Wire Wire Line
	2550 2900 2600 2900
Text Label 2600 2600 0    50   ~ 0
IO_LED_3
Text Label 2600 2700 0    50   ~ 0
IO_LED_1
Text Label 2600 2800 0    50   ~ 0
IO_LED_0
Text Label 2600 2900 0    50   ~ 0
IO_LED_2
$Comp
L Device:LED D5
U 1 1 6160879A
P 4800 4250
F 0 "D5" V 4839 4133 50  0000 R CNN
F 1 "LED" V 4748 4133 50  0000 R CNN
F 2 "LED_SMD:LED_0603_1608Metric_Castellated" H 4800 4250 50  0001 C CNN
F 3 "~" H 4800 4250 50  0001 C CNN
	1    4800 4250
	0    -1   -1   0   
$EndComp
$Comp
L Connector_Generic:Conn_01x04 J5
U 1 1 61622938
P 10850 4550
F 0 "J5" H 10768 4867 50  0000 C CNN
F 1 "PWR_OUTPUT" H 10768 4776 50  0000 C CNN
F 2 "Connector_PinHeader_2.54mm:PinHeader_1x04_P2.54mm_Vertical" H 10850 4550 50  0001 C CNN
F 3 "~" H 10850 4550 50  0001 C CNN
	1    10850 4550
	1    0    0    -1  
$EndComp
$Comp
L Transistor_FET:IRF9540N Q12
U 1 1 6162A8BE
P 9650 4100
F 0 "Q12" H 9854 4146 50  0000 L CNN
F 1 "IRF4905PBF" H 9854 4055 50  0000 L CNN
F 2 "Package_TO_SOT_THT:TO-220-3_Horizontal_TabDown" H 9850 4025 50  0001 L CIN
F 3 "http://www.irf.com/product-info/datasheets/data/irf9540n.pdf" H 9650 4100 50  0001 L CNN
	1    9650 4100
	1    0    0    1   
$EndComp
$Comp
L Transistor_FET:IRF9540N Q13
U 1 1 6162C138
P 9650 5050
F 0 "Q13" H 9854 5096 50  0000 L CNN
F 1 "IRF4905PBF" H 9854 5005 50  0000 L CNN
F 2 "Package_TO_SOT_THT:TO-220-3_Horizontal_TabDown" H 9850 4975 50  0001 L CIN
F 3 "http://www.irf.com/product-info/datasheets/data/irf9540n.pdf" H 9650 5050 50  0001 L CNN
	1    9650 5050
	1    0    0    1   
$EndComp
$Comp
L Transistor_FET:IRF9540N Q14
U 1 1 6162C81E
P 9650 5950
F 0 "Q14" H 9854 5996 50  0000 L CNN
F 1 "IRF4905PBF" H 9854 5905 50  0000 L CNN
F 2 "Package_TO_SOT_THT:TO-220-3_Horizontal_TabDown" H 9850 5875 50  0001 L CIN
F 3 "http://www.irf.com/product-info/datasheets/data/irf9540n.pdf" H 9650 5950 50  0001 L CNN
	1    9650 5950
	1    0    0    1   
$EndComp
$Comp
L power:+BATT #PWR042
U 1 1 6162FE47
P 9750 2600
F 0 "#PWR042" H 9750 2450 50  0001 C CNN
F 1 "+BATT" H 9900 2650 50  0000 C CNN
F 2 "" H 9750 2600 50  0001 C CNN
F 3 "" H 9750 2600 50  0001 C CNN
	1    9750 2600
	1    0    0    -1  
$EndComp
$Comp
L power:+BATT #PWR043
U 1 1 616339C7
P 9750 3550
F 0 "#PWR043" H 9750 3400 50  0001 C CNN
F 1 "+BATT" H 9900 3600 50  0000 C CNN
F 2 "" H 9750 3550 50  0001 C CNN
F 3 "" H 9750 3550 50  0001 C CNN
	1    9750 3550
	1    0    0    -1  
$EndComp
$Comp
L power:+BATT #PWR044
U 1 1 61634353
P 9750 4500
F 0 "#PWR044" H 9750 4350 50  0001 C CNN
F 1 "+BATT" H 9900 4550 50  0000 C CNN
F 2 "" H 9750 4500 50  0001 C CNN
F 3 "" H 9750 4500 50  0001 C CNN
	1    9750 4500
	1    0    0    -1  
$EndComp
$Comp
L power:+BATT #PWR045
U 1 1 616352F2
P 9750 5450
F 0 "#PWR045" H 9750 5300 50  0001 C CNN
F 1 "+BATT" H 9900 5500 50  0000 C CNN
F 2 "" H 9750 5450 50  0001 C CNN
F 3 "" H 9750 5450 50  0001 C CNN
	1    9750 5450
	1    0    0    -1  
$EndComp
Wire Wire Line
	9750 3350 9750 3400
Wire Wire Line
	9750 3400 10450 3400
Wire Wire Line
	10450 4450 10650 4450
Wire Wire Line
	9750 4300 9750 4350
Wire Wire Line
	9750 4350 10400 4350
Wire Wire Line
	10400 4550 10650 4550
Wire Wire Line
	9750 5250 9750 5300
Wire Wire Line
	10400 4650 10650 4650
Wire Wire Line
	10650 4750 10450 4750
Wire Wire Line
	9750 6200 9750 6150
$Comp
L Transistor_BJT:BC817 Q9
U 1 1 6167C8E8
P 8550 4350
F 0 "Q9" H 8750 4300 50  0000 L CNN
F 1 "BC817" H 8750 4200 50  0000 L CNN
F 2 "Package_TO_SOT_SMD:SOT-23_Handsoldering" H 8750 4275 50  0001 L CIN
F 3 "http://www.fairchildsemi.com/ds/BC/BC817.pdf" H 8550 4350 50  0001 L CNN
	1    8550 4350
	1    0    0    -1  
$EndComp
$Comp
L Device:R R33
U 1 1 61690B89
P 8200 4350
F 0 "R33" V 8100 4400 50  0000 R CNN
F 1 "10k" V 8200 4400 50  0000 R CNN
F 2 "Resistor_SMD:R_0603_1608Metric_Pad1.05x0.95mm_HandSolder" V 8130 4350 50  0001 C CNN
F 3 "~" H 8200 4350 50  0001 C CNN
	1    8200 4350
	0    -1   -1   0   
$EndComp
$Comp
L power:GND #PWR039
U 1 1 616A013D
P 8650 4550
F 0 "#PWR039" H 8650 4300 50  0001 C CNN
F 1 "GND" H 8550 4450 50  0000 C CNN
F 2 "" H 8650 4550 50  0001 C CNN
F 3 "" H 8650 4550 50  0001 C CNN
	1    8650 4550
	1    0    0    -1  
$EndComp
Wire Wire Line
	8050 4350 8000 4350
Text Label 8000 4350 2    50   ~ 0
IO_PWM_1
$Comp
L Connector_Generic:Conn_01x02 J3
U 1 1 616E28B7
P 4050 4000
F 0 "J3" H 4100 3700 50  0000 C CNN
F 1 "DEBUG" H 4150 3800 50  0000 C CNN
F 2 "Connector_PinHeader_2.54mm:PinHeader_1x02_P2.54mm_Horizontal" H 4050 4000 50  0001 C CNN
F 3 "~" H 4050 4000 50  0001 C CNN
	1    4050 4000
	1    0    0    -1  
$EndComp
$Comp
L power:GND #PWR031
U 1 1 616E63D0
P 3800 4150
F 0 "#PWR031" H 3800 3900 50  0001 C CNN
F 1 "GND" H 3805 3977 50  0000 C CNN
F 2 "" H 3800 4150 50  0001 C CNN
F 3 "" H 3800 4150 50  0001 C CNN
	1    3800 4150
	1    0    0    -1  
$EndComp
Wire Wire Line
	3850 4100 3800 4100
Wire Wire Line
	3800 4100 3800 4150
Wire Wire Line
	3450 4000 3850 4000
$Comp
L Connector_Generic:Conn_01x05 J4
U 1 1 6174052D
P 6100 2850
F 0 "J4" H 6180 2892 50  0000 L CNN
F 1 "Programming" H 6180 2801 50  0000 L CNN
F 2 "Connector_PinHeader_2.54mm:PinHeader_1x05_P2.54mm_Horizontal" H 6100 2850 50  0001 C CNN
F 3 "~" H 6100 2850 50  0001 C CNN
	1    6100 2850
	1    0    0    -1  
$EndComp
$Comp
L Device:R R28
U 1 1 61742878
P 5750 2650
F 0 "R28" V 5300 2650 50  0000 C CNN
F 1 "330R" V 5300 2900 50  0000 C CNN
F 2 "Resistor_SMD:R_0603_1608Metric_Pad1.05x0.95mm_HandSolder" V 5680 2650 50  0001 C CNN
F 3 "~" H 5750 2650 50  0001 C CNN
	1    5750 2650
	0    1    1    0   
$EndComp
$Comp
L Device:R R29
U 1 1 6174304C
P 5750 2750
F 0 "R29" V 5300 2750 50  0000 C CNN
F 1 "330R" V 5300 3000 50  0000 C CNN
F 2 "Resistor_SMD:R_0603_1608Metric_Pad1.05x0.95mm_HandSolder" V 5680 2750 50  0001 C CNN
F 3 "~" H 5750 2750 50  0001 C CNN
	1    5750 2750
	0    1    1    0   
$EndComp
$Comp
L Device:R R30
U 1 1 6174356D
P 5750 2850
F 0 "R30" V 5300 2850 50  0000 C CNN
F 1 "330R" V 5300 3100 50  0000 C CNN
F 2 "Resistor_SMD:R_0603_1608Metric_Pad1.05x0.95mm_HandSolder" V 5680 2850 50  0001 C CNN
F 3 "~" H 5750 2850 50  0001 C CNN
	1    5750 2850
	0    1    1    0   
$EndComp
$Comp
L Device:R R31
U 1 1 61748F80
P 5750 2950
F 0 "R31" V 5300 2950 50  0000 C CNN
F 1 "330R" V 5300 3200 50  0000 C CNN
F 2 "Resistor_SMD:R_0603_1608Metric_Pad1.05x0.95mm_HandSolder" V 5680 2950 50  0001 C CNN
F 3 "~" H 5750 2950 50  0001 C CNN
	1    5750 2950
	0    1    1    0   
$EndComp
Wire Wire Line
	1050 1300 1000 1300
Text Label 1000 1300 2    50   ~ 0
RESET
$Comp
L power:GND #PWR033
U 1 1 6175FEE5
P 5850 3100
F 0 "#PWR033" H 5850 2850 50  0001 C CNN
F 1 "GND" H 5855 2927 50  0000 C CNN
F 2 "" H 5850 3100 50  0001 C CNN
F 3 "" H 5850 3100 50  0001 C CNN
	1    5850 3100
	1    0    0    -1  
$EndComp
Wire Wire Line
	5900 3050 5850 3050
Wire Wire Line
	5850 3050 5850 3100
Wire Wire Line
	5600 2950 5550 2950
Text Label 5550 2950 2    50   ~ 0
RESET
Text Label 5550 2850 2    50   ~ 0
SCK
Text Label 5550 2750 2    50   ~ 0
MISO
Text Label 5550 2650 2    50   ~ 0
MOSI
Wire Wire Line
	5200 2850 5600 2850
Wire Wire Line
	5200 2750 5600 2750
Wire Wire Line
	5200 2650 5600 2650
Text Label 5200 2650 2    50   ~ 0
IO_LED_1
Text Label 5200 2750 2    50   ~ 0
IO_LED_2
Text Label 5200 2850 2    50   ~ 0
IO_LED_3
$Comp
L Device:LED D6
U 1 1 61860BE9
P 5150 4250
F 0 "D6" V 5189 4133 50  0000 R CNN
F 1 "LED" V 5098 4133 50  0000 R CNN
F 2 "LED_SMD:LED_0603_1608Metric_Castellated" H 5150 4250 50  0001 C CNN
F 3 "~" H 5150 4250 50  0001 C CNN
	1    5150 4250
	0    -1   -1   0   
$EndComp
$Comp
L Device:LED D7
U 1 1 618614FA
P 5500 4250
F 0 "D7" V 5539 4133 50  0000 R CNN
F 1 "LED" V 5448 4133 50  0000 R CNN
F 2 "LED_SMD:LED_0603_1608Metric_Castellated" H 5500 4250 50  0001 C CNN
F 3 "~" H 5500 4250 50  0001 C CNN
	1    5500 4250
	0    -1   -1   0   
$EndComp
$Comp
L Device:LED D8
U 1 1 61861EBE
P 5850 4250
F 0 "D8" V 5889 4133 50  0000 R CNN
F 1 "LED" V 5798 4133 50  0000 R CNN
F 2 "LED_SMD:LED_0603_1608Metric_Castellated" H 5850 4250 50  0001 C CNN
F 3 "~" H 5850 4250 50  0001 C CNN
	1    5850 4250
	0    -1   -1   0   
$EndComp
$Comp
L Device:R R24
U 1 1 618627D4
P 4800 3950
F 0 "R24" V 4700 3950 50  0000 C CNN
F 1 "330R" V 4800 3950 50  0000 C CNN
F 2 "Resistor_SMD:R_0603_1608Metric_Pad1.05x0.95mm_HandSolder" V 4730 3950 50  0001 C CNN
F 3 "~" H 4800 3950 50  0001 C CNN
	1    4800 3950
	1    0    0    -1  
$EndComp
$Comp
L Device:R R25
U 1 1 6186341C
P 5150 3950
F 0 "R25" V 5050 3950 50  0000 C CNN
F 1 "330R" V 5150 3950 50  0000 C CNN
F 2 "Resistor_SMD:R_0603_1608Metric_Pad1.05x0.95mm_HandSolder" V 5080 3950 50  0001 C CNN
F 3 "~" H 5150 3950 50  0001 C CNN
	1    5150 3950
	1    0    0    -1  
$EndComp
$Comp
L Device:R R26
U 1 1 61863D38
P 5500 3950
F 0 "R26" V 5400 3950 50  0000 C CNN
F 1 "330R" V 5500 3950 50  0000 C CNN
F 2 "Resistor_SMD:R_0603_1608Metric_Pad1.05x0.95mm_HandSolder" V 5430 3950 50  0001 C CNN
F 3 "~" H 5500 3950 50  0001 C CNN
	1    5500 3950
	1    0    0    -1  
$EndComp
$Comp
L Device:R R27
U 1 1 618645BA
P 5850 3950
F 0 "R27" V 5750 3950 50  0000 C CNN
F 1 "330R" V 5850 3950 50  0000 C CNN
F 2 "Resistor_SMD:R_0603_1608Metric_Pad1.05x0.95mm_HandSolder" V 5780 3950 50  0001 C CNN
F 3 "~" H 5850 3950 50  0001 C CNN
	1    5850 3950
	1    0    0    -1  
$EndComp
Wire Wire Line
	4800 3800 4800 3750
Wire Wire Line
	5150 3800 5150 3750
Wire Wire Line
	5500 3800 5500 3750
Wire Wire Line
	5850 3800 5850 3750
Text Label 4800 3750 1    50   ~ 0
IO_LED_0
Text Label 5150 3750 1    50   ~ 0
IO_LED_1
Text Label 5500 3750 1    50   ~ 0
IO_LED_2
Text Label 5850 3750 1    50   ~ 0
IO_LED_3
$Comp
L power:GND #PWR032
U 1 1 6189EF73
P 5350 4550
F 0 "#PWR032" H 5350 4300 50  0001 C CNN
F 1 "GND" H 5355 4377 50  0000 C CNN
F 2 "" H 5350 4550 50  0001 C CNN
F 3 "" H 5350 4550 50  0001 C CNN
	1    5350 4550
	1    0    0    -1  
$EndComp
Wire Wire Line
	4800 4400 4800 4500
Wire Wire Line
	4800 4500 5150 4500
Wire Wire Line
	5850 4500 5850 4400
Wire Wire Line
	5500 4400 5500 4500
Connection ~ 5500 4500
Wire Wire Line
	5500 4500 5850 4500
Wire Wire Line
	5150 4400 5150 4500
Connection ~ 5150 4500
Wire Wire Line
	5150 4500 5350 4500
Wire Wire Line
	5350 4550 5350 4500
Connection ~ 5350 4500
Wire Wire Line
	5350 4500 5500 4500
NoConn ~ 1350 1900
NoConn ~ 2550 3500
NoConn ~ 2550 3600
NoConn ~ 2550 4100
$Comp
L power:PWR_FLAG #FLG0101
U 1 1 6199CF39
P 2900 6850
F 0 "#FLG0101" H 2900 6925 50  0001 C CNN
F 1 "PWR_FLAG" V 2900 7150 50  0000 C CNN
F 2 "" H 2900 6850 50  0001 C CNN
F 3 "~" H 2900 6850 50  0001 C CNN
	1    2900 6850
	1    0    0    -1  
$EndComp
$Comp
L power:PWR_FLAG #FLG0102
U 1 1 619C14A9
P 3000 6850
F 0 "#FLG0102" H 3000 6925 50  0001 C CNN
F 1 "PWR_FLAG" V 3000 7150 50  0000 C CNN
F 2 "" H 3000 6850 50  0001 C CNN
F 3 "~" H 3000 6850 50  0001 C CNN
	1    3000 6850
	1    0    0    -1  
$EndComp
$Comp
L power:GND #PWR0101
U 1 1 619C39B5
P 3000 6950
F 0 "#PWR0101" H 3000 6700 50  0001 C CNN
F 1 "GND" V 3000 6750 50  0000 C CNN
F 2 "" H 3000 6950 50  0001 C CNN
F 3 "" H 3000 6950 50  0001 C CNN
	1    3000 6950
	1    0    0    -1  
$EndComp
Wire Wire Line
	3000 6950 3000 6850
$Comp
L power:+BATT #PWR0102
U 1 1 619E0123
P 2800 6950
F 0 "#PWR0102" H 2800 6800 50  0001 C CNN
F 1 "+BATT" V 2800 7200 50  0000 C CNN
F 2 "" H 2800 6950 50  0001 C CNN
F 3 "" H 2800 6950 50  0001 C CNN
	1    2800 6950
	-1   0    0    1   
$EndComp
$Comp
L power:VCC #PWR0103
U 1 1 61A1737B
P 2900 6950
F 0 "#PWR0103" H 2900 6800 50  0001 C CNN
F 1 "VCC" V 2900 7150 50  0000 C CNN
F 2 "" H 2900 6950 50  0001 C CNN
F 3 "" H 2900 6950 50  0001 C CNN
	1    2900 6950
	-1   0    0    1   
$EndComp
Wire Wire Line
	2900 6850 2900 6950
$Comp
L power:PWR_FLAG #FLG0103
U 1 1 61A29FE0
P 2800 6850
F 0 "#FLG0103" H 2800 6925 50  0001 C CNN
F 1 "PWR_FLAG" V 2800 7150 50  0000 C CNN
F 2 "" H 2800 6850 50  0001 C CNN
F 3 "~" H 2800 6850 50  0001 C CNN
	1    2800 6850
	1    0    0    -1  
$EndComp
Wire Wire Line
	2800 6850 2800 6950
Text Label 3850 1900 0    50   ~ 0
IO_SEGMENT_D
Text Label 3850 1800 0    50   ~ 0
IO_SEGMENT_C
Text Label 3850 1700 0    50   ~ 0
IO_SEGMENT_E
Text Label 3850 1600 0    50   ~ 0
IO_SEGMENT_B
Text Label 3850 1500 0    50   ~ 0
IO_SEGMENT_F
Text Label 3850 1400 0    50   ~ 0
IO_SEGMENT_A
Text Label 3850 1300 0    50   ~ 0
IO_SEGMENT_G
$Comp
L Mechanical:MountingHole H1
U 1 1 616240A4
P 600 3650
F 0 "H1" H 700 3696 50  0000 L CNN
F 1 "MountingHole" H 700 3605 50  0000 L CNN
F 2 "MountingHole:MountingHole_3.2mm_M3" H 600 3650 50  0001 C CNN
F 3 "~" H 600 3650 50  0001 C CNN
	1    600  3650
	1    0    0    -1  
$EndComp
$Comp
L Mechanical:MountingHole H2
U 1 1 616257C0
P 600 3850
F 0 "H2" H 700 3896 50  0000 L CNN
F 1 "MountingHole" H 700 3805 50  0000 L CNN
F 2 "MountingHole:MountingHole_3.2mm_M3" H 600 3850 50  0001 C CNN
F 3 "~" H 600 3850 50  0001 C CNN
	1    600  3850
	1    0    0    -1  
$EndComp
$Comp
L Mechanical:MountingHole H3
U 1 1 61625C05
P 600 4050
F 0 "H3" H 700 4096 50  0000 L CNN
F 1 "MountingHole" H 700 4005 50  0000 L CNN
F 2 "MountingHole:MountingHole_3.2mm_M3" H 600 4050 50  0001 C CNN
F 3 "~" H 600 4050 50  0001 C CNN
	1    600  4050
	1    0    0    -1  
$EndComp
$Comp
L Mechanical:MountingHole H4
U 1 1 6162603C
P 600 4250
F 0 "H4" H 700 4296 50  0000 L CNN
F 1 "MountingHole" H 700 4205 50  0000 L CNN
F 2 "MountingHole:MountingHole_3.2mm_M3" H 600 4250 50  0001 C CNN
F 3 "~" H 600 4250 50  0001 C CNN
	1    600  4250
	1    0    0    -1  
$EndComp
$Comp
L Connector:TestPoint TP1
U 1 1 61757310
P 2850 5700
F 0 "TP1" V 2804 5888 50  0000 L CNN
F 1 "+3V3" V 2895 5888 50  0000 L CNN
F 2 "TestPoint:TestPoint_Pad_D1.5mm" H 3050 5700 50  0001 C CNN
F 3 "~" H 3050 5700 50  0001 C CNN
	1    2850 5700
	0    1    1    0   
$EndComp
Connection ~ 2850 5700
$Comp
L Connector:TestPoint TP2
U 1 1 6175CBB3
P 2850 6100
F 0 "TP2" V 2804 6288 50  0000 L CNN
F 1 "GND" V 2895 6288 50  0000 L CNN
F 2 "TestPoint:TestPoint_Pad_D1.5mm" H 3050 6100 50  0001 C CNN
F 3 "~" H 3050 6100 50  0001 C CNN
	1    2850 6100
	0    1    1    0   
$EndComp
Wire Wire Line
	2850 6100 2700 6100
Connection ~ 2700 6100
$Comp
L Connector:TestPoint TP8
U 1 1 617A7244
P 2600 4300
F 0 "TP8" V 2600 4500 50  0000 L CNN
F 1 "GPIO" V 2600 4750 50  0000 L CNN
F 2 "TestPoint:TestPoint_Pad_D1.5mm" H 2800 4300 50  0001 C CNN
F 3 "~" H 2800 4300 50  0001 C CNN
	1    2600 4300
	0    1    1    0   
$EndComp
$Comp
L Connector:TestPoint TP7
U 1 1 617AD8A6
P 2600 4200
F 0 "TP7" V 2600 4400 50  0000 L CNN
F 1 "GPIO" V 2600 4650 50  0000 L CNN
F 2 "TestPoint:TestPoint_Pad_D1.5mm" H 2800 4200 50  0001 C CNN
F 3 "~" H 2800 4200 50  0001 C CNN
	1    2600 4200
	0    1    1    0   
$EndComp
Wire Wire Line
	2600 4200 2550 4200
Wire Wire Line
	2550 4300 2600 4300
$Comp
L Connector:TestPoint TP9
U 1 1 617D6252
P 1150 6350
F 0 "TP9" V 1150 6550 50  0000 L CNN
F 1 "BATT+" V 1250 6550 50  0000 L CNN
F 2 "TestPoint:TestPoint_Pad_D1.5mm" H 1350 6350 50  0001 C CNN
F 3 "~" H 1350 6350 50  0001 C CNN
	1    1150 6350
	0    1    1    0   
$EndComp
Wire Wire Line
	1150 6350 1100 6350
Connection ~ 1100 6350
$Comp
L Connector:TestPoint TP10
U 1 1 617FBFA9
P 2600 4600
F 0 "TP10" V 2600 4800 50  0000 L CNN
F 1 "GPIO" V 2600 5050 50  0000 L CNN
F 2 "TestPoint:TestPoint_Pad_D1.5mm" H 2800 4600 50  0001 C CNN
F 3 "~" H 2800 4600 50  0001 C CNN
	1    2600 4600
	0    1    1    0   
$EndComp
Wire Wire Line
	2600 4600 2550 4600
Wire Wire Line
	2050 850  2000 850 
Wire Wire Line
	1950 850  1950 950 
Wire Wire Line
	2050 850  2050 950 
Wire Wire Line
	2000 850  2000 800 
Connection ~ 2000 850 
Wire Wire Line
	2000 850  1950 850 
Wire Wire Line
	10450 3400 10450 4450
Wire Wire Line
	10400 4350 10400 4550
Wire Wire Line
	10450 4750 10450 6200
Wire Wire Line
	10400 4650 10400 5300
$Comp
L Device:R R38
U 1 1 61D07E5E
P 8850 4000
F 0 "R38" V 8750 4050 50  0000 R CNN
F 1 "470R" V 8850 4100 50  0000 R CNN
F 2 "Resistor_SMD:R_1206_3216Metric_Pad1.42x1.75mm_HandSolder" V 8780 4000 50  0001 C CNN
F 3 "~" H 8850 4000 50  0001 C CNN
	1    8850 4000
	0    1    1    0   
$EndComp
Wire Wire Line
	8700 4000 8650 4000
Wire Wire Line
	8650 4000 8650 4100
Wire Wire Line
	8700 4100 8650 4100
Connection ~ 8650 4100
Wire Wire Line
	8650 4100 8650 4150
Text Notes 7450 3150 0    50   ~ 0
Set Vgs threshold bit\nhigher, so gate capacity\ninfluence will be reduced.\nParallel resistors in order\nto help with heat dissipation.
$Comp
L Device:R R39
U 1 1 61FE9DE4
P 8850 4100
F 0 "R39" V 8950 4150 50  0000 R CNN
F 1 "470R" V 8850 4200 50  0000 R CNN
F 2 "Resistor_SMD:R_1206_3216Metric_Pad1.42x1.75mm_HandSolder" V 8780 4100 50  0001 C CNN
F 3 "~" H 8850 4100 50  0001 C CNN
	1    8850 4100
	0    1    1    0   
$EndComp
$Comp
L Device:R R49
U 1 1 61FEBBC9
P 9250 3800
F 0 "R49" V 9150 3850 50  0000 R CNN
F 1 "470R" V 9250 3900 50  0000 R CNN
F 2 "Resistor_SMD:R_1206_3216Metric_Pad1.42x1.75mm_HandSolder" V 9180 3800 50  0001 C CNN
F 3 "~" H 9250 3800 50  0001 C CNN
	1    9250 3800
	-1   0    0    1   
$EndComp
$Comp
L Device:R R45
U 1 1 61FECBAA
P 9150 3800
F 0 "R45" V 9250 3850 50  0000 R CNN
F 1 "470R" V 9150 3900 50  0000 R CNN
F 2 "Resistor_SMD:R_1206_3216Metric_Pad1.42x1.75mm_HandSolder" V 9080 3800 50  0001 C CNN
F 3 "~" H 9150 3800 50  0001 C CNN
	1    9150 3800
	-1   0    0    1   
$EndComp
Wire Wire Line
	9150 3650 9150 3600
Wire Wire Line
	9150 3600 9250 3600
Wire Wire Line
	9250 3600 9250 3650
Wire Wire Line
	9000 4100 9050 4100
Wire Wire Line
	9250 3950 9250 4100
Wire Wire Line
	9150 3950 9150 4100
Connection ~ 9150 4100
Wire Wire Line
	9150 4100 9250 4100
Wire Wire Line
	9050 4000 9050 4100
Connection ~ 9050 4100
Wire Wire Line
	9050 4100 9150 4100
Wire Wire Line
	9000 4000 9050 4000
Wire Wire Line
	9750 3550 9750 3600
Wire Wire Line
	9250 3600 9750 3600
Connection ~ 9250 3600
Connection ~ 9750 3600
Wire Wire Line
	9750 3600 9750 3900
Wire Wire Line
	9250 4100 9450 4100
Connection ~ 9250 4100
$Comp
L Transistor_BJT:BC817 Q8
U 1 1 62193E91
P 8550 3400
F 0 "Q8" H 8750 3350 50  0000 L CNN
F 1 "BC817" H 8750 3250 50  0000 L CNN
F 2 "Package_TO_SOT_SMD:SOT-23_Handsoldering" H 8750 3325 50  0001 L CIN
F 3 "http://www.fairchildsemi.com/ds/BC/BC817.pdf" H 8550 3400 50  0001 L CNN
	1    8550 3400
	1    0    0    -1  
$EndComp
$Comp
L Device:R R32
U 1 1 62193E9B
P 8200 3400
F 0 "R32" V 8100 3450 50  0000 R CNN
F 1 "10k" V 8200 3450 50  0000 R CNN
F 2 "Resistor_SMD:R_0603_1608Metric_Pad1.05x0.95mm_HandSolder" V 8130 3400 50  0001 C CNN
F 3 "~" H 8200 3400 50  0001 C CNN
	1    8200 3400
	0    -1   -1   0   
$EndComp
$Comp
L power:GND #PWR07
U 1 1 62193EA5
P 8650 3600
F 0 "#PWR07" H 8650 3350 50  0001 C CNN
F 1 "GND" H 8550 3500 50  0000 C CNN
F 2 "" H 8650 3600 50  0001 C CNN
F 3 "" H 8650 3600 50  0001 C CNN
	1    8650 3600
	1    0    0    -1  
$EndComp
Wire Wire Line
	8050 3400 8000 3400
Text Label 8000 3400 2    50   ~ 0
IO_PWM_0
$Comp
L Device:R R36
U 1 1 62193EB1
P 8850 3050
F 0 "R36" V 8750 3100 50  0000 R CNN
F 1 "470R" V 8850 3150 50  0000 R CNN
F 2 "Resistor_SMD:R_1206_3216Metric_Pad1.42x1.75mm_HandSolder" V 8780 3050 50  0001 C CNN
F 3 "~" H 8850 3050 50  0001 C CNN
	1    8850 3050
	0    1    1    0   
$EndComp
Wire Wire Line
	8700 3050 8650 3050
Wire Wire Line
	8650 3050 8650 3150
Wire Wire Line
	8700 3150 8650 3150
Connection ~ 8650 3150
Wire Wire Line
	8650 3150 8650 3200
$Comp
L Device:R R37
U 1 1 62193EC0
P 8850 3150
F 0 "R37" V 8950 3200 50  0000 R CNN
F 1 "470R" V 8850 3250 50  0000 R CNN
F 2 "Resistor_SMD:R_1206_3216Metric_Pad1.42x1.75mm_HandSolder" V 8780 3150 50  0001 C CNN
F 3 "~" H 8850 3150 50  0001 C CNN
	1    8850 3150
	0    1    1    0   
$EndComp
$Comp
L Device:R R48
U 1 1 62193ECA
P 9250 2850
F 0 "R48" V 9150 2900 50  0000 R CNN
F 1 "470R" V 9250 2950 50  0000 R CNN
F 2 "Resistor_SMD:R_1206_3216Metric_Pad1.42x1.75mm_HandSolder" V 9180 2850 50  0001 C CNN
F 3 "~" H 9250 2850 50  0001 C CNN
	1    9250 2850
	-1   0    0    1   
$EndComp
$Comp
L Device:R R44
U 1 1 62193ED4
P 9150 2850
F 0 "R44" V 9250 2900 50  0000 R CNN
F 1 "470R" V 9150 2950 50  0000 R CNN
F 2 "Resistor_SMD:R_1206_3216Metric_Pad1.42x1.75mm_HandSolder" V 9080 2850 50  0001 C CNN
F 3 "~" H 9150 2850 50  0001 C CNN
	1    9150 2850
	-1   0    0    1   
$EndComp
Wire Wire Line
	9150 2700 9150 2650
Wire Wire Line
	9150 2650 9250 2650
Wire Wire Line
	9250 2650 9250 2700
Wire Wire Line
	9000 3150 9050 3150
Wire Wire Line
	9250 3000 9250 3150
Wire Wire Line
	9150 3000 9150 3150
Connection ~ 9150 3150
Wire Wire Line
	9150 3150 9250 3150
Wire Wire Line
	9050 3050 9050 3150
Connection ~ 9050 3150
Wire Wire Line
	9050 3150 9150 3150
Wire Wire Line
	9000 3050 9050 3050
Wire Wire Line
	9250 2650 9750 2650
Connection ~ 9250 2650
Wire Wire Line
	9250 3150 9450 3150
Connection ~ 9250 3150
Wire Wire Line
	9750 2600 9750 2650
Wire Wire Line
	9750 2650 9750 2950
Connection ~ 9750 2650
$Comp
L Transistor_BJT:BC817 Q10
U 1 1 622DDB29
P 8550 5300
F 0 "Q10" H 8750 5250 50  0000 L CNN
F 1 "BC817" H 8750 5150 50  0000 L CNN
F 2 "Package_TO_SOT_SMD:SOT-23_Handsoldering" H 8750 5225 50  0001 L CIN
F 3 "http://www.fairchildsemi.com/ds/BC/BC817.pdf" H 8550 5300 50  0001 L CNN
	1    8550 5300
	1    0    0    -1  
$EndComp
$Comp
L Device:R R34
U 1 1 622DDB33
P 8200 5300
F 0 "R34" V 8100 5350 50  0000 R CNN
F 1 "10k" V 8200 5350 50  0000 R CNN
F 2 "Resistor_SMD:R_0603_1608Metric_Pad1.05x0.95mm_HandSolder" V 8130 5300 50  0001 C CNN
F 3 "~" H 8200 5300 50  0001 C CNN
	1    8200 5300
	0    -1   -1   0   
$EndComp
$Comp
L power:GND #PWR034
U 1 1 622DDB3D
P 8650 5500
F 0 "#PWR034" H 8650 5250 50  0001 C CNN
F 1 "GND" H 8550 5400 50  0000 C CNN
F 2 "" H 8650 5500 50  0001 C CNN
F 3 "" H 8650 5500 50  0001 C CNN
	1    8650 5500
	1    0    0    -1  
$EndComp
Wire Wire Line
	8050 5300 8000 5300
Text Label 8000 5300 2    50   ~ 0
IO_PWM_2
$Comp
L Device:R R40
U 1 1 622DDB49
P 8850 4950
F 0 "R40" V 8750 5000 50  0000 R CNN
F 1 "470R" V 8850 5050 50  0000 R CNN
F 2 "Resistor_SMD:R_1206_3216Metric_Pad1.42x1.75mm_HandSolder" V 8780 4950 50  0001 C CNN
F 3 "~" H 8850 4950 50  0001 C CNN
	1    8850 4950
	0    1    1    0   
$EndComp
Wire Wire Line
	8700 4950 8650 4950
Wire Wire Line
	8650 4950 8650 5050
Wire Wire Line
	8700 5050 8650 5050
Connection ~ 8650 5050
Wire Wire Line
	8650 5050 8650 5100
$Comp
L Device:R R41
U 1 1 622DDB58
P 8850 5050
F 0 "R41" V 8950 5100 50  0000 R CNN
F 1 "470R" V 8850 5150 50  0000 R CNN
F 2 "Resistor_SMD:R_1206_3216Metric_Pad1.42x1.75mm_HandSolder" V 8780 5050 50  0001 C CNN
F 3 "~" H 8850 5050 50  0001 C CNN
	1    8850 5050
	0    1    1    0   
$EndComp
$Comp
L Device:R R50
U 1 1 622DDB62
P 9250 4750
F 0 "R50" V 9150 4800 50  0000 R CNN
F 1 "470R" V 9250 4850 50  0000 R CNN
F 2 "Resistor_SMD:R_1206_3216Metric_Pad1.42x1.75mm_HandSolder" V 9180 4750 50  0001 C CNN
F 3 "~" H 9250 4750 50  0001 C CNN
	1    9250 4750
	-1   0    0    1   
$EndComp
$Comp
L Device:R R46
U 1 1 622DDB6C
P 9150 4750
F 0 "R46" V 9250 4800 50  0000 R CNN
F 1 "470R" V 9150 4850 50  0000 R CNN
F 2 "Resistor_SMD:R_1206_3216Metric_Pad1.42x1.75mm_HandSolder" V 9080 4750 50  0001 C CNN
F 3 "~" H 9150 4750 50  0001 C CNN
	1    9150 4750
	-1   0    0    1   
$EndComp
Wire Wire Line
	9000 5050 9050 5050
Wire Wire Line
	9250 4900 9250 5050
Wire Wire Line
	9150 4900 9150 5050
Connection ~ 9150 5050
Wire Wire Line
	9150 5050 9250 5050
Wire Wire Line
	9050 4950 9050 5050
Connection ~ 9050 5050
Wire Wire Line
	9050 5050 9150 5050
Wire Wire Line
	9000 4950 9050 4950
Wire Wire Line
	9250 5050 9450 5050
Connection ~ 9250 5050
Wire Wire Line
	9750 4500 9750 4550
Wire Wire Line
	9150 4600 9150 4550
Wire Wire Line
	9150 4550 9250 4550
Connection ~ 9750 4550
Wire Wire Line
	9750 4550 9750 4850
Wire Wire Line
	9250 4600 9250 4550
Connection ~ 9250 4550
Wire Wire Line
	9250 4550 9750 4550
$Comp
L Transistor_BJT:BC817 Q11
U 1 1 623A637C
P 8550 6200
F 0 "Q11" H 8750 6150 50  0000 L CNN
F 1 "BC817" H 8750 6050 50  0000 L CNN
F 2 "Package_TO_SOT_SMD:SOT-23_Handsoldering" H 8750 6125 50  0001 L CIN
F 3 "http://www.fairchildsemi.com/ds/BC/BC817.pdf" H 8550 6200 50  0001 L CNN
	1    8550 6200
	1    0    0    -1  
$EndComp
$Comp
L Device:R R35
U 1 1 623A6386
P 8200 6200
F 0 "R35" V 8100 6250 50  0000 R CNN
F 1 "10k" V 8200 6250 50  0000 R CNN
F 2 "Resistor_SMD:R_0603_1608Metric_Pad1.05x0.95mm_HandSolder" V 8130 6200 50  0001 C CNN
F 3 "~" H 8200 6200 50  0001 C CNN
	1    8200 6200
	0    -1   -1   0   
$EndComp
$Comp
L power:GND #PWR035
U 1 1 623A6390
P 8650 6400
F 0 "#PWR035" H 8650 6150 50  0001 C CNN
F 1 "GND" H 8550 6300 50  0000 C CNN
F 2 "" H 8650 6400 50  0001 C CNN
F 3 "" H 8650 6400 50  0001 C CNN
	1    8650 6400
	1    0    0    -1  
$EndComp
Wire Wire Line
	8050 6200 8000 6200
Text Label 8000 6200 2    50   ~ 0
IO_PWM_3
$Comp
L Device:R R42
U 1 1 623A639C
P 8850 5850
F 0 "R42" V 8750 5900 50  0000 R CNN
F 1 "470R" V 8850 5950 50  0000 R CNN
F 2 "Resistor_SMD:R_1206_3216Metric_Pad1.42x1.75mm_HandSolder" V 8780 5850 50  0001 C CNN
F 3 "~" H 8850 5850 50  0001 C CNN
	1    8850 5850
	0    1    1    0   
$EndComp
Wire Wire Line
	8700 5850 8650 5850
Wire Wire Line
	8650 5850 8650 5950
Wire Wire Line
	8700 5950 8650 5950
Connection ~ 8650 5950
Wire Wire Line
	8650 5950 8650 6000
$Comp
L Device:R R43
U 1 1 623A63AB
P 8850 5950
F 0 "R43" V 8950 6000 50  0000 R CNN
F 1 "470R" V 8850 6050 50  0000 R CNN
F 2 "Resistor_SMD:R_1206_3216Metric_Pad1.42x1.75mm_HandSolder" V 8780 5950 50  0001 C CNN
F 3 "~" H 8850 5950 50  0001 C CNN
	1    8850 5950
	0    1    1    0   
$EndComp
$Comp
L Device:R R51
U 1 1 623A63B5
P 9250 5650
F 0 "R51" V 9150 5700 50  0000 R CNN
F 1 "470R" V 9250 5750 50  0000 R CNN
F 2 "Resistor_SMD:R_1206_3216Metric_Pad1.42x1.75mm_HandSolder" V 9180 5650 50  0001 C CNN
F 3 "~" H 9250 5650 50  0001 C CNN
	1    9250 5650
	-1   0    0    1   
$EndComp
$Comp
L Device:R R47
U 1 1 623A63BF
P 9150 5650
F 0 "R47" V 9250 5700 50  0000 R CNN
F 1 "470R" V 9150 5750 50  0000 R CNN
F 2 "Resistor_SMD:R_1206_3216Metric_Pad1.42x1.75mm_HandSolder" V 9080 5650 50  0001 C CNN
F 3 "~" H 9150 5650 50  0001 C CNN
	1    9150 5650
	-1   0    0    1   
$EndComp
Wire Wire Line
	9000 5950 9050 5950
Wire Wire Line
	9250 5800 9250 5950
Wire Wire Line
	9150 5800 9150 5950
Connection ~ 9150 5950
Wire Wire Line
	9150 5950 9250 5950
Wire Wire Line
	9050 5850 9050 5950
Connection ~ 9050 5950
Wire Wire Line
	9050 5950 9150 5950
Wire Wire Line
	9000 5850 9050 5850
Wire Wire Line
	9250 5950 9450 5950
Connection ~ 9250 5950
Wire Wire Line
	9750 5450 9250 5450
Wire Wire Line
	9150 5450 9150 5500
Wire Wire Line
	9250 5500 9250 5450
Connection ~ 9250 5450
Wire Wire Line
	9250 5450 9150 5450
Wire Wire Line
	9750 5300 10400 5300
Wire Wire Line
	9750 5450 9750 5750
Connection ~ 9750 5450
Wire Wire Line
	9750 6200 10450 6200
$Comp
L Device:Polyfuse_Small F1
U 1 1 61B51504
P 1250 5700
F 0 "F1" V 1045 5700 50  0000 C CNN
F 1 "0.75A ; 0.1R" V 1136 5700 50  0000 C CNN
F 2 "Resistor_SMD:R_1812_4532Metric_Pad1.30x3.40mm_HandSolder" H 1300 5500 50  0001 L CNN
F 3 "~" H 1250 5700 50  0001 C CNN
	1    1250 5700
	0    1    1    0   
$EndComp
Wire Wire Line
	800  5550 800  5700
Wire Wire Line
	800  5700 1150 5700
Wire Bus Line
	4850 500  4850 1900
Wire Bus Line
	7100 500  7100 1550
Wire Bus Line
	10650 500  10650 1800
$EndSCHEMATC
