EESchema Schematic File Version 4
EELAYER 30 0
EELAYER END
$Descr A4 11693 8268
encoding utf-8
Sheet 1 1
Title ""
Date ""
Rev ""
Comp ""
Comment1 ""
Comment2 ""
Comment3 ""
Comment4 ""
$EndDescr
$Comp
L power:GND #PWR09
U 1 1 5D766A71
P 2200 1500
F 0 "#PWR09" H 2200 1250 50  0001 C CNN
F 1 "GND" H 2205 1327 50  0000 C CNN
F 2 "" H 2200 1500 50  0001 C CNN
F 3 "" H 2200 1500 50  0001 C CNN
	1    2200 1500
	1    0    0    -1  
$EndComp
$Comp
L Device:C C13
U 1 1 5D7693DC
P 9050 1050
F 0 "C13" V 9000 900 50  0000 C CNN
F 1 "100nF" V 9100 850 50  0000 C CNN
F 2 "Capacitor_SMD:C_0603_1608Metric_Pad1.08x0.95mm_HandSolder" H 9088 900 50  0001 C CNN
F 3 "~" H 9050 1050 50  0001 C CNN
	1    9050 1050
	0    1    1    0   
$EndComp
$Comp
L Device:C C12
U 1 1 5D7697AF
P 9050 850
F 0 "C12" V 9000 700 50  0000 C CNN
F 1 "47uF" V 9100 700 50  0000 C CNN
F 2 "Capacitor_SMD:C_1206_3216Metric_Pad1.33x1.80mm_HandSolder" H 9088 700 50  0001 C CNN
F 3 "~" H 9050 850 50  0001 C CNN
	1    9050 850 
	0    1    1    0   
$EndComp
$Comp
L power:GND #PWR038
U 1 1 5D76E297
P 9250 3900
F 0 "#PWR038" H 9250 3650 50  0001 C CNN
F 1 "GND" H 9255 3727 50  0000 C CNN
F 2 "" H 9250 3900 50  0001 C CNN
F 3 "" H 9250 3900 50  0001 C CNN
	1    9250 3900
	1    0    0    -1  
$EndComp
Wire Wire Line
	9200 850  9250 850 
Wire Wire Line
	9250 850  9250 1050
Wire Wire Line
	9200 1050 9250 1050
Connection ~ 9250 1050
Wire Wire Line
	9250 1050 9250 1100
$Comp
L power:GND #PWR035
U 1 1 5D77FFA0
P 8750 850
F 0 "#PWR035" H 8750 600 50  0001 C CNN
F 1 "GND" V 8755 722 50  0000 R CNN
F 2 "" H 8750 850 50  0001 C CNN
F 3 "" H 8750 850 50  0001 C CNN
	1    8750 850 
	0    1    1    0   
$EndComp
$Comp
L power:GND #PWR036
U 1 1 5D781695
P 8750 1050
F 0 "#PWR036" H 8750 800 50  0001 C CNN
F 1 "GND" V 8755 922 50  0000 R CNN
F 2 "" H 8750 1050 50  0001 C CNN
F 3 "" H 8750 1050 50  0001 C CNN
	1    8750 1050
	0    1    1    0   
$EndComp
$Comp
L power:+3V3 #PWR037
U 1 1 5D781935
P 9250 750
F 0 "#PWR037" H 9250 600 50  0001 C CNN
F 1 "+3V3" H 9265 923 50  0000 C CNN
F 2 "" H 9250 750 50  0001 C CNN
F 3 "" H 9250 750 50  0001 C CNN
	1    9250 750 
	1    0    0    -1  
$EndComp
Wire Wire Line
	9250 750  9250 850 
Connection ~ 9250 850 
$Comp
L power:GND #PWR04
U 1 1 5D78E6C0
P 950 6650
F 0 "#PWR04" H 950 6400 50  0001 C CNN
F 1 "GND" H 955 6477 50  0000 C CNN
F 2 "" H 950 6650 50  0001 C CNN
F 3 "" H 950 6650 50  0001 C CNN
	1    950  6650
	1    0    0    -1  
$EndComp
Wire Wire Line
	900  6600 950  6600
Wire Wire Line
	950  6600 950  6650
$Comp
L Device:R R1
U 1 1 5D79127E
P 1150 6400
F 0 "R1" V 1150 6400 50  0000 C CNN
F 1 "330R" V 1100 6600 50  0000 C CNN
F 2 "Resistor_SMD:R_0603_1608Metric_Pad0.98x0.95mm_HandSolder" V 1080 6400 50  0001 C CNN
F 3 "~" H 1150 6400 50  0001 C CNN
	1    1150 6400
	0    1    1    0   
$EndComp
$Comp
L Device:R R3
U 1 1 5D791539
P 1450 6500
F 0 "R3" V 1450 6500 50  0000 C CNN
F 1 "330R" V 1550 6500 50  0000 C CNN
F 2 "Resistor_SMD:R_0603_1608Metric_Pad0.98x0.95mm_HandSolder" V 1380 6500 50  0001 C CNN
F 3 "~" H 1450 6500 50  0001 C CNN
	1    1450 6500
	0    1    1    0   
$EndComp
Wire Wire Line
	1000 6400 900  6400
Wire Wire Line
	900  6500 1300 6500
Wire Wire Line
	9850 1400 10000 1400
Wire Wire Line
	9850 1600 10000 1600
Text Label 10000 1400 0    50   ~ 0
TXD0
Text Label 10000 1600 0    50   ~ 0
RXD0
Wire Wire Line
	1300 6400 1700 6400
Wire Wire Line
	1600 6500 1700 6500
Text Label 1700 6500 0    50   ~ 0
RXD0
Text Label 1700 6400 0    50   ~ 0
TXD0
$Comp
L Connector_Generic:Conn_01x05 J3
U 1 1 5D79780F
P 700 6400
F 0 "J3" H 700 6100 50  0000 C CNN
F 1 "Programming" V 800 6400 50  0000 C CNN
F 2 "Connector_PinHeader_2.54mm:PinHeader_1x05_P2.54mm_Vertical" H 700 6400 50  0001 C CNN
F 3 "~" H 700 6400 50  0001 C CNN
	1    700  6400
	-1   0    0    1   
$EndComp
$Comp
L Device:R R6
U 1 1 5D79816B
P 2850 6300
F 0 "R6" V 2850 6300 50  0000 C CNN
F 1 "12k" V 2950 6300 50  0000 C CNN
F 2 "Resistor_SMD:R_0603_1608Metric_Pad0.98x0.95mm_HandSolder" V 2780 6300 50  0001 C CNN
F 3 "~" H 2850 6300 50  0001 C CNN
	1    2850 6300
	0    1    1    0   
$EndComp
$Comp
L Device:R R7
U 1 1 5D7985EB
P 2850 6900
F 0 "R7" V 2850 6900 50  0000 C CNN
F 1 "12k" V 2950 6900 50  0000 C CNN
F 2 "Resistor_SMD:R_0603_1608Metric_Pad0.98x0.95mm_HandSolder" V 2780 6900 50  0001 C CNN
F 3 "~" H 2850 6900 50  0001 C CNN
	1    2850 6900
	0    1    1    0   
$EndComp
Text Label 1700 6300 0    50   ~ 0
DTR
Text Label 1700 6200 0    50   ~ 0
RTS
Wire Wire Line
	9850 1300 10000 1300
Text Label 10000 1300 0    50   ~ 0
BOOT
Wire Wire Line
	9850 2400 10000 2400
Wire Wire Line
	9850 2300 10000 2300
Text Label 10000 2300 0    50   ~ 0
UI_RXD_PIN
Text Label 10000 2400 0    50   ~ 0
UI_TXD_PIN
$Comp
L Connector_Generic:Conn_01x03 J4
U 1 1 5D7F7676
P 700 7350
F 0 "J4" H 700 7150 50  0000 C CNN
F 1 "User_Interface" V 800 7350 50  0000 C CNN
F 2 "Connector_PinHeader_2.54mm:PinHeader_1x03_P2.54mm_Vertical" H 700 7350 50  0001 C CNN
F 3 "~" H 700 7350 50  0001 C CNN
	1    700  7350
	-1   0    0    1   
$EndComp
$Comp
L Device:R R2
U 1 1 5D7F83FB
P 1150 7250
F 0 "R2" V 1150 7250 50  0000 C CNN
F 1 "330R" V 1034 7250 50  0000 C CNN
F 2 "Resistor_SMD:R_0603_1608Metric_Pad0.98x0.95mm_HandSolder" V 1080 7250 50  0001 C CNN
F 3 "~" H 1150 7250 50  0001 C CNN
	1    1150 7250
	0    1    1    0   
$EndComp
$Comp
L Device:R R4
U 1 1 5D7F8DB1
P 1450 7350
F 0 "R4" V 1450 7350 50  0000 C CNN
F 1 "330R" V 1550 7350 50  0000 C CNN
F 2 "Resistor_SMD:R_0603_1608Metric_Pad0.98x0.95mm_HandSolder" V 1380 7350 50  0001 C CNN
F 3 "~" H 1450 7350 50  0001 C CNN
	1    1450 7350
	0    1    1    0   
$EndComp
Wire Wire Line
	900  7250 1000 7250
Wire Wire Line
	900  7350 1300 7350
$Comp
L power:GND #PWR05
U 1 1 5D7FC01F
P 950 7500
F 0 "#PWR05" H 950 7250 50  0001 C CNN
F 1 "GND" H 955 7327 50  0000 C CNN
F 2 "" H 950 7500 50  0001 C CNN
F 3 "" H 950 7500 50  0001 C CNN
	1    950  7500
	1    0    0    -1  
$EndComp
Wire Wire Line
	900  7450 950  7450
Wire Wire Line
	950  7450 950  7500
Wire Wire Line
	1300 7250 1700 7250
Wire Wire Line
	1600 7350 1700 7350
Text Label 1700 7350 0    50   ~ 0
UI_RXD_PIN
Text Label 1700 7250 0    50   ~ 0
UI_TXD_PIN
$Comp
L Transistor_BJT:BC817 Q3
U 1 1 5D81092D
P 3250 6300
F 0 "Q3" H 3050 6500 50  0000 L CNN
F 1 "BC817" H 2950 6400 50  0000 L CNN
F 2 "Package_TO_SOT_SMD:SC-59_Handsoldering" H 3250 6300 50  0001 L CNN
F 3 "" H 3250 6300 50  0001 L CNN
	1    3250 6300
	1    0    0    -1  
$EndComp
$Comp
L Transistor_BJT:BC817 Q4
U 1 1 5D82C928
P 3250 6900
F 0 "Q4" H 3050 6750 50  0000 L CNN
F 1 "BC817" H 2950 6850 50  0000 L CNN
F 2 "Package_TO_SOT_SMD:SC-59_Handsoldering" H 3250 6900 50  0001 L CNN
F 3 "" H 3250 6900 50  0001 L CNN
	1    3250 6900
	1    0    0    1   
$EndComp
Wire Wire Line
	3350 6700 3350 6650
Wire Wire Line
	2600 6650 2600 6300
Wire Wire Line
	2600 6300 2400 6300
Wire Wire Line
	3350 6500 3350 6550
Wire Wire Line
	2550 6550 2550 6900
Wire Wire Line
	2550 6900 2400 6900
Wire Wire Line
	3350 6100 3350 6050
Wire Wire Line
	3350 6050 3550 6050
Wire Wire Line
	3350 7100 3350 7150
Wire Wire Line
	3350 7150 3550 7150
Text Label 3750 7150 0    50   ~ 0
BOOT
Text Label 3700 6050 0    50   ~ 0
EN
Wire Wire Line
	8650 1300 8500 1300
Text Label 8500 1300 2    50   ~ 0
EN
Text Label 2400 6300 2    50   ~ 0
DTR
Text Label 2400 6900 2    50   ~ 0
RTS
Wire Wire Line
	8900 850  8750 850 
Wire Wire Line
	8750 1050 8900 1050
$Comp
L Mechanical:MountingHole H1
U 1 1 5D899E96
P 5250 7300
F 0 "H1" H 5350 7346 50  0000 L CNN
F 1 "MountingHole" H 5350 7255 50  0000 L CNN
F 2 "MountingHole:MountingHole_3.2mm_M3" H 5250 7300 50  0001 C CNN
F 3 "~" H 5250 7300 50  0001 C CNN
	1    5250 7300
	1    0    0    -1  
$EndComp
$Comp
L Mechanical:MountingHole H2
U 1 1 5D89A8B6
P 5250 7550
F 0 "H2" H 5350 7596 50  0000 L CNN
F 1 "MountingHole" H 5350 7505 50  0000 L CNN
F 2 "MountingHole:MountingHole_3.2mm_M3" H 5250 7550 50  0001 C CNN
F 3 "~" H 5250 7550 50  0001 C CNN
	1    5250 7550
	1    0    0    -1  
$EndComp
$Comp
L Mechanical:MountingHole H3
U 1 1 5D89AB74
P 6200 7300
F 0 "H3" H 6300 7346 50  0000 L CNN
F 1 "MountingHole" H 6300 7255 50  0000 L CNN
F 2 "MountingHole:MountingHole_3.2mm_M3" H 6200 7300 50  0001 C CNN
F 3 "~" H 6200 7300 50  0001 C CNN
	1    6200 7300
	1    0    0    -1  
$EndComp
$Comp
L Mechanical:MountingHole H4
U 1 1 5D89ADDF
P 6200 7550
F 0 "H4" H 6300 7596 50  0000 L CNN
F 1 "MountingHole" H 6300 7505 50  0000 L CNN
F 2 "MountingHole:MountingHole_3.2mm_M3" H 6200 7550 50  0001 C CNN
F 3 "~" H 6200 7550 50  0001 C CNN
	1    6200 7550
	1    0    0    -1  
$EndComp
$Comp
L RF_Module:ESP32-WROOM-32 U4
U 1 1 5D75383F
P 9250 2500
F 0 "U4" H 9400 3950 50  0000 C CNN
F 1 "ESP32-WROOM-32" H 9700 3850 50  0000 C CNN
F 2 "RF_Module:ESP32-WROOM-32" H 9250 1000 50  0001 C CNN
F 3 "https://www.espressif.com/sites/default/files/documentation/esp32-wroom-32_datasheet_en.pdf" H 8950 2550 50  0001 C CNN
	1    9250 2500
	1    0    0    -1  
$EndComp
$Comp
L Device:R R10
U 1 1 5DBFF55F
P 3550 5850
F 0 "R10" V 3550 5850 50  0000 C CNN
F 1 "47k" V 3434 5850 50  0000 C CNN
F 2 "Resistor_SMD:R_0603_1608Metric_Pad0.98x0.95mm_HandSolder" V 3480 5850 50  0001 C CNN
F 3 "~" H 3550 5850 50  0001 C CNN
	1    3550 5850
	-1   0    0    1   
$EndComp
$Comp
L Device:R R11
U 1 1 5DC00506
P 3550 7350
F 0 "R11" V 3550 7350 50  0000 C CNN
F 1 "47k" V 3434 7350 50  0000 C CNN
F 2 "Resistor_SMD:R_0603_1608Metric_Pad0.98x0.95mm_HandSolder" V 3480 7350 50  0001 C CNN
F 3 "~" H 3550 7350 50  0001 C CNN
	1    3550 7350
	-1   0    0    1   
$EndComp
Wire Wire Line
	3550 7200 3550 7150
Connection ~ 3550 7150
Wire Wire Line
	3550 7150 3750 7150
Wire Wire Line
	3550 6000 3550 6050
Connection ~ 3550 6050
Wire Wire Line
	3550 6050 3700 6050
$Comp
L power:+3V3 #PWR015
U 1 1 5DC0D655
P 3550 5650
F 0 "#PWR015" H 3550 5500 50  0001 C CNN
F 1 "+3V3" H 3565 5823 50  0000 C CNN
F 2 "" H 3550 5650 50  0001 C CNN
F 3 "" H 3550 5650 50  0001 C CNN
	1    3550 5650
	1    0    0    -1  
$EndComp
Wire Wire Line
	3550 5650 3550 5700
$Comp
L power:+3V3 #PWR017
U 1 1 5DC13D33
P 3550 7550
F 0 "#PWR017" H 3550 7400 50  0001 C CNN
F 1 "+3V3" H 3565 7723 50  0000 C CNN
F 2 "" H 3550 7550 50  0001 C CNN
F 3 "" H 3550 7550 50  0001 C CNN
	1    3550 7550
	-1   0    0    1   
$EndComp
Wire Wire Line
	3550 7550 3550 7500
$Comp
L Device:C C3
U 1 1 5DC6021F
P 3550 6250
F 0 "C3" H 3700 6250 50  0000 C CNN
F 1 "100nF" H 3750 6150 50  0000 C CNN
F 2 "Capacitor_SMD:C_0603_1608Metric_Pad1.08x0.95mm_HandSolder" H 3588 6100 50  0001 C CNN
F 3 "~" H 3550 6250 50  0001 C CNN
	1    3550 6250
	1    0    0    -1  
$EndComp
Wire Wire Line
	900  6200 1700 6200
Wire Wire Line
	900  6300 1700 6300
Wire Wire Line
	2600 6300 2700 6300
Wire Wire Line
	3000 6300 3050 6300
Wire Wire Line
	2550 6550 3350 6550
Wire Wire Line
	2600 6650 3350 6650
Wire Wire Line
	2550 6900 2700 6900
Wire Wire Line
	3000 6900 3050 6900
Connection ~ 2550 6900
Connection ~ 2600 6300
Wire Wire Line
	3550 6050 3550 6100
$Comp
L power:GND #PWR016
U 1 1 5DC6B185
P 3550 6450
F 0 "#PWR016" H 3550 6200 50  0001 C CNN
F 1 "GND" V 3555 6322 50  0000 R CNN
F 2 "" H 3550 6450 50  0001 C CNN
F 3 "" H 3550 6450 50  0001 C CNN
	1    3550 6450
	1    0    0    -1  
$EndComp
Wire Wire Line
	3550 6400 3550 6450
Text Notes 3900 6550 0    50   ~ 0
Timing of DTR and RTS\nis not correct. Therefore\nEN signal have to be\ndelayed a bit (400 us and\nup) -> 100 nF cover that
$Comp
L power:+BATT #PWR07
U 1 1 5E46A846
P 1700 800
F 0 "#PWR07" H 1700 650 50  0001 C CNN
F 1 "+BATT" H 1715 973 50  0000 C CNN
F 2 "" H 1700 800 50  0001 C CNN
F 3 "" H 1700 800 50  0001 C CNN
	1    1700 800 
	1    0    0    -1  
$EndComp
$Comp
L Device:Polyfuse_Small F1
U 1 1 5E46C24C
P 1950 1050
F 0 "F1" V 1745 1050 50  0000 C CNN
F 1 "0.75A ; 0.1R" V 1836 1050 50  0000 C CNN
F 2 "Resistor_SMD:R_1812_4532Metric_Pad1.30x3.40mm_HandSolder" H 2000 850 50  0001 L CNN
F 3 "https://www.gme.cz/data/attachments/dsh.971-036.1.pdf" H 1950 1050 50  0001 C CNN
F 4 "R" H 1950 1050 50  0001 C CNN "Spice_Primitive"
F 5 "0.75" H 1950 1050 50  0001 C CNN "Spice_Model"
F 6 "Y" H 1950 1050 50  0001 C CNN "Spice_Netlist_Enabled"
	1    1950 1050
	0    1    1    0   
$EndComp
Wire Wire Line
	9850 2600 10000 2600
Wire Wire Line
	9850 2500 10000 2500
Wire Wire Line
	9850 1800 10000 1800
Wire Wire Line
	9850 1700 10000 1700
Wire Wire Line
	9850 1500 10000 1500
Wire Wire Line
	9850 2800 10000 2800
Wire Wire Line
	9850 2700 10000 2700
$Comp
L power:GND #PWR03
U 1 1 5E7C9F65
P 900 5700
F 0 "#PWR03" H 900 5450 50  0001 C CNN
F 1 "GND" H 905 5527 50  0000 C CNN
F 2 "" H 900 5700 50  0001 C CNN
F 3 "" H 900 5700 50  0001 C CNN
	1    900  5700
	1    0    0    -1  
$EndComp
Wire Wire Line
	850  5650 900  5650
Wire Wire Line
	900  5650 900  5700
Wire Wire Line
	850  5550 950  5550
Wire Wire Line
	850  5450 950  5450
Wire Wire Line
	850  5350 950  5350
Wire Wire Line
	850  5250 950  5250
Text Label 950  5550 0    50   ~ 0
JTAG_TDI
Text Label 950  5450 0    50   ~ 0
JTAG_TCK
$Comp
L Connector_Generic:Conn_01x06 J2
U 1 1 5E7ECBCF
P 650 5450
F 0 "J2" H 650 5050 50  0000 C CNN
F 1 "Debug" V 750 5400 50  0000 C CNN
F 2 "Connector_PinHeader_2.54mm:PinHeader_1x06_P2.54mm_Vertical" H 650 5450 50  0001 C CNN
F 3 "~" H 650 5450 50  0001 C CNN
	1    650  5450
	-1   0    0    1   
$EndComp
Wire Wire Line
	850  5150 950  5150
Text Label 950  5150 0    50   ~ 0
EN
Text Label 950  5350 0    50   ~ 0
JTAG_TMS
Text Label 950  5250 0    50   ~ 0
JTAG_TDO
Wire Wire Line
	9850 1900 9950 1900
Text Label 9950 1900 0    50   ~ 0
JTAG_TDI
Wire Wire Line
	9850 2000 9950 2000
Text Label 9950 2000 0    50   ~ 0
JTAG_TCK
Wire Wire Line
	9850 2100 9950 2100
Text Label 9950 2100 0    50   ~ 0
JTAG_TMS
Wire Wire Line
	9850 2200 9950 2200
Text Label 9950 2200 0    50   ~ 0
JTAG_TDO
Connection ~ 3900 900 
Connection ~ 4850 900 
Wire Wire Line
	4900 900  4850 900 
Wire Wire Line
	4900 850  4900 900 
$Comp
L power:+3V3 #PWR020
U 1 1 5D75D416
P 4900 850
F 0 "#PWR020" H 4900 700 50  0001 C CNN
F 1 "+3V3" H 4915 1023 50  0000 C CNN
F 2 "" H 4900 850 50  0001 C CNN
F 3 "" H 4900 850 50  0001 C CNN
	1    4900 850 
	1    0    0    -1  
$EndComp
Connection ~ 4600 900 
Wire Wire Line
	4850 900  4850 950 
Wire Wire Line
	4600 900  4850 900 
Wire Wire Line
	4600 900  4600 950 
Wire Wire Line
	4550 900  4600 900 
Wire Wire Line
	3900 900  3900 950 
Wire Wire Line
	3950 900  3900 900 
Wire Wire Line
	4250 1300 4250 1350
Wire Wire Line
	4250 1300 4600 1300
Connection ~ 4250 1300
Wire Wire Line
	4250 1200 4250 1300
Wire Wire Line
	4600 1300 4850 1300
Connection ~ 4600 1300
Wire Wire Line
	4600 1250 4600 1300
Wire Wire Line
	4850 1300 4850 1250
Wire Wire Line
	3900 1300 4250 1300
Wire Wire Line
	3900 1250 3900 1300
$Comp
L Device:C C6
U 1 1 5D755C9B
P 4600 1100
F 0 "C6" H 4600 1200 50  0000 L CNN
F 1 "100nF" H 4350 1000 50  0000 L CNN
F 2 "Capacitor_SMD:C_0603_1608Metric_Pad1.08x0.95mm_HandSolder" H 4638 950 50  0001 C CNN
F 3 "~" H 4600 1100 50  0001 C CNN
	1    4600 1100
	1    0    0    -1  
$EndComp
$Comp
L Device:C C5
U 1 1 5D754EC0
P 3900 1100
F 0 "C5" H 3650 1100 50  0000 L CNN
F 1 "100nF" H 3650 1000 50  0000 L CNN
F 2 "Capacitor_SMD:C_0603_1608Metric_Pad1.08x0.95mm_HandSolder" H 3938 950 50  0001 C CNN
F 3 "~" H 3900 1100 50  0001 C CNN
	1    3900 1100
	1    0    0    -1  
$EndComp
$Comp
L Device:CP C7
U 1 1 5D754703
P 4850 1100
F 0 "C7" H 4968 1146 50  0000 L CNN
F 1 "4u7" H 4968 1055 50  0000 L CNN
F 2 "Capacitor_Tantalum_SMD:CP_EIA-3216-18_Kemet-A_Pad1.58x1.35mm_HandSolder" H 4888 950 50  0001 C CNN
F 3 "~" H 4850 1100 50  0001 C CNN
	1    4850 1100
	1    0    0    -1  
$EndComp
$Comp
L Regulator_Linear:AMS1117-3.3 U2
U 1 1 5D753C0D
P 4250 900
F 0 "U2" H 4250 1142 50  0000 C CNN
F 1 "AMS1117-3.3V" H 4250 1051 50  0000 C CNN
F 2 "Package_TO_SOT_SMD:SOT-223-3_TabPin2" H 4250 1100 50  0001 C CNN
F 3 "http://www.advanced-monolithic.com/pdf/ds1117.pdf" H 4350 650 50  0001 C CNN
	1    4250 900 
	1    0    0    -1  
$EndComp
$Comp
L Connector_Generic:Conn_01x02 J6
U 1 1 5E606AD9
P 2800 650
F 0 "J6" H 2800 750 50  0000 C CNN
F 1 "PWR_SWITCH" V 2900 600 50  0000 C CNN
F 2 "Connector_PinHeader_2.54mm:PinHeader_1x02_P2.54mm_Vertical" H 2800 650 50  0001 C CNN
F 3 "~" H 2800 650 50  0001 C CNN
	1    2800 650 
	0    -1   -1   0   
$EndComp
Wire Wire Line
	2900 900  2900 850 
Wire Wire Line
	2800 850  2800 1050
NoConn ~ 8650 2500
NoConn ~ 8650 2600
NoConn ~ 8650 2700
NoConn ~ 8650 2800
NoConn ~ 8650 2900
NoConn ~ 8650 3000
Wire Wire Line
	10000 3600 9850 3600
$Comp
L Connector:TestPoint TP1
U 1 1 5E85D920
P 3900 850
F 0 "TP1" H 3850 1050 50  0000 L CNN
F 1 "BATT_SW" V 3800 1350 50  0001 L CNN
F 2 "TestPoint:TestPoint_Pad_D1.5mm" H 4100 850 50  0001 C CNN
F 3 "~" H 4100 850 50  0001 C CNN
	1    3900 850 
	1    0    0    -1  
$EndComp
Wire Wire Line
	3900 850  3900 900 
$Comp
L power:PWR_FLAG #FLG04
U 1 1 5E9BE3C4
P 3300 850
F 0 "#FLG04" H 3300 925 50  0001 C CNN
F 1 "PWR_FLAG" H 3300 1023 50  0000 C CNN
F 2 "" H 3300 850 50  0001 C CNN
F 3 "~" H 3300 850 50  0001 C CNN
	1    3300 850 
	1    0    0    -1  
$EndComp
Wire Wire Line
	3300 850  3300 900 
Wire Wire Line
	3300 900  3900 900 
Connection ~ 3300 900 
Wire Wire Line
	10000 3400 9850 3400
Wire Wire Line
	9850 3300 10000 3300
Wire Wire Line
	10000 3200 9850 3200
Wire Wire Line
	10000 3100 9850 3100
Text Label 3400 900  0    50   ~ 0
BATT_SW
$Comp
L Diode:1N5820 D1
U 1 1 5E823605
P 2200 1250
F 0 "D1" V 2200 1350 50  0000 L CNN
F 1 "1N5820" V 2300 1300 50  0000 L CNN
F 2 "Diode_THT:D_DO-201AD_P15.24mm_Horizontal" H 2200 1075 50  0001 C CNN
F 3 "http://www.vishay.com/docs/88526/1n5820.pdf" H 2200 1250 50  0001 C CNN
	1    2200 1250
	0    1    1    0   
$EndComp
Wire Wire Line
	2200 1100 2200 1050
$Comp
L Connector:TestPoint TP4
U 1 1 5ECDD7A7
P 4950 900
F 0 "TP4" V 4950 1100 50  0000 L CNN
F 1 "+3V3" V 4850 1400 50  0001 L CNN
F 2 "TestPoint:TestPoint_Pad_D1.5mm" H 5150 900 50  0001 C CNN
F 3 "~" H 5150 900 50  0001 C CNN
	1    4950 900 
	0    1    1    0   
$EndComp
$Comp
L Connector:TestPoint TP5
U 1 1 5ECE70EA
P 4950 1300
F 0 "TP5" V 4950 1500 50  0000 L CNN
F 1 "GND" V 4850 1800 50  0001 L CNN
F 2 "TestPoint:TestPoint_Pad_D1.5mm" H 5150 1300 50  0001 C CNN
F 3 "~" H 5150 1300 50  0001 C CNN
	1    4950 1300
	0    1    1    0   
$EndComp
Wire Wire Line
	4950 900  4900 900 
Connection ~ 4900 900 
Wire Wire Line
	4950 1300 4850 1300
Connection ~ 4850 1300
Text Label 10000 2700 0    50   ~ 0
CAN_D_PIN
Text Label 10000 2800 0    50   ~ 0
CAN_R_PIN
Wire Wire Line
	9850 3500 10000 3500
$Comp
L Diode:LL4148 D6
U 1 1 5F5749CC
P 6800 5650
F 0 "D6" H 6800 5867 50  0000 C CNN
F 1 "LL4148" H 6800 5776 50  0000 C CNN
F 2 "Diode_SMD:D_MiniMELF" H 6800 5475 50  0001 C CNN
F 3 "http://www.vishay.com/docs/85557/ll4148.pdf" H 6800 5650 50  0001 C CNN
	1    6800 5650
	1    0    0    -1  
$EndComp
Wire Wire Line
	6950 5650 7050 5650
Text Label 7150 5650 0    50   ~ 0
BTN_CODE_LOCK_PIN
Text Label 10000 3400 0    50   ~ 0
BTN_CODE_LOCK_PIN
$Comp
L Device:C C10
U 1 1 5F5A9602
P 7050 5850
F 0 "C10" H 6800 5850 50  0000 L CNN
F 1 "100nF" H 6800 5750 50  0000 L CNN
F 2 "Capacitor_SMD:C_0603_1608Metric_Pad1.08x0.95mm_HandSolder" H 7088 5700 50  0001 C CNN
F 3 "~" H 7050 5850 50  0001 C CNN
	1    7050 5850
	1    0    0    -1  
$EndComp
Wire Wire Line
	7050 5700 7050 5650
Connection ~ 7050 5650
Wire Wire Line
	7050 5650 7150 5650
$Comp
L power:GND #PWR031
U 1 1 5F5AEBEB
P 7050 6050
F 0 "#PWR031" H 7050 5800 50  0001 C CNN
F 1 "GND" H 7055 5877 50  0000 C CNN
F 2 "" H 7050 6050 50  0001 C CNN
F 3 "" H 7050 6050 50  0001 C CNN
	1    7050 6050
	1    0    0    -1  
$EndComp
Wire Wire Line
	7050 6050 7050 6000
$Comp
L Device:R R18
U 1 1 5F5C2450
P 6450 5650
F 0 "R18" V 6450 5650 50  0000 C CNN
F 1 "10k" V 6550 5650 50  0000 C CNN
F 2 "Resistor_SMD:R_0603_1608Metric_Pad0.98x0.95mm_HandSolder" V 6380 5650 50  0001 C CNN
F 3 "~" H 6450 5650 50  0001 C CNN
	1    6450 5650
	0    1    1    0   
$EndComp
Wire Wire Line
	6650 5650 6600 5650
Wire Wire Line
	6250 5650 6300 5650
$Comp
L Transistor_BJT:BC817 Q6
U 1 1 5F5E06D2
P 6700 3800
F 0 "Q6" H 6500 4000 50  0000 L CNN
F 1 "BC817" H 6400 3900 50  0000 L CNN
F 2 "Package_TO_SOT_SMD:SC-59_Handsoldering" H 6700 3800 50  0001 L CNN
F 3 "" H 6700 3800 50  0001 L CNN
	1    6700 3800
	1    0    0    -1  
$EndComp
$Comp
L power:GND #PWR029
U 1 1 5F5E20C4
P 6800 4200
F 0 "#PWR029" H 6800 3950 50  0001 C CNN
F 1 "GND" V 6805 4072 50  0000 R CNN
F 2 "" H 6800 4200 50  0001 C CNN
F 3 "" H 6800 4200 50  0001 C CNN
	1    6800 4200
	1    0    0    -1  
$EndComp
Wire Wire Line
	6800 4000 6800 4200
$Comp
L Device:R R17
U 1 1 5F5E81A4
P 6400 4000
F 0 "R17" V 6400 4000 50  0000 C CNN
F 1 "22k" V 6500 4000 50  0000 C CNN
F 2 "Resistor_SMD:R_0603_1608Metric_Pad0.98x0.95mm_HandSolder" V 6330 4000 50  0001 C CNN
F 3 "~" H 6400 4000 50  0001 C CNN
	1    6400 4000
	-1   0    0    1   
$EndComp
$Comp
L power:GND #PWR025
U 1 1 5F5EFD8E
P 6400 4200
F 0 "#PWR025" H 6400 3950 50  0001 C CNN
F 1 "GND" V 6405 4072 50  0000 R CNN
F 2 "" H 6400 4200 50  0001 C CNN
F 3 "" H 6400 4200 50  0001 C CNN
	1    6400 4200
	1    0    0    -1  
$EndComp
Wire Wire Line
	6400 4150 6400 4200
Wire Wire Line
	6400 3850 6400 3800
Wire Wire Line
	6400 3800 6500 3800
$Comp
L Device:R R16
U 1 1 5F6006B2
P 6200 3800
F 0 "R16" V 6200 3800 50  0000 C CNN
F 1 "330k" V 6300 3800 50  0000 C CNN
F 2 "Resistor_SMD:R_0603_1608Metric_Pad0.98x0.95mm_HandSolder" V 6130 3800 50  0001 C CNN
F 3 "~" H 6200 3800 50  0001 C CNN
	1    6200 3800
	0    -1   -1   0   
$EndComp
Wire Wire Line
	6350 3800 6400 3800
Connection ~ 6400 3800
Wire Wire Line
	6050 3800 5900 3800
Text Label 5900 3800 2    50   ~ 0
CAN_L
$Comp
L Device:R R20
U 1 1 5F60D176
P 6800 3350
F 0 "R20" V 6800 3350 50  0000 C CNN
F 1 "330k" V 6900 3350 50  0000 C CNN
F 2 "Resistor_SMD:R_0603_1608Metric_Pad0.98x0.95mm_HandSolder" V 6730 3350 50  0001 C CNN
F 3 "~" H 6800 3350 50  0001 C CNN
	1    6800 3350
	1    0    0    -1  
$EndComp
Wire Wire Line
	6800 3500 6800 3550
Wire Wire Line
	6800 3550 7100 3550
Connection ~ 6800 3550
Wire Wire Line
	6800 3550 6800 3600
Text Label 7100 3550 0    50   ~ 0
CAN_ACTIVE_PIN
$Comp
L power:+3V3 #PWR028
U 1 1 5F61A2F1
P 6800 3150
F 0 "#PWR028" H 6800 3000 50  0001 C CNN
F 1 "+3V3" H 6815 3323 50  0000 C CNN
F 2 "" H 6800 3150 50  0001 C CNN
F 3 "" H 6800 3150 50  0001 C CNN
	1    6800 3150
	1    0    0    -1  
$EndComp
Wire Wire Line
	6800 3150 6800 3200
Text Notes 7050 3900 0    50   ~ 0
Simple analog comparator\nwith threshold above 6 V
Text Label 10000 3100 0    50   ~ 0
BUZZER_DAC_PIN
$Comp
L Transistor_BJT:BC817 Q1
U 1 1 5F5EE0C7
P 2600 4100
F 0 "Q1" H 2400 4300 50  0000 L CNN
F 1 "BC817" H 2300 4200 50  0000 L CNN
F 2 "Package_TO_SOT_SMD:SC-59_Handsoldering" H 2600 4100 50  0001 L CNN
F 3 "" H 2600 4100 50  0001 L CNN
	1    2600 4100
	1    0    0    -1  
$EndComp
$Comp
L Device:R R5
U 1 1 5F600AF5
P 2150 4100
F 0 "R5" V 2150 4100 50  0000 C CNN
F 1 "10k" V 2250 4100 50  0000 C CNN
F 2 "Resistor_SMD:R_0603_1608Metric_Pad0.98x0.95mm_HandSolder" V 2080 4100 50  0001 C CNN
F 3 "~" H 2150 4100 50  0001 C CNN
	1    2150 4100
	0    -1   1    0   
$EndComp
Wire Wire Line
	2300 4100 2400 4100
$Comp
L power:+3V3 #PWR010
U 1 1 5F60793A
P 2700 3450
F 0 "#PWR010" H 2700 3300 50  0001 C CNN
F 1 "+3V3" H 2715 3623 50  0000 C CNN
F 2 "" H 2700 3450 50  0001 C CNN
F 3 "" H 2700 3450 50  0001 C CNN
	1    2700 3450
	-1   0    0    -1  
$EndComp
$Comp
L power:GND #PWR011
U 1 1 5F608790
P 2700 4350
F 0 "#PWR011" H 2700 4100 50  0001 C CNN
F 1 "GND" H 2705 4177 50  0000 C CNN
F 2 "" H 2700 4350 50  0001 C CNN
F 3 "" H 2700 4350 50  0001 C CNN
	1    2700 4350
	-1   0    0    -1  
$EndComp
Wire Wire Line
	2700 4350 2700 4300
$Comp
L Device:Buzzer BZ1
U 1 1 5F611677
P 2800 3700
F 0 "BZ1" H 3000 3800 50  0000 C CNN
F 1 "Buzzer" H 3050 3750 50  0000 C CNN
F 2 "Buzzer_Beeper:Buzzer_12x9.5RM7.6" V 2775 3800 50  0001 C CNN
F 3 "~" V 2775 3800 50  0001 C CNN
	1    2800 3700
	1    0    0    -1  
$EndComp
Wire Wire Line
	2700 3800 2700 3850
Wire Wire Line
	2700 3600 2700 3550
$Comp
L Diode:LL4148 D2
U 1 1 5F62E18D
P 2600 3700
F 0 "D2" H 2600 3917 50  0000 C CNN
F 1 "LL4148" H 2600 3826 50  0000 C CNN
F 2 "Diode_SMD:D_MiniMELF" H 2600 3525 50  0001 C CNN
F 3 "http://www.vishay.com/docs/85557/ll4148.pdf" H 2600 3700 50  0001 C CNN
	1    2600 3700
	0    -1   1    0   
$EndComp
Wire Wire Line
	2600 3550 2700 3550
Connection ~ 2700 3550
Wire Wire Line
	2700 3550 2700 3450
Wire Wire Line
	2600 3850 2700 3850
Connection ~ 2700 3850
Wire Wire Line
	2700 3850 2700 3900
Wire Wire Line
	2000 4100 1600 4100
Text Label 1600 4100 1    50   ~ 0
BUZZER_DAC_PIN
Text Label 10000 3500 0    50   ~ 0
FACTORY_RESET_PIN
$Comp
L Switch:SW_Push SW1
U 1 1 5F7025C3
P 8650 5900
F 0 "SW1" V 8604 6048 50  0000 L CNN
F 1 "Factory reset" V 8695 6048 50  0000 L CNN
F 2 "Button_Switch_THT:SW_PUSH_6mm_H7.3mm" H 8650 6100 50  0001 C CNN
F 3 "~" H 8650 6100 50  0001 C CNN
	1    8650 5900
	0    1    1    0   
$EndComp
$Comp
L Device:C C11
U 1 1 5F7089B0
P 8450 5900
F 0 "C11" H 8600 5900 50  0000 C CNN
F 1 "100nF" H 8650 5800 50  0000 C CNN
F 2 "Capacitor_SMD:C_0603_1608Metric_Pad1.08x0.95mm_HandSolder" H 8488 5750 50  0001 C CNN
F 3 "~" H 8450 5900 50  0001 C CNN
	1    8450 5900
	-1   0    0    1   
$EndComp
$Comp
L power:GND #PWR034
U 1 1 5F70969E
P 8650 6200
F 0 "#PWR034" H 8650 5950 50  0001 C CNN
F 1 "GND" H 8700 6050 50  0000 R CNN
F 2 "" H 8650 6200 50  0001 C CNN
F 3 "" H 8650 6200 50  0001 C CNN
	1    8650 6200
	1    0    0    -1  
$EndComp
Wire Wire Line
	8650 6100 8650 6150
Wire Wire Line
	8450 6050 8450 6150
Wire Wire Line
	8450 6150 8650 6150
Connection ~ 8650 6150
Wire Wire Line
	8650 6150 8650 6200
Wire Wire Line
	8450 5750 8450 5650
Wire Wire Line
	8450 5650 8650 5650
Wire Wire Line
	8650 5650 8650 5700
Wire Wire Line
	8650 5650 8650 5550
Connection ~ 8650 5650
Text Label 8650 5550 0    50   ~ 0
FACTORY_RESET_PIN
$Comp
L Regulator_Linear:AMS1117-3.3 U1
U 1 1 5F7E6E38
P 3250 2550
F 0 "U1" H 3250 2792 50  0000 C CNN
F 1 "AMS1117-5.0V" H 3250 2701 50  0000 C CNN
F 2 "Package_TO_SOT_SMD:SOT-223-3_TabPin2" H 3250 2750 50  0001 C CNN
F 3 "http://www.advanced-monolithic.com/pdf/ds1117.pdf" H 3350 2300 50  0001 C CNN
	1    3250 2550
	1    0    0    -1  
$EndComp
$Comp
L Device:C C1
U 1 1 5F876A0E
P 2900 2750
F 0 "C1" H 2650 2750 50  0000 L CNN
F 1 "100nF" H 2650 2650 50  0000 L CNN
F 2 "Capacitor_SMD:C_0603_1608Metric_Pad1.08x0.95mm_HandSolder" H 2938 2600 50  0001 C CNN
F 3 "~" H 2900 2750 50  0001 C CNN
	1    2900 2750
	1    0    0    -1  
$EndComp
$Comp
L Device:C C4
U 1 1 5F876E3F
P 3600 2750
F 0 "C4" H 3600 2850 50  0000 L CNN
F 1 "100nF" H 3350 2650 50  0000 L CNN
F 2 "Capacitor_SMD:C_0603_1608Metric_Pad1.08x0.95mm_HandSolder" H 3638 2600 50  0001 C CNN
F 3 "~" H 3600 2750 50  0001 C CNN
	1    3600 2750
	1    0    0    -1  
$EndComp
Wire Wire Line
	2950 2550 2900 2550
Connection ~ 2900 2550
Wire Wire Line
	2900 2550 2900 2600
$Comp
L power:GND #PWR012
U 1 1 5F8AD070
P 3250 3000
F 0 "#PWR012" H 3250 2750 50  0001 C CNN
F 1 "GND" H 3400 2950 50  0000 C CNN
F 2 "" H 3250 3000 50  0001 C CNN
F 3 "" H 3250 3000 50  0001 C CNN
	1    3250 3000
	1    0    0    -1  
$EndComp
Wire Wire Line
	3600 2900 3600 2950
Wire Wire Line
	3600 2950 3250 2950
Wire Wire Line
	2900 2950 2900 2900
Wire Wire Line
	3250 2850 3250 2950
Connection ~ 3250 2950
Wire Wire Line
	3250 2950 2900 2950
Wire Wire Line
	3250 2950 3250 3000
Wire Wire Line
	3550 2550 3600 2550
Wire Wire Line
	3600 2550 3600 2600
$Comp
L Interface_CAN_LIN:MCP2551-I-SN U3
U 1 1 5F91221E
P 6400 2350
F 0 "U3" H 6750 2700 50  0000 C CNN
F 1 "MCP2551-I-SN" H 6100 2000 50  0000 C CNN
F 2 "Package_SO:SOIC-8_3.9x4.9mm_P1.27mm" H 6400 1850 50  0001 C CIN
F 3 "http://ww1.microchip.com/downloads/en/devicedoc/21667d.pdf" H 6400 2350 50  0001 C CNN
	1    6400 2350
	-1   0    0    -1  
$EndComp
$Comp
L power:+5V #PWR018
U 1 1 5F924F46
P 3950 2500
F 0 "#PWR018" H 3950 2350 50  0001 C CNN
F 1 "+5V" H 3965 2673 50  0000 C CNN
F 2 "" H 3950 2500 50  0001 C CNN
F 3 "" H 3950 2500 50  0001 C CNN
	1    3950 2500
	1    0    0    -1  
$EndComp
$Comp
L Device:C C8
U 1 1 5F928CC6
P 6600 1900
F 0 "C8" H 6600 2000 50  0000 L CNN
F 1 "100nF" H 6350 1800 50  0000 L CNN
F 2 "Capacitor_SMD:C_0603_1608Metric_Pad1.08x0.95mm_HandSolder" H 6638 1750 50  0001 C CNN
F 3 "~" H 6600 1900 50  0001 C CNN
	1    6600 1900
	0    1    1    0   
$EndComp
$Comp
L power:GND #PWR027
U 1 1 5F92AD64
P 6800 1900
F 0 "#PWR027" H 6800 1650 50  0001 C CNN
F 1 "GND" H 6805 1727 50  0000 C CNN
F 2 "" H 6800 1900 50  0001 C CNN
F 3 "" H 6800 1900 50  0001 C CNN
	1    6800 1900
	0    -1   -1   0   
$EndComp
Wire Wire Line
	6800 1900 6750 1900
Wire Wire Line
	6450 1900 6400 1900
Wire Wire Line
	6400 1900 6400 1950
Wire Wire Line
	3600 2550 3950 2550
Wire Wire Line
	3950 2550 3950 2500
Connection ~ 3600 2550
$Comp
L Connector:TestPoint TP2
U 1 1 5F947FFB
P 4000 2550
F 0 "TP2" V 4000 2750 50  0000 L CNN
F 1 "+5V" V 3900 3050 50  0001 L CNN
F 2 "TestPoint:TestPoint_Pad_D1.5mm" H 4200 2550 50  0001 C CNN
F 3 "~" H 4200 2550 50  0001 C CNN
	1    4000 2550
	0    1    1    0   
$EndComp
$Comp
L Connector:TestPoint TP3
U 1 1 5F9489FC
P 4000 2950
F 0 "TP3" V 4000 3150 50  0000 L CNN
F 1 "GND" V 3900 3450 50  0001 L CNN
F 2 "TestPoint:TestPoint_Pad_D1.5mm" H 4200 2950 50  0001 C CNN
F 3 "~" H 4200 2950 50  0001 C CNN
	1    4000 2950
	0    1    1    0   
$EndComp
Wire Wire Line
	4000 2950 3600 2950
Connection ~ 3600 2950
Wire Wire Line
	4000 2550 3950 2550
Connection ~ 3950 2550
Connection ~ 6400 1900
$Comp
L power:GND #PWR024
U 1 1 5F966C5B
P 6400 2800
F 0 "#PWR024" H 6400 2550 50  0001 C CNN
F 1 "GND" H 6405 2627 50  0000 C CNN
F 2 "" H 6400 2800 50  0001 C CNN
F 3 "" H 6400 2800 50  0001 C CNN
	1    6400 2800
	1    0    0    -1  
$EndComp
Wire Wire Line
	6400 2750 6400 2800
Wire Wire Line
	2200 1400 2200 1500
Wire Wire Line
	1500 1050 1700 1050
Wire Wire Line
	1500 1150 1550 1150
Text Label 1550 1150 0    50   ~ 0
CAN_H
Wire Wire Line
	1700 800  1700 900 
Connection ~ 1700 1050
Wire Wire Line
	1700 1050 1850 1050
Wire Wire Line
	2200 1050 2800 1050
Wire Wire Line
	2200 1050 2050 1050
Connection ~ 2200 1050
Wire Wire Line
	1500 1250 1550 1250
Text Label 1550 1250 0    50   ~ 0
CAN_L
Wire Wire Line
	1500 1350 1550 1350
Text Label 1550 1350 0    50   ~ 0
TRUNK_SWITCH
Text Label 6250 5650 2    50   ~ 0
TRUNK_SWITCH
$Comp
L power:GND #PWR08
U 1 1 5FA7D348
P 1700 1500
F 0 "#PWR08" H 1700 1250 50  0001 C CNN
F 1 "GND" H 1705 1327 50  0000 C CNN
F 2 "" H 1700 1500 50  0001 C CNN
F 3 "" H 1700 1500 50  0001 C CNN
	1    1700 1500
	1    0    0    -1  
$EndComp
$Comp
L Device:R R15
U 1 1 5FAA55EF
P 5700 2350
F 0 "R15" V 5700 2350 50  0000 C CNN
F 1 "N.A." V 5800 2350 50  0000 C CNN
F 2 "Resistor_SMD:R_0603_1608Metric_Pad0.98x0.95mm_HandSolder" V 5630 2350 50  0001 C CNN
F 3 "~" H 5700 2350 50  0001 C CNN
	1    5700 2350
	-1   0    0    1   
$EndComp
Wire Wire Line
	5900 2250 5850 2250
Wire Wire Line
	5850 2150 5700 2150
Wire Wire Line
	5850 2150 5850 2250
Wire Wire Line
	5700 2200 5700 2150
Connection ~ 5700 2150
Wire Wire Line
	5900 2450 5850 2450
Wire Wire Line
	5850 2450 5850 2550
Wire Wire Line
	5850 2550 5700 2550
Wire Wire Line
	5700 2550 5700 2500
Wire Wire Line
	5700 2550 5500 2550
Connection ~ 5700 2550
Text Label 4950 2550 2    50   ~ 0
CAN_L
Text Label 4950 2150 2    50   ~ 0
CAN_H
$Comp
L Connector:TestPoint TP6
U 1 1 5FAD794D
P 5700 2050
F 0 "TP6" V 5700 2250 50  0000 L CNN
F 1 "CAN_H" V 5600 2550 50  0001 L CNN
F 2 "TestPoint:TestPoint_Pad_D1.5mm" H 5900 2050 50  0001 C CNN
F 3 "~" H 5900 2050 50  0001 C CNN
	1    5700 2050
	1    0    0    -1  
$EndComp
$Comp
L Connector:TestPoint TP7
U 1 1 5FAD9228
P 5700 2650
F 0 "TP7" V 5700 2850 50  0000 L CNN
F 1 "CAN_L" V 5600 3150 50  0001 L CNN
F 2 "TestPoint:TestPoint_Pad_D1.5mm" H 5900 2650 50  0001 C CNN
F 3 "~" H 5900 2650 50  0001 C CNN
	1    5700 2650
	-1   0    0    1   
$EndComp
Wire Wire Line
	5700 2650 5700 2550
Wire Wire Line
	5700 2050 5700 2150
Text Label 7600 2250 0    50   ~ 0
CAN_R_PIN
Text Label 7600 2150 0    50   ~ 0
CAN_D_PIN
$Comp
L Connector:TestPoint TP9
U 1 1 5FB0BC0C
P 7500 2100
F 0 "TP9" V 7500 2300 50  0000 L CNN
F 1 "CAN D" V 7400 2600 50  0001 L CNN
F 2 "TestPoint:TestPoint_Pad_D1.5mm" H 7700 2100 50  0001 C CNN
F 3 "~" H 7700 2100 50  0001 C CNN
	1    7500 2100
	1    0    0    -1  
$EndComp
$Comp
L Connector:TestPoint TP10
U 1 1 5FB0C07C
P 7500 2300
F 0 "TP10" V 7500 2500 50  0000 L CNN
F 1 "CAN R" V 7400 2800 50  0001 L CNN
F 2 "TestPoint:TestPoint_Pad_D1.5mm" H 7700 2300 50  0001 C CNN
F 3 "~" H 7700 2300 50  0001 C CNN
	1    7500 2300
	-1   0    0    1   
$EndComp
Wire Wire Line
	7500 2100 7500 2150
Connection ~ 7500 2150
Wire Wire Line
	7500 2150 7600 2150
Wire Wire Line
	7500 2300 7500 2250
Connection ~ 7500 2250
Wire Wire Line
	7500 2250 7600 2250
$Comp
L Connector:TestPoint TP8
U 1 1 5FB307AC
P 6950 2450
F 0 "TP8" V 6950 2650 50  0000 L CNN
F 1 "Vref" V 6850 2950 50  0001 L CNN
F 2 "TestPoint:TestPoint_Pad_D1.5mm" H 7150 2450 50  0001 C CNN
F 3 "~" H 7150 2450 50  0001 C CNN
	1    6950 2450
	0    1    1    0   
$EndComp
Wire Wire Line
	6950 2450 6900 2450
Wire Wire Line
	6900 2150 7500 2150
Wire Wire Line
	6900 2250 7500 2250
$Comp
L Device:R R21
U 1 1 5FB545AE
P 7100 2550
F 0 "R21" V 7100 2550 50  0000 C CNN
F 1 "33k" V 7200 2550 50  0000 C CNN
F 2 "Resistor_SMD:R_0603_1608Metric_Pad0.98x0.95mm_HandSolder" V 7030 2550 50  0001 C CNN
F 3 "~" H 7100 2550 50  0001 C CNN
	1    7100 2550
	0    1    1    0   
$EndComp
Wire Wire Line
	6950 2550 6900 2550
$Comp
L power:GND #PWR032
U 1 1 5FB614C4
P 7300 2550
F 0 "#PWR032" H 7300 2300 50  0001 C CNN
F 1 "GND" V 7200 2500 50  0000 C CNN
F 2 "" H 7300 2550 50  0001 C CNN
F 3 "" H 7300 2550 50  0001 C CNN
	1    7300 2550
	0    -1   -1   0   
$EndComp
Wire Wire Line
	7300 2550 7250 2550
Text Label 10000 3600 0    50   ~ 0
CAN_ACTIVE_PIN
$Comp
L Power_Protection:SZNUP2105L D5
U 1 1 5F88CF70
P 5250 2350
F 0 "D5" V 4908 2350 50  0000 C CNN
F 1 "PESD1" V 4999 2350 50  0000 C CNN
F 2 "Package_TO_SOT_SMD:SOT-23" H 5475 2300 50  0001 L CNN
F 3 "http://www.onsemi.com/pub_link/Collateral/NUP2105L-D.PDF" H 5375 2475 50  0001 C CNN
	1    5250 2350
	0    1    1    0   
$EndComp
Wire Wire Line
	4950 2150 5500 2150
Wire Wire Line
	5450 2250 5500 2250
Wire Wire Line
	5500 2250 5500 2150
Connection ~ 5500 2150
Wire Wire Line
	5500 2150 5700 2150
Wire Wire Line
	5450 2450 5500 2450
Wire Wire Line
	5500 2450 5500 2550
Connection ~ 5500 2550
Wire Wire Line
	4950 2550 5500 2550
$Comp
L power:GND #PWR021
U 1 1 5F8C0555
P 5000 2350
F 0 "#PWR021" H 5000 2100 50  0001 C CNN
F 1 "GND" V 5000 2150 50  0000 C CNN
F 2 "" H 5000 2350 50  0001 C CNN
F 3 "" H 5000 2350 50  0001 C CNN
	1    5000 2350
	0    1    1    0   
$EndComp
Wire Wire Line
	5000 2350 5050 2350
Text Label 10000 2900 0    50   ~ 0
I2C_SDA_PIN
Text Label 10000 3000 0    50   ~ 0
I2C_SCL_PIN
$Comp
L Connector:TestPoint TP14
U 1 1 5F90C340
P 10400 2900
F 0 "TP14" V 10400 3100 50  0000 L CNN
F 1 "SDA" V 10300 3400 50  0001 L CNN
F 2 "TestPoint:TestPoint_Pad_D1.5mm" H 10600 2900 50  0001 C CNN
F 3 "~" H 10600 2900 50  0001 C CNN
	1    10400 2900
	0    1    1    0   
$EndComp
$Comp
L Connector:TestPoint TP15
U 1 1 5F90D17F
P 10400 3000
F 0 "TP15" V 10400 3200 50  0000 L CNN
F 1 "SCL" V 10300 3500 50  0001 L CNN
F 2 "TestPoint:TestPoint_Pad_D1.5mm" H 10600 3000 50  0001 C CNN
F 3 "~" H 10600 3000 50  0001 C CNN
	1    10400 3000
	0    1    1    0   
$EndComp
Wire Wire Line
	9850 2900 10400 2900
Wire Wire Line
	9850 3000 10400 3000
$Comp
L Connector_Generic:Conn_01x05 J1
U 1 1 5F92F205
P 650 4350
F 0 "J1" H 650 4050 50  0000 C CNN
F 1 "Ext. sensors" V 750 4350 50  0000 C CNN
F 2 "Connector_PinHeader_2.54mm:PinHeader_1x05_P2.54mm_Vertical" H 650 4350 50  0001 C CNN
F 3 "~" H 650 4350 50  0001 C CNN
	1    650  4350
	-1   0    0    1   
$EndComp
$Comp
L power:GND #PWR02
U 1 1 5F92FD51
P 900 4600
F 0 "#PWR02" H 900 4350 50  0001 C CNN
F 1 "GND" H 905 4427 50  0000 C CNN
F 2 "" H 900 4600 50  0001 C CNN
F 3 "" H 900 4600 50  0001 C CNN
	1    900  4600
	1    0    0    -1  
$EndComp
Wire Wire Line
	850  4550 900  4550
Wire Wire Line
	900  4550 900  4600
Wire Wire Line
	850  4450 950  4450
Wire Wire Line
	850  4350 950  4350
Text Label 950  4450 0    50   ~ 0
I2C_SDA_PIN
Text Label 950  4350 0    50   ~ 0
I2C_SCL_PIN
$Comp
L power:+3V3 #PWR06
U 1 1 5F9789D9
P 1050 4050
F 0 "#PWR06" H 1050 3900 50  0001 C CNN
F 1 "+3V3" H 1050 4200 50  0000 C CNN
F 2 "" H 1050 4050 50  0001 C CNN
F 3 "" H 1050 4050 50  0001 C CNN
	1    1050 4050
	1    0    0    -1  
$EndComp
$Comp
L power:+5V #PWR01
U 1 1 5F98CA24
P 900 3900
F 0 "#PWR01" H 900 3750 50  0001 C CNN
F 1 "+5V" H 900 4050 50  0000 C CNN
F 2 "" H 900 3900 50  0001 C CNN
F 3 "" H 900 3900 50  0001 C CNN
	1    900  3900
	1    0    0    -1  
$EndComp
Wire Wire Line
	900  3900 900  4150
Wire Wire Line
	900  4150 850  4150
Wire Wire Line
	1050 4050 1050 4250
Wire Wire Line
	1050 4250 850  4250
$Comp
L LED:APFA3010 D4
U 1 1 5FA6289E
P 5000 3700
F 0 "D4" V 5250 4100 50  0000 R CNN
F 1 "APFA3010" V 5150 4100 50  0000 R CNN
F 2 "LED_THT:LED_D5.0mm-4_RGB_Wide_Pins" H 5000 4200 50  0001 C CNN
F 3 "http://www.kingbrightusa.com/images/catalog/SPEC/APFA3010LSEEZGKQBKC.pdf" H 5000 3250 50  0001 C CNN
	1    5000 3700
	0    -1   -1   0   
$EndComp
$Comp
L Device:R R12
U 1 1 5FA8B49C
P 4800 4100
F 0 "R12" V 4800 4100 50  0000 C CNN
F 1 "75R" V 4900 4100 50  0000 C CNN
F 2 "Resistor_SMD:R_0603_1608Metric_Pad0.98x0.95mm_HandSolder" V 4730 4100 50  0001 C CNN
F 3 "~" H 4800 4100 50  0001 C CNN
	1    4800 4100
	-1   0    0    1   
$EndComp
$Comp
L Device:R R13
U 1 1 5FA8C05C
P 5000 4100
F 0 "R13" V 5000 4100 50  0000 C CNN
F 1 "10R" V 5100 4100 50  0000 C CNN
F 2 "Resistor_SMD:R_0603_1608Metric_Pad0.98x0.95mm_HandSolder" V 4930 4100 50  0001 C CNN
F 3 "~" H 5000 4100 50  0001 C CNN
	1    5000 4100
	-1   0    0    1   
$EndComp
$Comp
L Device:R R14
U 1 1 5FA8C229
P 5200 4100
F 0 "R14" V 5200 4100 50  0000 C CNN
F 1 "22R" V 5300 4100 50  0000 C CNN
F 2 "Resistor_SMD:R_0603_1608Metric_Pad0.98x0.95mm_HandSolder" V 5130 4100 50  0001 C CNN
F 3 "~" H 5200 4100 50  0001 C CNN
	1    5200 4100
	-1   0    0    1   
$EndComp
$Comp
L power:+3V3 #PWR022
U 1 1 5FA8E1E5
P 5000 3450
F 0 "#PWR022" H 5000 3300 50  0001 C CNN
F 1 "+3V3" H 5000 3600 50  0000 C CNN
F 2 "" H 5000 3450 50  0001 C CNN
F 3 "" H 5000 3450 50  0001 C CNN
	1    5000 3450
	1    0    0    -1  
$EndComp
Wire Wire Line
	5000 3450 5000 3500
Wire Wire Line
	5200 3900 5200 3950
Wire Wire Line
	5000 3900 5000 3950
Wire Wire Line
	4800 3900 4800 3950
Wire Wire Line
	4800 4250 4800 4300
Wire Wire Line
	5000 4250 5000 4300
Wire Wire Line
	5200 4250 5200 4300
Text Label 4800 4300 3    50   ~ 0
LED_R_PIN
Text Label 5000 4300 3    50   ~ 0
LED_G_PIN
Text Label 5200 4300 3    50   ~ 0
LED_B_PIN
$Comp
L Device:LED D3
U 1 1 5FC5E6A8
P 3550 4200
F 0 "D3" V 3589 4082 50  0000 R CNN
F 1 "RED" V 3498 4082 50  0000 R CNN
F 2 "LED_THT:LED_D5.0mm" H 3550 4200 50  0001 C CNN
F 3 "~" H 3550 4200 50  0001 C CNN
	1    3550 4200
	0    -1   -1   0   
$EndComp
$Comp
L power:GND #PWR014
U 1 1 5FC5F781
P 3550 4400
F 0 "#PWR014" H 3550 4150 50  0001 C CNN
F 1 "GND" H 3555 4227 50  0000 C CNN
F 2 "" H 3550 4400 50  0001 C CNN
F 3 "" H 3550 4400 50  0001 C CNN
	1    3550 4400
	1    0    0    -1  
$EndComp
Wire Wire Line
	3550 4350 3550 4400
$Comp
L Device:R R9
U 1 1 5FC6F34D
P 3550 3850
F 0 "R9" V 3550 3850 50  0000 C CNN
F 1 "3k3" V 3650 3850 50  0000 C CNN
F 2 "Resistor_SMD:R_0603_1608Metric_Pad0.98x0.95mm_HandSolder" V 3480 3850 50  0001 C CNN
F 3 "~" H 3550 3850 50  0001 C CNN
	1    3550 3850
	-1   0    0    1   
$EndComp
Wire Wire Line
	3550 4000 3550 4050
Wire Wire Line
	3550 3700 3550 3650
Text Label 10000 1800 0    50   ~ 0
LED_R_PIN
Text Label 10000 2500 0    50   ~ 0
LED_G_PIN
Text Label 10000 2600 0    50   ~ 0
LED_B_PIN
Wire Wire Line
	3300 900  2900 900 
$Comp
L power:PWR_FLAG #FLG03
U 1 1 5FCFA7B4
P 2650 2400
F 0 "#FLG03" H 2650 2475 50  0001 C CNN
F 1 "PWR_FLAG" H 2650 2573 50  0000 C CNN
F 2 "" H 2650 2400 50  0001 C CNN
F 3 "~" H 2650 2400 50  0001 C CNN
	1    2650 2400
	1    0    0    -1  
$EndComp
Text Label 10000 1700 0    50   ~ 0
CAN_TRNSCVR_PWR_PIN
$Comp
L power:PWR_FLAG #FLG01
U 1 1 5FD215E4
P 1400 850
F 0 "#FLG01" H 1400 925 50  0001 C CNN
F 1 "PWR_FLAG" H 1400 1023 50  0000 C CNN
F 2 "" H 1400 850 50  0001 C CNN
F 3 "~" H 1400 850 50  0001 C CNN
	1    1400 850 
	1    0    0    -1  
$EndComp
Wire Wire Line
	1400 850  1400 900 
Wire Wire Line
	1400 900  1700 900 
Connection ~ 1700 900 
Wire Wire Line
	1700 900  1700 1050
$Comp
L Connector:TestPoint TP11
U 1 1 5FD4CADC
P 8600 1500
F 0 "TP11" V 8600 1700 50  0000 L CNN
F 1 "VP" V 8500 2000 50  0001 L CNN
F 2 "TestPoint:TestPoint_Pad_D1.5mm" H 8800 1500 50  0001 C CNN
F 3 "~" H 8800 1500 50  0001 C CNN
	1    8600 1500
	0    -1   -1   0   
$EndComp
$Comp
L Connector:TestPoint TP12
U 1 1 5FD4D04E
P 8600 1600
F 0 "TP12" V 8600 1800 50  0000 L CNN
F 1 "VN" V 8500 2100 50  0001 L CNN
F 2 "TestPoint:TestPoint_Pad_D1.5mm" H 8800 1600 50  0001 C CNN
F 3 "~" H 8800 1600 50  0001 C CNN
	1    8600 1600
	0    -1   -1   0   
$EndComp
Wire Wire Line
	8600 1600 8650 1600
Wire Wire Line
	8600 1500 8650 1500
Wire Wire Line
	7700 1400 7800 1400
Wire Wire Line
	7400 1400 7350 1400
$Comp
L Device:R R22
U 1 1 5F8FB056
P 7550 1400
F 0 "R22" V 7550 1400 50  0000 C CNN
F 1 "330k" V 7650 1400 50  0000 C CNN
F 2 "Resistor_SMD:R_0603_1608Metric_Pad0.98x0.95mm_HandSolder" V 7480 1400 50  0001 C CNN
F 3 "~" H 7550 1400 50  0001 C CNN
	1    7550 1400
	0    -1   -1   0   
$EndComp
Wire Wire Line
	7050 1150 7050 1200
Wire Wire Line
	6800 1150 7050 1150
Connection ~ 6800 1150
Wire Wire Line
	6800 1250 6800 1150
Wire Wire Line
	6800 1600 6800 1550
$Comp
L power:GND #PWR026
U 1 1 5F8E08F8
P 6800 1600
F 0 "#PWR026" H 6800 1350 50  0001 C CNN
F 1 "GND" H 6650 1550 50  0000 C CNN
F 2 "" H 6800 1600 50  0001 C CNN
F 3 "" H 6800 1600 50  0001 C CNN
	1    6800 1600
	1    0    0    -1  
$EndComp
$Comp
L Device:C C9
U 1 1 5F8E0524
P 6800 1400
F 0 "C9" H 6550 1400 50  0000 L CNN
F 1 "100nF" H 6550 1300 50  0000 L CNN
F 2 "Capacitor_SMD:C_0603_1608Metric_Pad1.08x0.95mm_HandSolder" H 6838 1250 50  0001 C CNN
F 3 "~" H 6800 1400 50  0001 C CNN
	1    6800 1400
	1    0    0    -1  
$EndComp
$Comp
L power:GND #PWR030
U 1 1 5F8981BD
P 7050 1600
F 0 "#PWR030" H 7050 1350 50  0001 C CNN
F 1 "GND" H 7200 1550 50  0000 C CNN
F 2 "" H 7050 1600 50  0001 C CNN
F 3 "" H 7050 1600 50  0001 C CNN
	1    7050 1600
	1    0    0    -1  
$EndComp
$Comp
L Transistor_BJT:BC817 Q7
U 1 1 5F87866D
P 7150 1400
F 0 "Q7" H 6950 1600 50  0000 L CNN
F 1 "BC817" H 6850 1500 50  0000 L CNN
F 2 "Package_TO_SOT_SMD:SC-59_Handsoldering" H 7150 1400 50  0001 L CNN
F 3 "" H 7150 1400 50  0001 L CNN
	1    7150 1400
	-1   0    0    -1  
$EndComp
Wire Wire Line
	6800 1150 6700 1150
Wire Wire Line
	6800 900  6800 1150
Wire Wire Line
	6750 900  6800 900 
Wire Wire Line
	6400 900  6400 950 
Wire Wire Line
	6450 900  6400 900 
$Comp
L Device:R R19
U 1 1 5F84E1CF
P 6600 900
F 0 "R19" V 6600 900 50  0000 C CNN
F 1 "330k" V 6700 900 50  0000 C CNN
F 2 "Resistor_SMD:R_0603_1608Metric_Pad0.98x0.95mm_HandSolder" V 6530 900 50  0001 C CNN
F 3 "~" H 6600 900 50  0001 C CNN
	1    6600 900 
	0    -1   -1   0   
$EndComp
$Comp
L Transistor_FET:AO3401A Q5
U 1 1 5F843481
P 6500 1150
F 0 "Q5" H 6705 1104 50  0000 L CNN
F 1 "AO3407" H 6705 1195 50  0000 L CNN
F 2 "Package_TO_SOT_SMD:SOT-23" H 6700 1075 50  0001 L CIN
F 3 "http://www.aosmd.com/pdfs/datasheet/AO3407.pdf" H 6500 1150 50  0001 L CNN
	1    6500 1150
	-1   0    0    1   
$EndComp
$Comp
L power:GND #PWR019
U 1 1 5D75B329
P 4250 1350
F 0 "#PWR019" H 4250 1100 50  0001 C CNN
F 1 "GND" H 4255 1177 50  0000 C CNN
F 2 "" H 4250 1350 50  0001 C CNN
F 3 "" H 4250 1350 50  0001 C CNN
	1    4250 1350
	1    0    0    -1  
$EndComp
$Comp
L Transistor_FET:AO3401A Q2
U 1 1 5FED185C
P 3000 1700
F 0 "Q2" H 2850 1750 50  0000 L CNN
F 1 "AO3407" H 2800 1850 50  0000 L CNN
F 2 "Package_TO_SOT_SMD:SOT-23" H 3200 1625 50  0001 L CIN
F 3 "http://www.aosmd.com/pdfs/datasheet/AO3407.pdf" H 3000 1700 50  0001 L CNN
	1    3000 1700
	-1   0    0    1   
$EndComp
$Comp
L Device:R R8
U 1 1 5FED3FC8
P 3100 1450
F 0 "R8" V 3100 1450 50  0000 C CNN
F 1 "330k" V 3200 1450 50  0000 C CNN
F 2 "Resistor_SMD:R_0603_1608Metric_Pad0.98x0.95mm_HandSolder" V 3030 1450 50  0001 C CNN
F 3 "~" H 3100 1450 50  0001 C CNN
	1    3100 1450
	0    1    -1   0   
$EndComp
Wire Wire Line
	2900 900  2900 1450
Connection ~ 2900 900 
Wire Wire Line
	2950 1450 2900 1450
Connection ~ 2900 1450
Wire Wire Line
	2900 1450 2900 1500
$Comp
L Device:C C2
U 1 1 5FEF8569
P 3300 1900
F 0 "C2" H 3050 1900 50  0000 L CNN
F 1 "100nF" H 3050 1800 50  0000 L CNN
F 2 "Capacitor_SMD:C_0603_1608Metric_Pad1.08x0.95mm_HandSolder" H 3338 1750 50  0001 C CNN
F 3 "~" H 3300 1900 50  0001 C CNN
	1    3300 1900
	-1   0    0    -1  
$EndComp
$Comp
L power:GND #PWR013
U 1 1 5FEFA5C2
P 3300 2100
F 0 "#PWR013" H 3300 1850 50  0001 C CNN
F 1 "GND" H 3150 2050 50  0000 C CNN
F 2 "" H 3300 2100 50  0001 C CNN
F 3 "" H 3300 2100 50  0001 C CNN
	1    3300 2100
	-1   0    0    -1  
$EndComp
Wire Wire Line
	3300 2050 3300 2100
Wire Wire Line
	3200 1700 3300 1700
Wire Wire Line
	3300 1700 3300 1750
Wire Wire Line
	3300 1700 3500 1700
Connection ~ 3300 1700
Text Label 3500 1700 0    50   ~ 0
PWR_5V_EN_PIN
Wire Wire Line
	3250 1450 3300 1450
Wire Wire Line
	3300 1450 3300 1700
Wire Wire Line
	2900 1900 2900 1950
Wire Wire Line
	2900 2550 2650 2550
Wire Wire Line
	2650 2550 2650 2400
Text Label 10000 3300 0    50   ~ 0
PWR_5V_EN_PIN
Wire Wire Line
	6400 1350 6400 1400
$Comp
L power:+5V #PWR023
U 1 1 6009F83E
P 6400 750
F 0 "#PWR023" H 6400 600 50  0001 C CNN
F 1 "+5V" H 6415 923 50  0000 C CNN
F 2 "" H 6400 750 50  0001 C CNN
F 3 "" H 6400 750 50  0001 C CNN
	1    6400 750 
	1    0    0    -1  
$EndComp
Wire Wire Line
	6400 750  6400 900 
Connection ~ 6400 900 
Wire Notes Line
	5450 500  5450 1900
Wire Notes Line
	4550 1900 4550 3200
Wire Notes Line
	4550 1900 5450 1900
Wire Notes Line
	8150 5000 8150 500 
Wire Notes Line
	500  3200 5550 3200
Wire Wire Line
	1700 1500 1700 1450
Wire Wire Line
	1500 1450 1700 1450
$Comp
L power:PWR_FLAG #FLG02
U 1 1 603BE946
P 1900 1500
F 0 "#FLG02" H 1900 1575 50  0001 C CNN
F 1 "PWR_FLAG" V 1900 1800 50  0000 C CNN
F 2 "" H 1900 1500 50  0001 C CNN
F 3 "~" H 1900 1500 50  0001 C CNN
	1    1900 1500
	-1   0    0    1   
$EndComp
Wire Wire Line
	1900 1500 1900 1450
Wire Wire Line
	1900 1450 1700 1450
Connection ~ 1700 1450
$Comp
L power:PWR_FLAG #FLG05
U 1 1 603D0D15
P 6150 1650
F 0 "#FLG05" H 6150 1725 50  0001 C CNN
F 1 "PWR_FLAG" H 6150 1823 50  0000 C CNN
F 2 "" H 6150 1650 50  0001 C CNN
F 3 "~" H 6150 1650 50  0001 C CNN
	1    6150 1650
	1    0    0    -1  
$EndComp
Wire Wire Line
	6150 1650 6150 1900
Wire Wire Line
	6150 1900 6400 1900
Text Label 7800 1400 1    50   ~ 0
CAN_TRNSCVR_PWR_PIN
$Comp
L Device:R R23
U 1 1 60417BDC
P 8450 5500
F 0 "R23" V 8450 5500 50  0000 C CNN
F 1 "47k" V 8550 5500 50  0000 C CNN
F 2 "Resistor_SMD:R_0603_1608Metric_Pad0.98x0.95mm_HandSolder" V 8380 5500 50  0001 C CNN
F 3 "~" H 8450 5500 50  0001 C CNN
	1    8450 5500
	-1   0    0    1   
$EndComp
Connection ~ 8450 5650
$Comp
L power:+3V3 #PWR033
U 1 1 604190A5
P 8450 5300
F 0 "#PWR033" H 8450 5150 50  0001 C CNN
F 1 "+3V3" H 8450 5450 50  0000 C CNN
F 2 "" H 8450 5300 50  0001 C CNN
F 3 "" H 8450 5300 50  0001 C CNN
	1    8450 5300
	1    0    0    -1  
$EndComp
Wire Wire Line
	8450 5300 8450 5350
Text Notes 10300 1900 0    50   ~ 0
(LED_POWER_ON_PIN)
Text Label 3550 3650 1    50   ~ 0
JTAG_TDI
Text Notes 3700 4050 1    50   ~ 0
(LED_POWER_ON_PIN)
Text Notes 3700 4550 0    50   ~ 0
Works only when\nNOT using debug\nmode
$Comp
L Device:R_POT RV1
U 1 1 5F83FD9D
P 9800 5650
F 0 "RV1" H 9731 5696 50  0000 R CNN
F 1 "250k" H 9731 5605 50  0000 R CNN
F 2 "Potentiometer_THT:Potentiometer_Alps_RK163_Single_Horizontal" H 9800 5650 50  0001 C CNN
F 3 "~" H 9800 5650 50  0001 C CNN
	1    9800 5650
	1    0    0    1   
$EndComp
Text Label 10000 3200 0    50   ~ 0
TOLERANCE_THRESHOLD_PIN
$Comp
L power:+3V3 #PWR039
U 1 1 5F939EEB
P 9800 5300
F 0 "#PWR039" H 9800 5150 50  0001 C CNN
F 1 "+3V3" H 9800 5450 50  0000 C CNN
F 2 "" H 9800 5300 50  0001 C CNN
F 3 "" H 9800 5300 50  0001 C CNN
	1    9800 5300
	1    0    0    -1  
$EndComp
Wire Wire Line
	9800 5300 9800 5500
Wire Wire Line
	9950 5650 10000 5650
Wire Wire Line
	10000 5650 10000 5850
Wire Wire Line
	10000 5850 9800 5850
Wire Wire Line
	9800 5850 9800 5800
Wire Wire Line
	10000 5850 10050 5850
Connection ~ 10000 5850
Text Label 10050 5850 0    50   ~ 0
TOLERANCE_THRESHOLD_PIN
$Comp
L Device:C C14
U 1 1 5F971D30
P 10000 6050
F 0 "C14" H 10150 6050 50  0000 C CNN
F 1 "100nF" H 10200 5950 50  0000 C CNN
F 2 "Capacitor_SMD:C_0603_1608Metric_Pad1.08x0.95mm_HandSolder" H 10038 5900 50  0001 C CNN
F 3 "~" H 10000 6050 50  0001 C CNN
	1    10000 6050
	-1   0    0    1   
$EndComp
Wire Wire Line
	10000 5850 10000 5900
$Comp
L power:GND #PWR040
U 1 1 5F983953
P 10000 6250
F 0 "#PWR040" H 10000 6000 50  0001 C CNN
F 1 "GND" H 10050 6100 50  0000 R CNN
F 2 "" H 10000 6250 50  0001 C CNN
F 3 "" H 10000 6250 50  0001 C CNN
	1    10000 6250
	1    0    0    -1  
$EndComp
Wire Wire Line
	10000 6200 10000 6250
Wire Notes Line
	5550 3200 5550 5000
$Comp
L Connector:TestPoint TP13
U 1 1 5FA3C06C
P 10000 1500
F 0 "TP13" V 10000 1700 50  0000 L CNN
F 1 "IO2" V 9900 2000 50  0001 L CNN
F 2 "TestPoint:TestPoint_Pad_D1.5mm" H 10200 1500 50  0001 C CNN
F 3 "~" H 10200 1500 50  0001 C CNN
	1    10000 1500
	0    1    1    0   
$EndComp
Wire Notes Line
	1500 6050 2150 6050
Wire Notes Line
	2150 6050 2150 7800
Wire Notes Line
	1500 3200 1500 6050
Wire Notes Line
	1500 5000 11200 5000
Wire Notes Line
	5100 7800 5100 5000
Wire Notes Line
	6950 6550 5100 6550
$Comp
L Connector:Screw_Terminal_01x05 J5
U 1 1 5F882D83
P 1300 1250
F 0 "J5" H 1300 1550 50  0000 C CNN
F 1 "Screw_Terminal_01x05" V 1400 1250 50  0000 C CNN
F 2 "TerminalBlock_Phoenix:TerminalBlock_Phoenix_PT-1,5-5-5.0-H_1x05_P5.00mm_Horizontal" H 1300 1250 50  0001 C CNN
F 3 "~" H 1300 1250 50  0001 C CNN
	1    1300 1250
	-1   0    0    1   
$EndComp
$Comp
L Device:R R24
U 1 1 5FA00225
P 5800 1150
F 0 "R24" V 5800 1150 50  0000 C CNN
F 1 "N.A." V 5900 1150 50  0000 C CNN
F 2 "Resistor_SMD:R_0603_1608Metric_Pad0.98x0.95mm_HandSolder" V 5730 1150 50  0001 C CNN
F 3 "~" H 5800 1150 50  0001 C CNN
	1    5800 1150
	1    0    0    -1  
$EndComp
Text Notes 5700 1450 1    50   ~ 0
Allow override\ncontrol MOS-FET
Wire Wire Line
	6400 900  5800 900 
Wire Wire Line
	5800 900  5800 1000
Wire Wire Line
	5800 1400 6400 1400
Wire Wire Line
	5800 1300 5800 1400
Connection ~ 6400 1400
Wire Wire Line
	6400 1400 6400 1900
$Comp
L Device:R R25
U 1 1 5F8DCFA4
P 2600 1700
F 0 "R25" V 2600 1700 50  0000 C CNN
F 1 "N.A." V 2700 1700 50  0000 C CNN
F 2 "Resistor_SMD:R_0603_1608Metric_Pad0.98x0.95mm_HandSolder" V 2530 1700 50  0001 C CNN
F 3 "~" H 2600 1700 50  0001 C CNN
	1    2600 1700
	1    0    0    -1  
$EndComp
Wire Wire Line
	2600 1550 2600 1450
Wire Wire Line
	2600 1450 2900 1450
Wire Wire Line
	2600 1850 2600 1950
Wire Wire Line
	2600 1950 2900 1950
Connection ~ 2900 1950
Wire Wire Line
	2900 1950 2900 2550
Text Notes 2550 2100 1    50   ~ 0
Allow override\ncontrol MOS-FET
Text Notes 8050 7000 0    236  ~ 47
DEPRECATED
Text Notes 3750 1850 0    50   ~ 0
MISSING NPN\nBUFFER
Text Notes 10400 1500 0    50   ~ 0
PWR LED\nMOVED HERE
$EndSCHEMATC
