%TF.GenerationSoftware,KiCad,Pcbnew,5.1.8-db9833491~87~ubuntu20.04.1*%
%TF.CreationDate,2021-05-10T16:32:24+00:00*%
%TF.ProjectId,OCTA-HACK-01,4f435441-2d48-4414-934b-2d30312e6b69,rev?*%
%TF.SameCoordinates,Original*%
%TF.FileFunction,Paste,Top*%
%TF.FilePolarity,Positive*%
%FSLAX46Y46*%
G04 Gerber Fmt 4.6, Leading zero omitted, Abs format (unit mm)*
G04 Created by KiCad (PCBNEW 5.1.8-db9833491~87~ubuntu20.04.1) date 2021-05-10 16:32:24*
%MOMM*%
%LPD*%
G01*
G04 APERTURE LIST*
%ADD10R,0.800000X1.800000*%
%ADD11R,0.900000X2.000000*%
%ADD12R,2.000000X0.900000*%
%ADD13R,5.000000X5.000000*%
%ADD14R,1.800000X0.800000*%
%ADD15R,0.800000X0.900000*%
G04 APERTURE END LIST*
%TO.C,C3*%
G36*
G01*
X67453500Y-111715000D02*
X67928500Y-111715000D01*
G75*
G02*
X68166000Y-111952500I0J-237500D01*
G01*
X68166000Y-112527500D01*
G75*
G02*
X67928500Y-112765000I-237500J0D01*
G01*
X67453500Y-112765000D01*
G75*
G02*
X67216000Y-112527500I0J237500D01*
G01*
X67216000Y-111952500D01*
G75*
G02*
X67453500Y-111715000I237500J0D01*
G01*
G37*
G36*
G01*
X67453500Y-109965000D02*
X67928500Y-109965000D01*
G75*
G02*
X68166000Y-110202500I0J-237500D01*
G01*
X68166000Y-110777500D01*
G75*
G02*
X67928500Y-111015000I-237500J0D01*
G01*
X67453500Y-111015000D01*
G75*
G02*
X67216000Y-110777500I0J237500D01*
G01*
X67216000Y-110202500D01*
G75*
G02*
X67453500Y-109965000I237500J0D01*
G01*
G37*
%TD*%
%TO.C,R26*%
G36*
G01*
X61992500Y-71648500D02*
X62467500Y-71648500D01*
G75*
G02*
X62705000Y-71886000I0J-237500D01*
G01*
X62705000Y-72386000D01*
G75*
G02*
X62467500Y-72623500I-237500J0D01*
G01*
X61992500Y-72623500D01*
G75*
G02*
X61755000Y-72386000I0J237500D01*
G01*
X61755000Y-71886000D01*
G75*
G02*
X61992500Y-71648500I237500J0D01*
G01*
G37*
G36*
G01*
X61992500Y-69823500D02*
X62467500Y-69823500D01*
G75*
G02*
X62705000Y-70061000I0J-237500D01*
G01*
X62705000Y-70561000D01*
G75*
G02*
X62467500Y-70798500I-237500J0D01*
G01*
X61992500Y-70798500D01*
G75*
G02*
X61755000Y-70561000I0J237500D01*
G01*
X61755000Y-70061000D01*
G75*
G02*
X61992500Y-69823500I237500J0D01*
G01*
G37*
%TD*%
D10*
%TO.C,Q8*%
X59624000Y-73532000D03*
X58674000Y-70232000D03*
X60574000Y-70232000D03*
%TD*%
%TO.C,R24*%
G36*
G01*
X80280500Y-77791500D02*
X80755500Y-77791500D01*
G75*
G02*
X80993000Y-78029000I0J-237500D01*
G01*
X80993000Y-78529000D01*
G75*
G02*
X80755500Y-78766500I-237500J0D01*
G01*
X80280500Y-78766500D01*
G75*
G02*
X80043000Y-78529000I0J237500D01*
G01*
X80043000Y-78029000D01*
G75*
G02*
X80280500Y-77791500I237500J0D01*
G01*
G37*
G36*
G01*
X80280500Y-75966500D02*
X80755500Y-75966500D01*
G75*
G02*
X80993000Y-76204000I0J-237500D01*
G01*
X80993000Y-76704000D01*
G75*
G02*
X80755500Y-76941500I-237500J0D01*
G01*
X80280500Y-76941500D01*
G75*
G02*
X80043000Y-76704000I0J237500D01*
G01*
X80043000Y-76204000D01*
G75*
G02*
X80280500Y-75966500I237500J0D01*
G01*
G37*
%TD*%
D11*
%TO.C,U4*%
X63874000Y-86385000D03*
X65144000Y-86385000D03*
X66414000Y-86385000D03*
X67684000Y-86385000D03*
X68954000Y-86385000D03*
X70224000Y-86385000D03*
X71494000Y-86385000D03*
X72764000Y-86385000D03*
X74034000Y-86385000D03*
X75304000Y-86385000D03*
X76574000Y-86385000D03*
X77844000Y-86385000D03*
X79114000Y-86385000D03*
X80384000Y-86385000D03*
D12*
X81384000Y-89170000D03*
X81384000Y-90440000D03*
X81384000Y-91710000D03*
X81384000Y-92980000D03*
X81384000Y-94250000D03*
X81384000Y-95520000D03*
X81384000Y-96790000D03*
X81384000Y-98060000D03*
X81384000Y-99330000D03*
X81384000Y-100600000D03*
D11*
X80384000Y-103385000D03*
X79114000Y-103385000D03*
X77844000Y-103385000D03*
X76574000Y-103385000D03*
X75304000Y-103385000D03*
X74034000Y-103385000D03*
X72764000Y-103385000D03*
X71494000Y-103385000D03*
X70224000Y-103385000D03*
X68954000Y-103385000D03*
X67684000Y-103385000D03*
X66414000Y-103385000D03*
X65144000Y-103385000D03*
X63874000Y-103385000D03*
D13*
X71374000Y-95885000D03*
%TD*%
%TO.C,R22*%
G36*
G01*
X94330000Y-75421500D02*
X94330000Y-74946500D01*
G75*
G02*
X94567500Y-74709000I237500J0D01*
G01*
X95142500Y-74709000D01*
G75*
G02*
X95380000Y-74946500I0J-237500D01*
G01*
X95380000Y-75421500D01*
G75*
G02*
X95142500Y-75659000I-237500J0D01*
G01*
X94567500Y-75659000D01*
G75*
G02*
X94330000Y-75421500I0J237500D01*
G01*
G37*
G36*
G01*
X92580000Y-75421500D02*
X92580000Y-74946500D01*
G75*
G02*
X92817500Y-74709000I237500J0D01*
G01*
X93392500Y-74709000D01*
G75*
G02*
X93630000Y-74946500I0J-237500D01*
G01*
X93630000Y-75421500D01*
G75*
G02*
X93392500Y-75659000I-237500J0D01*
G01*
X92817500Y-75659000D01*
G75*
G02*
X92580000Y-75421500I0J237500D01*
G01*
G37*
%TD*%
%TO.C,R19*%
G36*
G01*
X83535000Y-75040500D02*
X83535000Y-74565500D01*
G75*
G02*
X83772500Y-74328000I237500J0D01*
G01*
X84347500Y-74328000D01*
G75*
G02*
X84585000Y-74565500I0J-237500D01*
G01*
X84585000Y-75040500D01*
G75*
G02*
X84347500Y-75278000I-237500J0D01*
G01*
X83772500Y-75278000D01*
G75*
G02*
X83535000Y-75040500I0J237500D01*
G01*
G37*
G36*
G01*
X81785000Y-75040500D02*
X81785000Y-74565500D01*
G75*
G02*
X82022500Y-74328000I237500J0D01*
G01*
X82597500Y-74328000D01*
G75*
G02*
X82835000Y-74565500I0J-237500D01*
G01*
X82835000Y-75040500D01*
G75*
G02*
X82597500Y-75278000I-237500J0D01*
G01*
X82022500Y-75278000D01*
G75*
G02*
X81785000Y-75040500I0J237500D01*
G01*
G37*
%TD*%
%TO.C,R11*%
G36*
G01*
X69297000Y-114791500D02*
X69297000Y-114316500D01*
G75*
G02*
X69534500Y-114079000I237500J0D01*
G01*
X70109500Y-114079000D01*
G75*
G02*
X70347000Y-114316500I0J-237500D01*
G01*
X70347000Y-114791500D01*
G75*
G02*
X70109500Y-115029000I-237500J0D01*
G01*
X69534500Y-115029000D01*
G75*
G02*
X69297000Y-114791500I0J237500D01*
G01*
G37*
G36*
G01*
X67547000Y-114791500D02*
X67547000Y-114316500D01*
G75*
G02*
X67784500Y-114079000I237500J0D01*
G01*
X68359500Y-114079000D01*
G75*
G02*
X68597000Y-114316500I0J-237500D01*
G01*
X68597000Y-114791500D01*
G75*
G02*
X68359500Y-115029000I-237500J0D01*
G01*
X67784500Y-115029000D01*
G75*
G02*
X67547000Y-114791500I0J237500D01*
G01*
G37*
%TD*%
%TO.C,R10*%
G36*
G01*
X68597000Y-115840500D02*
X68597000Y-116315500D01*
G75*
G02*
X68359500Y-116553000I-237500J0D01*
G01*
X67784500Y-116553000D01*
G75*
G02*
X67547000Y-116315500I0J237500D01*
G01*
X67547000Y-115840500D01*
G75*
G02*
X67784500Y-115603000I237500J0D01*
G01*
X68359500Y-115603000D01*
G75*
G02*
X68597000Y-115840500I0J-237500D01*
G01*
G37*
G36*
G01*
X70347000Y-115840500D02*
X70347000Y-116315500D01*
G75*
G02*
X70109500Y-116553000I-237500J0D01*
G01*
X69534500Y-116553000D01*
G75*
G02*
X69297000Y-116315500I0J237500D01*
G01*
X69297000Y-115840500D01*
G75*
G02*
X69534500Y-115603000I237500J0D01*
G01*
X70109500Y-115603000D01*
G75*
G02*
X70347000Y-115840500I0J-237500D01*
G01*
G37*
%TD*%
%TO.C,R9*%
G36*
G01*
X91169500Y-119792000D02*
X90694500Y-119792000D01*
G75*
G02*
X90457000Y-119554500I0J237500D01*
G01*
X90457000Y-118979500D01*
G75*
G02*
X90694500Y-118742000I237500J0D01*
G01*
X91169500Y-118742000D01*
G75*
G02*
X91407000Y-118979500I0J-237500D01*
G01*
X91407000Y-119554500D01*
G75*
G02*
X91169500Y-119792000I-237500J0D01*
G01*
G37*
G36*
G01*
X91169500Y-121542000D02*
X90694500Y-121542000D01*
G75*
G02*
X90457000Y-121304500I0J237500D01*
G01*
X90457000Y-120729500D01*
G75*
G02*
X90694500Y-120492000I237500J0D01*
G01*
X91169500Y-120492000D01*
G75*
G02*
X91407000Y-120729500I0J-237500D01*
G01*
X91407000Y-121304500D01*
G75*
G02*
X91169500Y-121542000I-237500J0D01*
G01*
G37*
%TD*%
%TO.C,R7*%
G36*
G01*
X79010500Y-118855000D02*
X79485500Y-118855000D01*
G75*
G02*
X79723000Y-119092500I0J-237500D01*
G01*
X79723000Y-119667500D01*
G75*
G02*
X79485500Y-119905000I-237500J0D01*
G01*
X79010500Y-119905000D01*
G75*
G02*
X78773000Y-119667500I0J237500D01*
G01*
X78773000Y-119092500D01*
G75*
G02*
X79010500Y-118855000I237500J0D01*
G01*
G37*
G36*
G01*
X79010500Y-117105000D02*
X79485500Y-117105000D01*
G75*
G02*
X79723000Y-117342500I0J-237500D01*
G01*
X79723000Y-117917500D01*
G75*
G02*
X79485500Y-118155000I-237500J0D01*
G01*
X79010500Y-118155000D01*
G75*
G02*
X78773000Y-117917500I0J237500D01*
G01*
X78773000Y-117342500D01*
G75*
G02*
X79010500Y-117105000I237500J0D01*
G01*
G37*
%TD*%
%TO.C,R6*%
G36*
G01*
X72548000Y-119650500D02*
X72548000Y-120125500D01*
G75*
G02*
X72310500Y-120363000I-237500J0D01*
G01*
X71735500Y-120363000D01*
G75*
G02*
X71498000Y-120125500I0J237500D01*
G01*
X71498000Y-119650500D01*
G75*
G02*
X71735500Y-119413000I237500J0D01*
G01*
X72310500Y-119413000D01*
G75*
G02*
X72548000Y-119650500I0J-237500D01*
G01*
G37*
G36*
G01*
X74298000Y-119650500D02*
X74298000Y-120125500D01*
G75*
G02*
X74060500Y-120363000I-237500J0D01*
G01*
X73485500Y-120363000D01*
G75*
G02*
X73248000Y-120125500I0J237500D01*
G01*
X73248000Y-119650500D01*
G75*
G02*
X73485500Y-119413000I237500J0D01*
G01*
X74060500Y-119413000D01*
G75*
G02*
X74298000Y-119650500I0J-237500D01*
G01*
G37*
%TD*%
D14*
%TO.C,Q7*%
X87757000Y-74996000D03*
X91057000Y-74046000D03*
X91057000Y-75946000D03*
%TD*%
D15*
%TO.C,Q5*%
X83251000Y-78327000D03*
X82301000Y-76327000D03*
X84201000Y-76327000D03*
%TD*%
D10*
%TO.C,Q4*%
X72644000Y-114428000D03*
X73594000Y-117728000D03*
X71694000Y-117728000D03*
%TD*%
%TO.C,Q3*%
X76454000Y-116206000D03*
X77404000Y-119506000D03*
X75504000Y-119506000D03*
%TD*%
%TO.C,C14*%
G36*
G01*
X77961500Y-105963000D02*
X77486500Y-105963000D01*
G75*
G02*
X77249000Y-105725500I0J237500D01*
G01*
X77249000Y-105150500D01*
G75*
G02*
X77486500Y-104913000I237500J0D01*
G01*
X77961500Y-104913000D01*
G75*
G02*
X78199000Y-105150500I0J-237500D01*
G01*
X78199000Y-105725500D01*
G75*
G02*
X77961500Y-105963000I-237500J0D01*
G01*
G37*
G36*
G01*
X77961500Y-107713000D02*
X77486500Y-107713000D01*
G75*
G02*
X77249000Y-107475500I0J237500D01*
G01*
X77249000Y-106900500D01*
G75*
G02*
X77486500Y-106663000I237500J0D01*
G01*
X77961500Y-106663000D01*
G75*
G02*
X78199000Y-106900500I0J-237500D01*
G01*
X78199000Y-107475500D01*
G75*
G02*
X77961500Y-107713000I-237500J0D01*
G01*
G37*
%TD*%
%TO.C,C13*%
G36*
G01*
X63912000Y-105426500D02*
X63912000Y-105901500D01*
G75*
G02*
X63674500Y-106139000I-237500J0D01*
G01*
X63099500Y-106139000D01*
G75*
G02*
X62862000Y-105901500I0J237500D01*
G01*
X62862000Y-105426500D01*
G75*
G02*
X63099500Y-105189000I237500J0D01*
G01*
X63674500Y-105189000D01*
G75*
G02*
X63912000Y-105426500I0J-237500D01*
G01*
G37*
G36*
G01*
X65662000Y-105426500D02*
X65662000Y-105901500D01*
G75*
G02*
X65424500Y-106139000I-237500J0D01*
G01*
X64849500Y-106139000D01*
G75*
G02*
X64612000Y-105901500I0J237500D01*
G01*
X64612000Y-105426500D01*
G75*
G02*
X64849500Y-105189000I237500J0D01*
G01*
X65424500Y-105189000D01*
G75*
G02*
X65662000Y-105426500I0J-237500D01*
G01*
G37*
%TD*%
%TO.C,C12*%
G36*
G01*
X64399000Y-109704500D02*
X65649000Y-109704500D01*
G75*
G02*
X65899000Y-109954500I0J-250000D01*
G01*
X65899000Y-110879500D01*
G75*
G02*
X65649000Y-111129500I-250000J0D01*
G01*
X64399000Y-111129500D01*
G75*
G02*
X64149000Y-110879500I0J250000D01*
G01*
X64149000Y-109954500D01*
G75*
G02*
X64399000Y-109704500I250000J0D01*
G01*
G37*
G36*
G01*
X64399000Y-106729500D02*
X65649000Y-106729500D01*
G75*
G02*
X65899000Y-106979500I0J-250000D01*
G01*
X65899000Y-107904500D01*
G75*
G02*
X65649000Y-108154500I-250000J0D01*
G01*
X64399000Y-108154500D01*
G75*
G02*
X64149000Y-107904500I0J250000D01*
G01*
X64149000Y-106979500D01*
G75*
G02*
X64399000Y-106729500I250000J0D01*
G01*
G37*
%TD*%
%TO.C,C9*%
G36*
G01*
X85962500Y-73578000D02*
X85487500Y-73578000D01*
G75*
G02*
X85250000Y-73340500I0J237500D01*
G01*
X85250000Y-72765500D01*
G75*
G02*
X85487500Y-72528000I237500J0D01*
G01*
X85962500Y-72528000D01*
G75*
G02*
X86200000Y-72765500I0J-237500D01*
G01*
X86200000Y-73340500D01*
G75*
G02*
X85962500Y-73578000I-237500J0D01*
G01*
G37*
G36*
G01*
X85962500Y-75328000D02*
X85487500Y-75328000D01*
G75*
G02*
X85250000Y-75090500I0J237500D01*
G01*
X85250000Y-74515500D01*
G75*
G02*
X85487500Y-74278000I237500J0D01*
G01*
X85962500Y-74278000D01*
G75*
G02*
X86200000Y-74515500I0J-237500D01*
G01*
X86200000Y-75090500D01*
G75*
G02*
X85962500Y-75328000I-237500J0D01*
G01*
G37*
%TD*%
M02*
