M48
; DRILL file {KiCad 5.1.6-c6e7f7d~86~ubuntu18.04.1} date Sun May 31 13:43:37 2020
; FORMAT={-:-/ absolute / inch / decimal}
; #@! TF.CreationDate,2020-05-31T13:43:37+00:00
; #@! TF.GenerationSoftware,Kicad,Pcbnew,5.1.6-c6e7f7d~86~ubuntu18.04.1
; #@! TF.FileFunction,Plated,1,2,PTH
FMAT,2
INCH
T1C0.0157
T2C0.0315
T3C0.0354
T4C0.0394
T5C0.0433
T6C0.0630
%
G90
G05
T1
X6.82Y-2.48
X7.8953Y-1.7547
X7.94Y-1.76
X7.99Y-1.76
T2
X6.25Y-3.55
X6.26Y-1.46
X6.26Y-2.74
X6.31Y-2.53
X6.32Y-3.98
X6.35Y-2.94
X6.37Y-2.41
X6.38Y-3.55
X6.39Y-1.91
X6.44Y-2.04
X6.47Y-1.06
X6.62Y-2.63
X6.66Y-2.14
X6.67Y-1.25
X6.7Y-3.09
X6.7Y-3.23
X6.7Y-3.33
X6.7Y-3.55
X6.7Y-3.85
X6.7Y-4.0
X6.76Y-1.44
X6.78Y-1.68
X6.87Y-1.75
X6.88Y-1.47
X7.01Y-3.21
X7.02Y-1.57
X7.06Y-2.14
X7.06Y-3.545
X7.07Y-1.06
X7.07Y-1.65
X7.07Y-2.35
X7.07Y-2.48
X7.11Y-1.99
X7.12Y-1.29
X7.17Y-1.64
X7.19Y-1.29
X7.2Y-3.56
X7.21Y-2.48
X7.23Y-1.5863
X7.25Y-1.85
X7.26Y-1.96
X7.31Y-2.09
X7.34Y-2.02
X7.38Y-1.96
X7.3806Y-2.3082
X7.39Y-2.48
X7.4Y-1.71
X7.4Y-2.81
X7.465Y-1.52
X7.51Y-1.66
X7.53Y-1.87
X7.535Y-2.09
X7.535Y-2.155
X7.535Y-2.218
X7.58Y-2.57
X7.66Y-2.06
X7.68Y-1.68
X7.68Y-2.34
X7.7Y-1.51
X7.7Y-2.77
X7.7651Y-1.6149
X7.85Y-2.06
X7.85Y-2.34
X8.02Y-2.16
X8.09Y-1.83
X8.14Y-2.94
X8.15Y-1.46
X8.15Y-1.91
X8.15Y-2.12
X8.15Y-2.33
X8.15Y-2.61
T3
X6.38Y-1.125
X6.38Y-1.21
X6.38Y-1.295
X6.38Y-1.38
T4
X7.36Y-1.34
X7.46Y-1.34
X7.56Y-1.34
X7.66Y-1.34
X7.76Y-1.34
X7.86Y-1.34
X7.96Y-1.34
X8.06Y-1.34
X6.52Y-1.56
X6.52Y-1.66
X6.52Y-1.76
X6.52Y-1.86
X6.52Y-1.96
X6.97Y-3.135
X7.07Y-3.135
X7.17Y-3.135
X6.99Y-1.64
X6.99Y-1.9392
X7.16Y-2.86
X7.26Y-2.86
X8.0Y-2.7
X8.1Y-2.7
X6.52Y-2.12
X6.52Y-2.22
X6.52Y-2.32
X6.52Y-2.42
X6.52Y-2.52
X6.52Y-2.62
X7.12Y-2.7
X7.22Y-2.7
X7.32Y-2.7
X7.42Y-2.7
X7.52Y-2.7
X7.62Y-2.7
X7.72Y-2.7
X7.82Y-2.7
X7.65Y-2.86
X7.75Y-2.86
X7.85Y-2.86
X8.32Y-1.1
X8.32Y-1.2
X8.32Y-1.3
X6.91Y-2.86
X7.01Y-2.86
T5
X6.96Y-3.4291
X6.96Y-3.685
X7.1372Y-3.4291
X7.1372Y-3.685
X6.57Y-3.805
X6.57Y-3.9822
X6.8259Y-3.805
X6.8259Y-3.9822
X6.57Y-3.1078
X6.57Y-3.285
X6.8259Y-3.1078
X6.8259Y-3.285
X6.57Y-3.4578
X6.57Y-3.635
X6.8259Y-3.4578
X6.8259Y-3.635
X6.2628Y-3.4291
X6.2628Y-3.685
X6.44Y-3.4291
X6.44Y-3.685
T6
X6.71Y-2.26
X6.71Y-2.86
T0
M30
