G04 #@! TF.GenerationSoftware,KiCad,Pcbnew,5.1.5-52549c5~84~ubuntu18.04.1*
G04 #@! TF.CreationDate,2020-03-06T17:20:02+00:00*
G04 #@! TF.ProjectId,ANMLY_MTR-00,414e4d4c-595f-44d5-9452-2d30302e6b69,rev?*
G04 #@! TF.SameCoordinates,Original*
G04 #@! TF.FileFunction,Legend,Top*
G04 #@! TF.FilePolarity,Positive*
%FSLAX46Y46*%
G04 Gerber Fmt 4.6, Leading zero omitted, Abs format (unit mm)*
G04 Created by KiCad (PCBNEW 5.1.5-52549c5~84~ubuntu18.04.1) date 2020-03-06 17:20:02*
%MOMM*%
%LPD*%
G04 APERTURE LIST*
%ADD10C,0.150000*%
%ADD11C,0.120000*%
G04 APERTURE END LIST*
D10*
X180864571Y-73318666D02*
X181340761Y-73318666D01*
X180769333Y-73604380D02*
X181102666Y-72604380D01*
X181436000Y-73604380D01*
X181769333Y-73604380D02*
X181769333Y-72604380D01*
X182340761Y-73604380D01*
X182340761Y-72604380D01*
X182816952Y-73604380D02*
X182816952Y-72604380D01*
X183150285Y-73318666D01*
X183483619Y-72604380D01*
X183483619Y-73604380D01*
X184436000Y-73604380D02*
X183959809Y-73604380D01*
X183959809Y-72604380D01*
X184959809Y-73128190D02*
X184959809Y-73604380D01*
X184626476Y-72604380D02*
X184959809Y-73128190D01*
X185293142Y-72604380D01*
X185388380Y-73699619D02*
X186150285Y-73699619D01*
X186388380Y-73604380D02*
X186388380Y-72604380D01*
X186721714Y-73318666D01*
X187055047Y-72604380D01*
X187055047Y-73604380D01*
X187388380Y-72604380D02*
X187959809Y-72604380D01*
X187674095Y-73604380D02*
X187674095Y-72604380D01*
X188864571Y-73604380D02*
X188531238Y-73128190D01*
X188293142Y-73604380D02*
X188293142Y-72604380D01*
X188674095Y-72604380D01*
X188769333Y-72652000D01*
X188816952Y-72699619D01*
X188864571Y-72794857D01*
X188864571Y-72937714D01*
X188816952Y-73032952D01*
X188769333Y-73080571D01*
X188674095Y-73128190D01*
X188293142Y-73128190D01*
X189293142Y-73223428D02*
X190055047Y-73223428D01*
X190721714Y-72604380D02*
X190816952Y-72604380D01*
X190912190Y-72652000D01*
X190959809Y-72699619D01*
X191007428Y-72794857D01*
X191055047Y-72985333D01*
X191055047Y-73223428D01*
X191007428Y-73413904D01*
X190959809Y-73509142D01*
X190912190Y-73556761D01*
X190816952Y-73604380D01*
X190721714Y-73604380D01*
X190626476Y-73556761D01*
X190578857Y-73509142D01*
X190531238Y-73413904D01*
X190483619Y-73223428D01*
X190483619Y-72985333D01*
X190531238Y-72794857D01*
X190578857Y-72699619D01*
X190626476Y-72652000D01*
X190721714Y-72604380D01*
X191674095Y-72604380D02*
X191769333Y-72604380D01*
X191864571Y-72652000D01*
X191912190Y-72699619D01*
X191959809Y-72794857D01*
X192007428Y-72985333D01*
X192007428Y-73223428D01*
X191959809Y-73413904D01*
X191912190Y-73509142D01*
X191864571Y-73556761D01*
X191769333Y-73604380D01*
X191674095Y-73604380D01*
X191578857Y-73556761D01*
X191531238Y-73509142D01*
X191483619Y-73413904D01*
X191436000Y-73223428D01*
X191436000Y-72985333D01*
X191483619Y-72794857D01*
X191531238Y-72699619D01*
X191578857Y-72652000D01*
X191674095Y-72604380D01*
D11*
X189933733Y-32768000D02*
X190276267Y-32768000D01*
X189933733Y-31748000D02*
X190276267Y-31748000D01*
X204214000Y-30957733D02*
X204214000Y-31300267D01*
X205234000Y-30957733D02*
X205234000Y-31300267D01*
X201674000Y-30957733D02*
X201674000Y-31300267D01*
X202694000Y-30957733D02*
X202694000Y-31300267D01*
X186405733Y-32768000D02*
X186748267Y-32768000D01*
X186405733Y-31748000D02*
X186748267Y-31748000D01*
X189535000Y-43950000D02*
X188755000Y-43950000D01*
X188755000Y-43950000D02*
X188755000Y-44950000D01*
X189535000Y-62190000D02*
X188755000Y-62190000D01*
X188755000Y-62190000D02*
X188755000Y-61190000D01*
X214500000Y-43950000D02*
X214500000Y-62190000D01*
X214500000Y-62190000D02*
X208080000Y-62190000D01*
X214500000Y-43950000D02*
X208080000Y-43950000D01*
X208080000Y-43950000D02*
X208080000Y-43570000D01*
X176133000Y-47155000D02*
X176133000Y-42855000D01*
X174133000Y-47155000D02*
X176133000Y-47155000D01*
X174133000Y-42855000D02*
X174133000Y-47155000D01*
X177896733Y-43944000D02*
X178239267Y-43944000D01*
X177896733Y-42924000D02*
X178239267Y-42924000D01*
X179518000Y-68580000D02*
X179518000Y-67250000D01*
X179518000Y-67250000D02*
X180848000Y-67250000D01*
X182118000Y-67250000D02*
X199958000Y-67250000D01*
X199958000Y-69910000D02*
X199958000Y-67250000D01*
X182118000Y-69910000D02*
X199958000Y-69910000D01*
X182118000Y-69910000D02*
X182118000Y-67250000D01*
X167384000Y-27373733D02*
X167384000Y-27716267D01*
X168404000Y-27373733D02*
X168404000Y-27716267D01*
X175626500Y-30815000D02*
X171541500Y-30815000D01*
X175626500Y-32685000D02*
X175626500Y-30815000D01*
X171541500Y-32685000D02*
X175626500Y-32685000D01*
X171272000Y-68661000D02*
X167187000Y-68661000D01*
X167187000Y-68661000D02*
X167187000Y-70531000D01*
X167187000Y-70531000D02*
X171272000Y-70531000D01*
X187708000Y-46677733D02*
X187708000Y-47020267D01*
X186688000Y-46677733D02*
X186688000Y-47020267D01*
X205101436Y-39476000D02*
X206305564Y-39476000D01*
X205101436Y-41296000D02*
X206305564Y-41296000D01*
X206330733Y-42928000D02*
X206673267Y-42928000D01*
X206330733Y-41908000D02*
X206673267Y-41908000D01*
X173887000Y-66321000D02*
X171427000Y-66321000D01*
X171427000Y-66321000D02*
X171427000Y-67791000D01*
X171427000Y-67791000D02*
X173887000Y-67791000D01*
X174747000Y-64543000D02*
X172287000Y-64543000D01*
X174747000Y-66013000D02*
X174747000Y-64543000D01*
X172287000Y-66013000D02*
X174747000Y-66013000D01*
X160971173Y-29025685D02*
G75*
G03X160507170Y-34373500I1080827J-2787815D01*
G01*
X163132827Y-29025685D02*
G75*
G02X163596830Y-34373500I-1080827J-2787815D01*
G01*
X160971571Y-29559021D02*
G75*
G03X160972000Y-34068184I1080429J-2254479D01*
G01*
X163132429Y-29559021D02*
G75*
G02X163132000Y-34068184I-1080429J-2254479D01*
G01*
X160507000Y-34373500D02*
X160972000Y-34373500D01*
X163132000Y-34373500D02*
X163597000Y-34373500D01*
X155518000Y-52638000D02*
X164148000Y-52638000D01*
X155518000Y-52756095D02*
X164148000Y-52756095D01*
X155518000Y-52874190D02*
X164148000Y-52874190D01*
X155518000Y-52992285D02*
X164148000Y-52992285D01*
X155518000Y-53110380D02*
X164148000Y-53110380D01*
X155518000Y-53228475D02*
X164148000Y-53228475D01*
X155518000Y-53346570D02*
X164148000Y-53346570D01*
X155518000Y-53464665D02*
X164148000Y-53464665D01*
X155518000Y-53582760D02*
X164148000Y-53582760D01*
X155518000Y-53700855D02*
X164148000Y-53700855D01*
X155518000Y-53818950D02*
X164148000Y-53818950D01*
X155518000Y-53937045D02*
X164148000Y-53937045D01*
X155518000Y-54055140D02*
X164148000Y-54055140D01*
X155518000Y-54173235D02*
X164148000Y-54173235D01*
X155518000Y-54291330D02*
X164148000Y-54291330D01*
X155518000Y-54409425D02*
X164148000Y-54409425D01*
X155518000Y-54527520D02*
X164148000Y-54527520D01*
X155518000Y-54645615D02*
X164148000Y-54645615D01*
X155518000Y-54763710D02*
X164148000Y-54763710D01*
X155518000Y-54881805D02*
X164148000Y-54881805D01*
X155518000Y-54999900D02*
X164148000Y-54999900D01*
X164148000Y-53488000D02*
X164498000Y-53488000D01*
X164148000Y-54208000D02*
X164498000Y-54208000D01*
X164148000Y-56028000D02*
X164558000Y-56028000D01*
X164148000Y-56748000D02*
X164558000Y-56748000D01*
X164148000Y-58568000D02*
X164558000Y-58568000D01*
X164148000Y-59288000D02*
X164558000Y-59288000D01*
X164148000Y-61108000D02*
X164558000Y-61108000D01*
X164148000Y-61828000D02*
X164558000Y-61828000D01*
X164148000Y-63648000D02*
X164558000Y-63648000D01*
X164148000Y-64368000D02*
X164558000Y-64368000D01*
X164148000Y-66188000D02*
X164558000Y-66188000D01*
X164148000Y-66908000D02*
X164558000Y-66908000D01*
X155518000Y-55118000D02*
X164148000Y-55118000D01*
X155518000Y-57658000D02*
X164148000Y-57658000D01*
X155518000Y-60198000D02*
X164148000Y-60198000D01*
X155518000Y-62738000D02*
X164148000Y-62738000D01*
X155518000Y-65278000D02*
X164148000Y-65278000D01*
X155518000Y-52518000D02*
X164148000Y-52518000D01*
X164148000Y-52518000D02*
X164148000Y-67878000D01*
X155518000Y-67878000D02*
X164148000Y-67878000D01*
X155518000Y-52518000D02*
X155518000Y-67878000D01*
X166718000Y-52518000D02*
X166718000Y-53848000D01*
X165608000Y-52518000D02*
X166718000Y-52518000D01*
X155518000Y-38414000D02*
X164148000Y-38414000D01*
X155518000Y-38532095D02*
X164148000Y-38532095D01*
X155518000Y-38650190D02*
X164148000Y-38650190D01*
X155518000Y-38768285D02*
X164148000Y-38768285D01*
X155518000Y-38886380D02*
X164148000Y-38886380D01*
X155518000Y-39004475D02*
X164148000Y-39004475D01*
X155518000Y-39122570D02*
X164148000Y-39122570D01*
X155518000Y-39240665D02*
X164148000Y-39240665D01*
X155518000Y-39358760D02*
X164148000Y-39358760D01*
X155518000Y-39476855D02*
X164148000Y-39476855D01*
X155518000Y-39594950D02*
X164148000Y-39594950D01*
X155518000Y-39713045D02*
X164148000Y-39713045D01*
X155518000Y-39831140D02*
X164148000Y-39831140D01*
X155518000Y-39949235D02*
X164148000Y-39949235D01*
X155518000Y-40067330D02*
X164148000Y-40067330D01*
X155518000Y-40185425D02*
X164148000Y-40185425D01*
X155518000Y-40303520D02*
X164148000Y-40303520D01*
X155518000Y-40421615D02*
X164148000Y-40421615D01*
X155518000Y-40539710D02*
X164148000Y-40539710D01*
X155518000Y-40657805D02*
X164148000Y-40657805D01*
X155518000Y-40775900D02*
X164148000Y-40775900D01*
X164148000Y-39264000D02*
X164498000Y-39264000D01*
X164148000Y-39984000D02*
X164498000Y-39984000D01*
X164148000Y-41804000D02*
X164558000Y-41804000D01*
X164148000Y-42524000D02*
X164558000Y-42524000D01*
X164148000Y-44344000D02*
X164558000Y-44344000D01*
X164148000Y-45064000D02*
X164558000Y-45064000D01*
X164148000Y-46884000D02*
X164558000Y-46884000D01*
X164148000Y-47604000D02*
X164558000Y-47604000D01*
X164148000Y-49424000D02*
X164558000Y-49424000D01*
X164148000Y-50144000D02*
X164558000Y-50144000D01*
X155518000Y-40894000D02*
X164148000Y-40894000D01*
X155518000Y-43434000D02*
X164148000Y-43434000D01*
X155518000Y-45974000D02*
X164148000Y-45974000D01*
X155518000Y-48514000D02*
X164148000Y-48514000D01*
X155518000Y-38294000D02*
X164148000Y-38294000D01*
X164148000Y-38294000D02*
X164148000Y-51114000D01*
X155518000Y-51114000D02*
X164148000Y-51114000D01*
X155518000Y-38294000D02*
X155518000Y-51114000D01*
X166718000Y-38294000D02*
X166718000Y-39624000D01*
X165608000Y-38294000D02*
X166718000Y-38294000D01*
X221418000Y-34230000D02*
X212788000Y-34230000D01*
X221418000Y-34111905D02*
X212788000Y-34111905D01*
X221418000Y-33993810D02*
X212788000Y-33993810D01*
X221418000Y-33875715D02*
X212788000Y-33875715D01*
X221418000Y-33757620D02*
X212788000Y-33757620D01*
X221418000Y-33639525D02*
X212788000Y-33639525D01*
X221418000Y-33521430D02*
X212788000Y-33521430D01*
X221418000Y-33403335D02*
X212788000Y-33403335D01*
X221418000Y-33285240D02*
X212788000Y-33285240D01*
X221418000Y-33167145D02*
X212788000Y-33167145D01*
X221418000Y-33049050D02*
X212788000Y-33049050D01*
X221418000Y-32930955D02*
X212788000Y-32930955D01*
X221418000Y-32812860D02*
X212788000Y-32812860D01*
X221418000Y-32694765D02*
X212788000Y-32694765D01*
X221418000Y-32576670D02*
X212788000Y-32576670D01*
X221418000Y-32458575D02*
X212788000Y-32458575D01*
X221418000Y-32340480D02*
X212788000Y-32340480D01*
X221418000Y-32222385D02*
X212788000Y-32222385D01*
X221418000Y-32104290D02*
X212788000Y-32104290D01*
X221418000Y-31986195D02*
X212788000Y-31986195D01*
X221418000Y-31868100D02*
X212788000Y-31868100D01*
X212788000Y-33380000D02*
X212438000Y-33380000D01*
X212788000Y-32660000D02*
X212438000Y-32660000D01*
X212788000Y-30840000D02*
X212378000Y-30840000D01*
X212788000Y-30120000D02*
X212378000Y-30120000D01*
X212788000Y-28300000D02*
X212378000Y-28300000D01*
X212788000Y-27580000D02*
X212378000Y-27580000D01*
X221418000Y-31750000D02*
X212788000Y-31750000D01*
X221418000Y-29210000D02*
X212788000Y-29210000D01*
X221418000Y-34350000D02*
X212788000Y-34350000D01*
X212788000Y-34350000D02*
X212788000Y-26610000D01*
X221418000Y-26610000D02*
X212788000Y-26610000D01*
X221418000Y-34350000D02*
X221418000Y-26610000D01*
X210218000Y-34350000D02*
X210218000Y-33020000D01*
X211328000Y-34350000D02*
X210218000Y-34350000D01*
X169599000Y-29580000D02*
X169979000Y-29580000D01*
X169599000Y-25530000D02*
X169599000Y-25270000D01*
X169599000Y-29580000D02*
X169599000Y-27810000D01*
X177219000Y-29580000D02*
X176839000Y-29580000D01*
X177219000Y-27810000D02*
X177219000Y-29580000D01*
X177219000Y-25270000D02*
X177219000Y-25530000D01*
X201870000Y-69910000D02*
X201870000Y-68580000D01*
X203200000Y-69910000D02*
X201870000Y-69910000D01*
X204470000Y-69910000D02*
X204470000Y-67250000D01*
X204470000Y-67250000D02*
X207070000Y-67250000D01*
X204470000Y-69910000D02*
X207070000Y-69910000D01*
X207070000Y-69910000D02*
X207070000Y-67250000D01*
X174558000Y-49222000D02*
X174558000Y-51622000D01*
X174558000Y-51622000D02*
X173508000Y-51622000D01*
X171258000Y-49822000D02*
X171258000Y-51622000D01*
X171258000Y-51622000D02*
X172308000Y-51622000D01*
X171256000Y-46166000D02*
X171256000Y-45116000D01*
X169456000Y-46166000D02*
X171256000Y-46166000D01*
X171256000Y-42866000D02*
X171256000Y-43916000D01*
X168856000Y-42866000D02*
X171256000Y-42866000D01*
X177748000Y-44451000D02*
X180148000Y-44451000D01*
X180148000Y-44451000D02*
X180148000Y-45501000D01*
X178348000Y-47751000D02*
X180148000Y-47751000D01*
X180148000Y-47751000D02*
X180148000Y-46701000D01*
X166880000Y-27716267D02*
X166880000Y-27373733D01*
X165860000Y-27716267D02*
X165860000Y-27373733D01*
X207459733Y-27430000D02*
X207802267Y-27430000D01*
X207459733Y-28450000D02*
X207802267Y-28450000D01*
X207487733Y-30228000D02*
X207830267Y-30228000D01*
X207487733Y-29208000D02*
X207830267Y-29208000D01*
X174048267Y-68070000D02*
X173705733Y-68070000D01*
X174048267Y-69090000D02*
X173705733Y-69090000D01*
X169448267Y-46734000D02*
X169105733Y-46734000D01*
X169448267Y-47754000D02*
X169105733Y-47754000D01*
X169448267Y-50294000D02*
X169105733Y-50294000D01*
X169448267Y-49274000D02*
X169105733Y-49274000D01*
X169924000Y-66324267D02*
X169924000Y-65981733D01*
X170944000Y-66324267D02*
X170944000Y-65981733D01*
X203230267Y-42928000D02*
X202887733Y-42928000D01*
X203230267Y-41908000D02*
X202887733Y-41908000D01*
X184402000Y-60510267D02*
X184402000Y-60167733D01*
X185422000Y-60510267D02*
X185422000Y-60167733D01*
X203202000Y-37650267D02*
X203202000Y-37307733D01*
X202182000Y-37650267D02*
X202182000Y-37307733D01*
X203706000Y-37650267D02*
X203706000Y-37307733D01*
X204726000Y-37650267D02*
X204726000Y-37307733D01*
X181668267Y-43944000D02*
X181325733Y-43944000D01*
X181668267Y-42924000D02*
X181325733Y-42924000D01*
X201678000Y-37650267D02*
X201678000Y-37307733D01*
X200658000Y-37650267D02*
X200658000Y-37307733D01*
X200154000Y-30957733D02*
X200154000Y-31300267D01*
X199134000Y-30957733D02*
X199134000Y-31300267D01*
X176278000Y-83013733D02*
X176278000Y-83356267D01*
X175258000Y-83013733D02*
X175258000Y-83356267D01*
X180309733Y-83691000D02*
X180652267Y-83691000D01*
X180309733Y-84711000D02*
X180652267Y-84711000D01*
X164576000Y-92345000D02*
X164576000Y-87845000D01*
X160576000Y-93595000D02*
X162076000Y-93595000D01*
X158076000Y-87845000D02*
X158076000Y-92345000D01*
X162076000Y-86595000D02*
X160576000Y-86595000D01*
X172378000Y-77685000D02*
X167878000Y-77685000D01*
X173628000Y-81685000D02*
X173628000Y-80185000D01*
X167878000Y-84185000D02*
X172378000Y-84185000D01*
X166628000Y-80185000D02*
X166628000Y-81685000D01*
X166628000Y-97893000D02*
X166628000Y-99393000D01*
X167878000Y-101893000D02*
X172378000Y-101893000D01*
X173628000Y-99393000D02*
X173628000Y-97893000D01*
X172378000Y-95393000D02*
X167878000Y-95393000D01*
X175784000Y-87845000D02*
X175784000Y-92345000D01*
X179784000Y-86595000D02*
X178284000Y-86595000D01*
X182284000Y-92345000D02*
X182284000Y-87845000D01*
X178284000Y-93595000D02*
X179784000Y-93595000D01*
X173628000Y-90575000D02*
X173628000Y-89075000D01*
X172378000Y-86575000D02*
X167878000Y-86575000D01*
X166628000Y-89075000D02*
X166628000Y-90575000D01*
X167878000Y-93075000D02*
X172378000Y-93075000D01*
X174178000Y-62992000D02*
G75*
G03X174178000Y-62992000I-950000J0D01*
G01*
X199832000Y-41910000D02*
G75*
G03X199832000Y-41910000I-950000J0D01*
G01*
X203896000Y-64262000D02*
G75*
G03X203896000Y-64262000I-950000J0D01*
G01*
X206436000Y-64262000D02*
G75*
G03X206436000Y-64262000I-950000J0D01*
G01*
X164526000Y-96393000D02*
G75*
G03X164526000Y-96393000I-950000J0D01*
G01*
X192980000Y-71314000D02*
X192980000Y-73974000D01*
X198120000Y-71314000D02*
X192980000Y-71314000D01*
X198120000Y-73974000D02*
X192980000Y-73974000D01*
X198120000Y-71314000D02*
X198120000Y-73974000D01*
X199390000Y-71314000D02*
X200720000Y-71314000D01*
X200720000Y-71314000D02*
X200720000Y-72644000D01*
X183448000Y-78045000D02*
X183448000Y-79375000D01*
X182118000Y-78045000D02*
X183448000Y-78045000D01*
X180848000Y-78045000D02*
X180848000Y-80705000D01*
X180848000Y-80705000D02*
X175708000Y-80705000D01*
X180848000Y-78045000D02*
X175708000Y-78045000D01*
X175708000Y-78045000D02*
X175708000Y-80705000D01*
D10*
X189462142Y-31280380D02*
X189128809Y-30804190D01*
X188890714Y-31280380D02*
X188890714Y-30280380D01*
X189271666Y-30280380D01*
X189366904Y-30328000D01*
X189414523Y-30375619D01*
X189462142Y-30470857D01*
X189462142Y-30613714D01*
X189414523Y-30708952D01*
X189366904Y-30756571D01*
X189271666Y-30804190D01*
X188890714Y-30804190D01*
X189795476Y-30280380D02*
X190414523Y-30280380D01*
X190081190Y-30661333D01*
X190224047Y-30661333D01*
X190319285Y-30708952D01*
X190366904Y-30756571D01*
X190414523Y-30851809D01*
X190414523Y-31089904D01*
X190366904Y-31185142D01*
X190319285Y-31232761D01*
X190224047Y-31280380D01*
X189938333Y-31280380D01*
X189843095Y-31232761D01*
X189795476Y-31185142D01*
X190747857Y-30280380D02*
X191414523Y-30280380D01*
X190985952Y-31280380D01*
X205176380Y-28582857D02*
X204700190Y-28916190D01*
X205176380Y-29154285D02*
X204176380Y-29154285D01*
X204176380Y-28773333D01*
X204224000Y-28678095D01*
X204271619Y-28630476D01*
X204366857Y-28582857D01*
X204509714Y-28582857D01*
X204604952Y-28630476D01*
X204652571Y-28678095D01*
X204700190Y-28773333D01*
X204700190Y-29154285D01*
X204176380Y-28249523D02*
X204176380Y-27630476D01*
X204557333Y-27963809D01*
X204557333Y-27820952D01*
X204604952Y-27725714D01*
X204652571Y-27678095D01*
X204747809Y-27630476D01*
X204985904Y-27630476D01*
X205081142Y-27678095D01*
X205128761Y-27725714D01*
X205176380Y-27820952D01*
X205176380Y-28106666D01*
X205128761Y-28201904D01*
X205081142Y-28249523D01*
X204176380Y-26773333D02*
X204176380Y-26963809D01*
X204224000Y-27059047D01*
X204271619Y-27106666D01*
X204414476Y-27201904D01*
X204604952Y-27249523D01*
X204985904Y-27249523D01*
X205081142Y-27201904D01*
X205128761Y-27154285D01*
X205176380Y-27059047D01*
X205176380Y-26868571D01*
X205128761Y-26773333D01*
X205081142Y-26725714D01*
X204985904Y-26678095D01*
X204747809Y-26678095D01*
X204652571Y-26725714D01*
X204604952Y-26773333D01*
X204557333Y-26868571D01*
X204557333Y-27059047D01*
X204604952Y-27154285D01*
X204652571Y-27201904D01*
X204747809Y-27249523D01*
X202636380Y-28582857D02*
X202160190Y-28916190D01*
X202636380Y-29154285D02*
X201636380Y-29154285D01*
X201636380Y-28773333D01*
X201684000Y-28678095D01*
X201731619Y-28630476D01*
X201826857Y-28582857D01*
X201969714Y-28582857D01*
X202064952Y-28630476D01*
X202112571Y-28678095D01*
X202160190Y-28773333D01*
X202160190Y-29154285D01*
X201636380Y-28249523D02*
X201636380Y-27630476D01*
X202017333Y-27963809D01*
X202017333Y-27820952D01*
X202064952Y-27725714D01*
X202112571Y-27678095D01*
X202207809Y-27630476D01*
X202445904Y-27630476D01*
X202541142Y-27678095D01*
X202588761Y-27725714D01*
X202636380Y-27820952D01*
X202636380Y-28106666D01*
X202588761Y-28201904D01*
X202541142Y-28249523D01*
X201636380Y-26725714D02*
X201636380Y-27201904D01*
X202112571Y-27249523D01*
X202064952Y-27201904D01*
X202017333Y-27106666D01*
X202017333Y-26868571D01*
X202064952Y-26773333D01*
X202112571Y-26725714D01*
X202207809Y-26678095D01*
X202445904Y-26678095D01*
X202541142Y-26725714D01*
X202588761Y-26773333D01*
X202636380Y-26868571D01*
X202636380Y-27106666D01*
X202588761Y-27201904D01*
X202541142Y-27249523D01*
X185934142Y-31280380D02*
X185600809Y-30804190D01*
X185362714Y-31280380D02*
X185362714Y-30280380D01*
X185743666Y-30280380D01*
X185838904Y-30328000D01*
X185886523Y-30375619D01*
X185934142Y-30470857D01*
X185934142Y-30613714D01*
X185886523Y-30708952D01*
X185838904Y-30756571D01*
X185743666Y-30804190D01*
X185362714Y-30804190D01*
X186267476Y-30280380D02*
X186886523Y-30280380D01*
X186553190Y-30661333D01*
X186696047Y-30661333D01*
X186791285Y-30708952D01*
X186838904Y-30756571D01*
X186886523Y-30851809D01*
X186886523Y-31089904D01*
X186838904Y-31185142D01*
X186791285Y-31232761D01*
X186696047Y-31280380D01*
X186410333Y-31280380D01*
X186315095Y-31232761D01*
X186267476Y-31185142D01*
X187743666Y-30613714D02*
X187743666Y-31280380D01*
X187505571Y-30232761D02*
X187267476Y-30947047D01*
X187886523Y-30947047D01*
X189443095Y-41912380D02*
X189443095Y-42721904D01*
X189490714Y-42817142D01*
X189538333Y-42864761D01*
X189633571Y-42912380D01*
X189824047Y-42912380D01*
X189919285Y-42864761D01*
X189966904Y-42817142D01*
X190014523Y-42721904D01*
X190014523Y-41912380D01*
X190395476Y-41912380D02*
X191014523Y-41912380D01*
X190681190Y-42293333D01*
X190824047Y-42293333D01*
X190919285Y-42340952D01*
X190966904Y-42388571D01*
X191014523Y-42483809D01*
X191014523Y-42721904D01*
X190966904Y-42817142D01*
X190919285Y-42864761D01*
X190824047Y-42912380D01*
X190538333Y-42912380D01*
X190443095Y-42864761D01*
X190395476Y-42817142D01*
X172235904Y-46680380D02*
X172235904Y-45680380D01*
X172474000Y-45680380D01*
X172616857Y-45728000D01*
X172712095Y-45823238D01*
X172759714Y-45918476D01*
X172807333Y-46108952D01*
X172807333Y-46251809D01*
X172759714Y-46442285D01*
X172712095Y-46537523D01*
X172616857Y-46632761D01*
X172474000Y-46680380D01*
X172235904Y-46680380D01*
X173664476Y-46013714D02*
X173664476Y-46680380D01*
X173426380Y-45632761D02*
X173188285Y-46347047D01*
X173807333Y-46347047D01*
X177157142Y-40235142D02*
X177109523Y-40282761D01*
X176966666Y-40330380D01*
X176871428Y-40330380D01*
X176728571Y-40282761D01*
X176633333Y-40187523D01*
X176585714Y-40092285D01*
X176538095Y-39901809D01*
X176538095Y-39758952D01*
X176585714Y-39568476D01*
X176633333Y-39473238D01*
X176728571Y-39378000D01*
X176871428Y-39330380D01*
X176966666Y-39330380D01*
X177109523Y-39378000D01*
X177157142Y-39425619D01*
X178109523Y-40330380D02*
X177538095Y-40330380D01*
X177823809Y-40330380D02*
X177823809Y-39330380D01*
X177728571Y-39473238D01*
X177633333Y-39568476D01*
X177538095Y-39616095D01*
X178442857Y-39330380D02*
X179061904Y-39330380D01*
X178728571Y-39711333D01*
X178871428Y-39711333D01*
X178966666Y-39758952D01*
X179014285Y-39806571D01*
X179061904Y-39901809D01*
X179061904Y-40139904D01*
X179014285Y-40235142D01*
X178966666Y-40282761D01*
X178871428Y-40330380D01*
X178585714Y-40330380D01*
X178490476Y-40282761D01*
X178442857Y-40235142D01*
X184578666Y-70318380D02*
X184578666Y-71032666D01*
X184531047Y-71175523D01*
X184435809Y-71270761D01*
X184292952Y-71318380D01*
X184197714Y-71318380D01*
X185102476Y-71318380D02*
X185292952Y-71318380D01*
X185388190Y-71270761D01*
X185435809Y-71223142D01*
X185531047Y-71080285D01*
X185578666Y-70889809D01*
X185578666Y-70508857D01*
X185531047Y-70413619D01*
X185483428Y-70366000D01*
X185388190Y-70318380D01*
X185197714Y-70318380D01*
X185102476Y-70366000D01*
X185054857Y-70413619D01*
X185007238Y-70508857D01*
X185007238Y-70746952D01*
X185054857Y-70842190D01*
X185102476Y-70889809D01*
X185197714Y-70937428D01*
X185388190Y-70937428D01*
X185483428Y-70889809D01*
X185531047Y-70842190D01*
X185578666Y-70746952D01*
X168235333Y-30329142D02*
X168187714Y-30376761D01*
X168044857Y-30424380D01*
X167949619Y-30424380D01*
X167806761Y-30376761D01*
X167711523Y-30281523D01*
X167663904Y-30186285D01*
X167616285Y-29995809D01*
X167616285Y-29852952D01*
X167663904Y-29662476D01*
X167711523Y-29567238D01*
X167806761Y-29472000D01*
X167949619Y-29424380D01*
X168044857Y-29424380D01*
X168187714Y-29472000D01*
X168235333Y-29519619D01*
X169187714Y-30424380D02*
X168616285Y-30424380D01*
X168902000Y-30424380D02*
X168902000Y-29424380D01*
X168806761Y-29567238D01*
X168711523Y-29662476D01*
X168616285Y-29710095D01*
X172974833Y-33857142D02*
X172927214Y-33904761D01*
X172784357Y-33952380D01*
X172689119Y-33952380D01*
X172546261Y-33904761D01*
X172451023Y-33809523D01*
X172403404Y-33714285D01*
X172355785Y-33523809D01*
X172355785Y-33380952D01*
X172403404Y-33190476D01*
X172451023Y-33095238D01*
X172546261Y-33000000D01*
X172689119Y-32952380D01*
X172784357Y-32952380D01*
X172927214Y-33000000D01*
X172974833Y-33047619D01*
X173355785Y-33047619D02*
X173403404Y-33000000D01*
X173498642Y-32952380D01*
X173736738Y-32952380D01*
X173831976Y-33000000D01*
X173879595Y-33047619D01*
X173927214Y-33142857D01*
X173927214Y-33238095D01*
X173879595Y-33380952D01*
X173308166Y-33952380D01*
X173927214Y-33952380D01*
X165949333Y-69953142D02*
X165901714Y-70000761D01*
X165758857Y-70048380D01*
X165663619Y-70048380D01*
X165520761Y-70000761D01*
X165425523Y-69905523D01*
X165377904Y-69810285D01*
X165330285Y-69619809D01*
X165330285Y-69476952D01*
X165377904Y-69286476D01*
X165425523Y-69191238D01*
X165520761Y-69096000D01*
X165663619Y-69048380D01*
X165758857Y-69048380D01*
X165901714Y-69096000D01*
X165949333Y-69143619D01*
X166806476Y-69048380D02*
X166616000Y-69048380D01*
X166520761Y-69096000D01*
X166473142Y-69143619D01*
X166377904Y-69286476D01*
X166330285Y-69476952D01*
X166330285Y-69857904D01*
X166377904Y-69953142D01*
X166425523Y-70000761D01*
X166520761Y-70048380D01*
X166711238Y-70048380D01*
X166806476Y-70000761D01*
X166854095Y-69953142D01*
X166901714Y-69857904D01*
X166901714Y-69619809D01*
X166854095Y-69524571D01*
X166806476Y-69476952D01*
X166711238Y-69429333D01*
X166520761Y-69429333D01*
X166425523Y-69476952D01*
X166377904Y-69524571D01*
X166330285Y-69619809D01*
X185507333Y-46077142D02*
X185459714Y-46124761D01*
X185316857Y-46172380D01*
X185221619Y-46172380D01*
X185078761Y-46124761D01*
X184983523Y-46029523D01*
X184935904Y-45934285D01*
X184888285Y-45743809D01*
X184888285Y-45600952D01*
X184935904Y-45410476D01*
X184983523Y-45315238D01*
X185078761Y-45220000D01*
X185221619Y-45172380D01*
X185316857Y-45172380D01*
X185459714Y-45220000D01*
X185507333Y-45267619D01*
X185840666Y-45172380D02*
X186507333Y-45172380D01*
X186078761Y-46172380D01*
X205536833Y-38923142D02*
X205489214Y-38970761D01*
X205346357Y-39018380D01*
X205251119Y-39018380D01*
X205108261Y-38970761D01*
X205013023Y-38875523D01*
X204965404Y-38780285D01*
X204917785Y-38589809D01*
X204917785Y-38446952D01*
X204965404Y-38256476D01*
X205013023Y-38161238D01*
X205108261Y-38066000D01*
X205251119Y-38018380D01*
X205346357Y-38018380D01*
X205489214Y-38066000D01*
X205536833Y-38113619D01*
X206108261Y-38446952D02*
X206013023Y-38399333D01*
X205965404Y-38351714D01*
X205917785Y-38256476D01*
X205917785Y-38208857D01*
X205965404Y-38113619D01*
X206013023Y-38066000D01*
X206108261Y-38018380D01*
X206298738Y-38018380D01*
X206393976Y-38066000D01*
X206441595Y-38113619D01*
X206489214Y-38208857D01*
X206489214Y-38256476D01*
X206441595Y-38351714D01*
X206393976Y-38399333D01*
X206298738Y-38446952D01*
X206108261Y-38446952D01*
X206013023Y-38494571D01*
X205965404Y-38542190D01*
X205917785Y-38637428D01*
X205917785Y-38827904D01*
X205965404Y-38923142D01*
X206013023Y-38970761D01*
X206108261Y-39018380D01*
X206298738Y-39018380D01*
X206393976Y-38970761D01*
X206441595Y-38923142D01*
X206489214Y-38827904D01*
X206489214Y-38637428D01*
X206441595Y-38542190D01*
X206393976Y-38494571D01*
X206298738Y-38446952D01*
X206335333Y-41345142D02*
X206287714Y-41392761D01*
X206144857Y-41440380D01*
X206049619Y-41440380D01*
X205906761Y-41392761D01*
X205811523Y-41297523D01*
X205763904Y-41202285D01*
X205716285Y-41011809D01*
X205716285Y-40868952D01*
X205763904Y-40678476D01*
X205811523Y-40583238D01*
X205906761Y-40488000D01*
X206049619Y-40440380D01*
X206144857Y-40440380D01*
X206287714Y-40488000D01*
X206335333Y-40535619D01*
X206811523Y-41440380D02*
X207002000Y-41440380D01*
X207097238Y-41392761D01*
X207144857Y-41345142D01*
X207240095Y-41202285D01*
X207287714Y-41011809D01*
X207287714Y-40630857D01*
X207240095Y-40535619D01*
X207192476Y-40488000D01*
X207097238Y-40440380D01*
X206906761Y-40440380D01*
X206811523Y-40488000D01*
X206763904Y-40535619D01*
X206716285Y-40630857D01*
X206716285Y-40868952D01*
X206763904Y-40964190D01*
X206811523Y-41011809D01*
X206906761Y-41059428D01*
X207097238Y-41059428D01*
X207192476Y-41011809D01*
X207240095Y-40964190D01*
X207287714Y-40868952D01*
X175029904Y-67508380D02*
X175029904Y-66508380D01*
X175268000Y-66508380D01*
X175410857Y-66556000D01*
X175506095Y-66651238D01*
X175553714Y-66746476D01*
X175601333Y-66936952D01*
X175601333Y-67079809D01*
X175553714Y-67270285D01*
X175506095Y-67365523D01*
X175410857Y-67460761D01*
X175268000Y-67508380D01*
X175029904Y-67508380D01*
X176553714Y-67508380D02*
X175982285Y-67508380D01*
X176268000Y-67508380D02*
X176268000Y-66508380D01*
X176172761Y-66651238D01*
X176077523Y-66746476D01*
X175982285Y-66794095D01*
X175029904Y-65730380D02*
X175029904Y-64730380D01*
X175268000Y-64730380D01*
X175410857Y-64778000D01*
X175506095Y-64873238D01*
X175553714Y-64968476D01*
X175601333Y-65158952D01*
X175601333Y-65301809D01*
X175553714Y-65492285D01*
X175506095Y-65587523D01*
X175410857Y-65682761D01*
X175268000Y-65730380D01*
X175029904Y-65730380D01*
X175982285Y-64825619D02*
X176029904Y-64778000D01*
X176125142Y-64730380D01*
X176363238Y-64730380D01*
X176458476Y-64778000D01*
X176506095Y-64825619D01*
X176553714Y-64920857D01*
X176553714Y-65016095D01*
X176506095Y-65158952D01*
X175934666Y-65730380D01*
X176553714Y-65730380D01*
X159027904Y-28900380D02*
X159027904Y-27900380D01*
X159266000Y-27900380D01*
X159408857Y-27948000D01*
X159504095Y-28043238D01*
X159551714Y-28138476D01*
X159599333Y-28328952D01*
X159599333Y-28471809D01*
X159551714Y-28662285D01*
X159504095Y-28757523D01*
X159408857Y-28852761D01*
X159266000Y-28900380D01*
X159027904Y-28900380D01*
X159932666Y-27900380D02*
X160551714Y-27900380D01*
X160218380Y-28281333D01*
X160361238Y-28281333D01*
X160456476Y-28328952D01*
X160504095Y-28376571D01*
X160551714Y-28471809D01*
X160551714Y-28709904D01*
X160504095Y-28805142D01*
X160456476Y-28852761D01*
X160361238Y-28900380D01*
X160075523Y-28900380D01*
X159980285Y-28852761D01*
X159932666Y-28805142D01*
X178562095Y-102052380D02*
X178562095Y-101052380D01*
X178562095Y-101528571D02*
X179133523Y-101528571D01*
X179133523Y-102052380D02*
X179133523Y-101052380D01*
X180133523Y-102052380D02*
X179562095Y-102052380D01*
X179847809Y-102052380D02*
X179847809Y-101052380D01*
X179752571Y-101195238D01*
X179657333Y-101290476D01*
X179562095Y-101338095D01*
X160782095Y-78938380D02*
X160782095Y-77938380D01*
X160782095Y-78414571D02*
X161353523Y-78414571D01*
X161353523Y-78938380D02*
X161353523Y-77938380D01*
X161782095Y-78033619D02*
X161829714Y-77986000D01*
X161924952Y-77938380D01*
X162163047Y-77938380D01*
X162258285Y-77986000D01*
X162305904Y-78033619D01*
X162353523Y-78128857D01*
X162353523Y-78224095D01*
X162305904Y-78366952D01*
X161734476Y-78938380D01*
X162353523Y-78938380D01*
X208788095Y-75636380D02*
X208788095Y-74636380D01*
X208788095Y-75112571D02*
X209359523Y-75112571D01*
X209359523Y-75636380D02*
X209359523Y-74636380D01*
X209740476Y-74636380D02*
X210359523Y-74636380D01*
X210026190Y-75017333D01*
X210169047Y-75017333D01*
X210264285Y-75064952D01*
X210311904Y-75112571D01*
X210359523Y-75207809D01*
X210359523Y-75445904D01*
X210311904Y-75541142D01*
X210264285Y-75588761D01*
X210169047Y-75636380D01*
X209883333Y-75636380D01*
X209788095Y-75588761D01*
X209740476Y-75541142D01*
X159512095Y-74874380D02*
X159512095Y-73874380D01*
X159512095Y-74350571D02*
X160083523Y-74350571D01*
X160083523Y-74874380D02*
X160083523Y-73874380D01*
X160988285Y-74207714D02*
X160988285Y-74874380D01*
X160750190Y-73826761D02*
X160512095Y-74541047D01*
X161131142Y-74541047D01*
X160894666Y-50530380D02*
X160894666Y-51244666D01*
X160847047Y-51387523D01*
X160751809Y-51482761D01*
X160608952Y-51530380D01*
X160513714Y-51530380D01*
X161323238Y-50625619D02*
X161370857Y-50578000D01*
X161466095Y-50530380D01*
X161704190Y-50530380D01*
X161799428Y-50578000D01*
X161847047Y-50625619D01*
X161894666Y-50720857D01*
X161894666Y-50816095D01*
X161847047Y-50958952D01*
X161275619Y-51530380D01*
X161894666Y-51530380D01*
X160894666Y-36306380D02*
X160894666Y-37020666D01*
X160847047Y-37163523D01*
X160751809Y-37258761D01*
X160608952Y-37306380D01*
X160513714Y-37306380D01*
X161275619Y-36306380D02*
X161894666Y-36306380D01*
X161561333Y-36687333D01*
X161704190Y-36687333D01*
X161799428Y-36734952D01*
X161847047Y-36782571D01*
X161894666Y-36877809D01*
X161894666Y-37115904D01*
X161847047Y-37211142D01*
X161799428Y-37258761D01*
X161704190Y-37306380D01*
X161418476Y-37306380D01*
X161323238Y-37258761D01*
X161275619Y-37211142D01*
X208708666Y-32472380D02*
X208708666Y-33186666D01*
X208661047Y-33329523D01*
X208565809Y-33424761D01*
X208422952Y-33472380D01*
X208327714Y-33472380D01*
X209613428Y-32805714D02*
X209613428Y-33472380D01*
X209375333Y-32424761D02*
X209137238Y-33139047D01*
X209756285Y-33139047D01*
X173075666Y-30622380D02*
X173075666Y-31336666D01*
X173028047Y-31479523D01*
X172932809Y-31574761D01*
X172789952Y-31622380D01*
X172694714Y-31622380D01*
X174028047Y-30622380D02*
X173551857Y-30622380D01*
X173504238Y-31098571D01*
X173551857Y-31050952D01*
X173647095Y-31003333D01*
X173885190Y-31003333D01*
X173980428Y-31050952D01*
X174028047Y-31098571D01*
X174075666Y-31193809D01*
X174075666Y-31431904D01*
X174028047Y-31527142D01*
X173980428Y-31574761D01*
X173885190Y-31622380D01*
X173647095Y-31622380D01*
X173551857Y-31574761D01*
X173504238Y-31527142D01*
X203660476Y-70318380D02*
X203660476Y-71032666D01*
X203612857Y-71175523D01*
X203517619Y-71270761D01*
X203374761Y-71318380D01*
X203279523Y-71318380D01*
X204660476Y-71318380D02*
X204089047Y-71318380D01*
X204374761Y-71318380D02*
X204374761Y-70318380D01*
X204279523Y-70461238D01*
X204184285Y-70556476D01*
X204089047Y-70604095D01*
X205279523Y-70318380D02*
X205374761Y-70318380D01*
X205470000Y-70366000D01*
X205517619Y-70413619D01*
X205565238Y-70508857D01*
X205612857Y-70699333D01*
X205612857Y-70937428D01*
X205565238Y-71127904D01*
X205517619Y-71223142D01*
X205470000Y-71270761D01*
X205374761Y-71318380D01*
X205279523Y-71318380D01*
X205184285Y-71270761D01*
X205136666Y-71223142D01*
X205089047Y-71127904D01*
X205041428Y-70937428D01*
X205041428Y-70699333D01*
X205089047Y-70508857D01*
X205136666Y-70413619D01*
X205184285Y-70366000D01*
X205279523Y-70318380D01*
X174402761Y-53125619D02*
X174307523Y-53078000D01*
X174212285Y-52982761D01*
X174069428Y-52839904D01*
X173974190Y-52792285D01*
X173878952Y-52792285D01*
X173926571Y-53030380D02*
X173831333Y-52982761D01*
X173736095Y-52887523D01*
X173688476Y-52697047D01*
X173688476Y-52363714D01*
X173736095Y-52173238D01*
X173831333Y-52078000D01*
X173926571Y-52030380D01*
X174117047Y-52030380D01*
X174212285Y-52078000D01*
X174307523Y-52173238D01*
X174355142Y-52363714D01*
X174355142Y-52697047D01*
X174307523Y-52887523D01*
X174212285Y-52982761D01*
X174117047Y-53030380D01*
X173926571Y-53030380D01*
X175307523Y-53030380D02*
X174736095Y-53030380D01*
X175021809Y-53030380D02*
X175021809Y-52030380D01*
X174926571Y-52173238D01*
X174831333Y-52268476D01*
X174736095Y-52316095D01*
X170210761Y-42563619D02*
X170115523Y-42516000D01*
X170020285Y-42420761D01*
X169877428Y-42277904D01*
X169782190Y-42230285D01*
X169686952Y-42230285D01*
X169734571Y-42468380D02*
X169639333Y-42420761D01*
X169544095Y-42325523D01*
X169496476Y-42135047D01*
X169496476Y-41801714D01*
X169544095Y-41611238D01*
X169639333Y-41516000D01*
X169734571Y-41468380D01*
X169925047Y-41468380D01*
X170020285Y-41516000D01*
X170115523Y-41611238D01*
X170163142Y-41801714D01*
X170163142Y-42135047D01*
X170115523Y-42325523D01*
X170020285Y-42420761D01*
X169925047Y-42468380D01*
X169734571Y-42468380D01*
X170544095Y-41563619D02*
X170591714Y-41516000D01*
X170686952Y-41468380D01*
X170925047Y-41468380D01*
X171020285Y-41516000D01*
X171067904Y-41563619D01*
X171115523Y-41658857D01*
X171115523Y-41754095D01*
X171067904Y-41896952D01*
X170496476Y-42468380D01*
X171115523Y-42468380D01*
X181260761Y-48045619D02*
X181165523Y-47998000D01*
X181070285Y-47902761D01*
X180927428Y-47759904D01*
X180832190Y-47712285D01*
X180736952Y-47712285D01*
X180784571Y-47950380D02*
X180689333Y-47902761D01*
X180594095Y-47807523D01*
X180546476Y-47617047D01*
X180546476Y-47283714D01*
X180594095Y-47093238D01*
X180689333Y-46998000D01*
X180784571Y-46950380D01*
X180975047Y-46950380D01*
X181070285Y-46998000D01*
X181165523Y-47093238D01*
X181213142Y-47283714D01*
X181213142Y-47617047D01*
X181165523Y-47807523D01*
X181070285Y-47902761D01*
X180975047Y-47950380D01*
X180784571Y-47950380D01*
X181546476Y-46950380D02*
X182165523Y-46950380D01*
X181832190Y-47331333D01*
X181975047Y-47331333D01*
X182070285Y-47378952D01*
X182117904Y-47426571D01*
X182165523Y-47521809D01*
X182165523Y-47759904D01*
X182117904Y-47855142D01*
X182070285Y-47902761D01*
X181975047Y-47950380D01*
X181689333Y-47950380D01*
X181594095Y-47902761D01*
X181546476Y-47855142D01*
X165949333Y-30424380D02*
X165616000Y-29948190D01*
X165377904Y-30424380D02*
X165377904Y-29424380D01*
X165758857Y-29424380D01*
X165854095Y-29472000D01*
X165901714Y-29519619D01*
X165949333Y-29614857D01*
X165949333Y-29757714D01*
X165901714Y-29852952D01*
X165854095Y-29900571D01*
X165758857Y-29948190D01*
X165377904Y-29948190D01*
X166901714Y-30424380D02*
X166330285Y-30424380D01*
X166616000Y-30424380D02*
X166616000Y-29424380D01*
X166520761Y-29567238D01*
X166425523Y-29662476D01*
X166330285Y-29710095D01*
X207605333Y-27122380D02*
X207272000Y-26646190D01*
X207033904Y-27122380D02*
X207033904Y-26122380D01*
X207414857Y-26122380D01*
X207510095Y-26170000D01*
X207557714Y-26217619D01*
X207605333Y-26312857D01*
X207605333Y-26455714D01*
X207557714Y-26550952D01*
X207510095Y-26598571D01*
X207414857Y-26646190D01*
X207033904Y-26646190D01*
X207938666Y-26122380D02*
X208557714Y-26122380D01*
X208224380Y-26503333D01*
X208367238Y-26503333D01*
X208462476Y-26550952D01*
X208510095Y-26598571D01*
X208557714Y-26693809D01*
X208557714Y-26931904D01*
X208510095Y-27027142D01*
X208462476Y-27074761D01*
X208367238Y-27122380D01*
X208081523Y-27122380D01*
X207986285Y-27074761D01*
X207938666Y-27027142D01*
X207605333Y-31694380D02*
X207272000Y-31218190D01*
X207033904Y-31694380D02*
X207033904Y-30694380D01*
X207414857Y-30694380D01*
X207510095Y-30742000D01*
X207557714Y-30789619D01*
X207605333Y-30884857D01*
X207605333Y-31027714D01*
X207557714Y-31122952D01*
X207510095Y-31170571D01*
X207414857Y-31218190D01*
X207033904Y-31218190D01*
X208510095Y-30694380D02*
X208033904Y-30694380D01*
X207986285Y-31170571D01*
X208033904Y-31122952D01*
X208129142Y-31075333D01*
X208367238Y-31075333D01*
X208462476Y-31122952D01*
X208510095Y-31170571D01*
X208557714Y-31265809D01*
X208557714Y-31503904D01*
X208510095Y-31599142D01*
X208462476Y-31646761D01*
X208367238Y-31694380D01*
X208129142Y-31694380D01*
X208033904Y-31646761D01*
X207986285Y-31599142D01*
X173234142Y-70462380D02*
X172900809Y-69986190D01*
X172662714Y-70462380D02*
X172662714Y-69462380D01*
X173043666Y-69462380D01*
X173138904Y-69510000D01*
X173186523Y-69557619D01*
X173234142Y-69652857D01*
X173234142Y-69795714D01*
X173186523Y-69890952D01*
X173138904Y-69938571D01*
X173043666Y-69986190D01*
X172662714Y-69986190D01*
X174186523Y-70462380D02*
X173615095Y-70462380D01*
X173900809Y-70462380D02*
X173900809Y-69462380D01*
X173805571Y-69605238D01*
X173710333Y-69700476D01*
X173615095Y-69748095D01*
X175138904Y-70462380D02*
X174567476Y-70462380D01*
X174853190Y-70462380D02*
X174853190Y-69462380D01*
X174757952Y-69605238D01*
X174662714Y-69700476D01*
X174567476Y-69748095D01*
X168634142Y-49126380D02*
X168300809Y-48650190D01*
X168062714Y-49126380D02*
X168062714Y-48126380D01*
X168443666Y-48126380D01*
X168538904Y-48174000D01*
X168586523Y-48221619D01*
X168634142Y-48316857D01*
X168634142Y-48459714D01*
X168586523Y-48554952D01*
X168538904Y-48602571D01*
X168443666Y-48650190D01*
X168062714Y-48650190D01*
X169586523Y-49126380D02*
X169015095Y-49126380D01*
X169300809Y-49126380D02*
X169300809Y-48126380D01*
X169205571Y-48269238D01*
X169110333Y-48364476D01*
X169015095Y-48412095D01*
X169967476Y-48221619D02*
X170015095Y-48174000D01*
X170110333Y-48126380D01*
X170348428Y-48126380D01*
X170443666Y-48174000D01*
X170491285Y-48221619D01*
X170538904Y-48316857D01*
X170538904Y-48412095D01*
X170491285Y-48554952D01*
X169919857Y-49126380D01*
X170538904Y-49126380D01*
X168634142Y-51666380D02*
X168300809Y-51190190D01*
X168062714Y-51666380D02*
X168062714Y-50666380D01*
X168443666Y-50666380D01*
X168538904Y-50714000D01*
X168586523Y-50761619D01*
X168634142Y-50856857D01*
X168634142Y-50999714D01*
X168586523Y-51094952D01*
X168538904Y-51142571D01*
X168443666Y-51190190D01*
X168062714Y-51190190D01*
X169586523Y-51666380D02*
X169015095Y-51666380D01*
X169300809Y-51666380D02*
X169300809Y-50666380D01*
X169205571Y-50809238D01*
X169110333Y-50904476D01*
X169015095Y-50952095D01*
X169919857Y-50666380D02*
X170538904Y-50666380D01*
X170205571Y-51047333D01*
X170348428Y-51047333D01*
X170443666Y-51094952D01*
X170491285Y-51142571D01*
X170538904Y-51237809D01*
X170538904Y-51475904D01*
X170491285Y-51571142D01*
X170443666Y-51618761D01*
X170348428Y-51666380D01*
X170062714Y-51666380D01*
X169967476Y-51618761D01*
X169919857Y-51571142D01*
X167505142Y-65730380D02*
X167171809Y-65254190D01*
X166933714Y-65730380D02*
X166933714Y-64730380D01*
X167314666Y-64730380D01*
X167409904Y-64778000D01*
X167457523Y-64825619D01*
X167505142Y-64920857D01*
X167505142Y-65063714D01*
X167457523Y-65158952D01*
X167409904Y-65206571D01*
X167314666Y-65254190D01*
X166933714Y-65254190D01*
X168457523Y-65730380D02*
X167886095Y-65730380D01*
X168171809Y-65730380D02*
X168171809Y-64730380D01*
X168076571Y-64873238D01*
X167981333Y-64968476D01*
X167886095Y-65016095D01*
X169314666Y-65063714D02*
X169314666Y-65730380D01*
X169076571Y-64682761D02*
X168838476Y-65397047D01*
X169457523Y-65397047D01*
X202416142Y-44300380D02*
X202082809Y-43824190D01*
X201844714Y-44300380D02*
X201844714Y-43300380D01*
X202225666Y-43300380D01*
X202320904Y-43348000D01*
X202368523Y-43395619D01*
X202416142Y-43490857D01*
X202416142Y-43633714D01*
X202368523Y-43728952D01*
X202320904Y-43776571D01*
X202225666Y-43824190D01*
X201844714Y-43824190D01*
X203368523Y-44300380D02*
X202797095Y-44300380D01*
X203082809Y-44300380D02*
X203082809Y-43300380D01*
X202987571Y-43443238D01*
X202892333Y-43538476D01*
X202797095Y-43586095D01*
X204273285Y-43300380D02*
X203797095Y-43300380D01*
X203749476Y-43776571D01*
X203797095Y-43728952D01*
X203892333Y-43681333D01*
X204130428Y-43681333D01*
X204225666Y-43728952D01*
X204273285Y-43776571D01*
X204320904Y-43871809D01*
X204320904Y-44109904D01*
X204273285Y-44205142D01*
X204225666Y-44252761D01*
X204130428Y-44300380D01*
X203892333Y-44300380D01*
X203797095Y-44252761D01*
X203749476Y-44205142D01*
X182237142Y-60904380D02*
X181903809Y-60428190D01*
X181665714Y-60904380D02*
X181665714Y-59904380D01*
X182046666Y-59904380D01*
X182141904Y-59952000D01*
X182189523Y-59999619D01*
X182237142Y-60094857D01*
X182237142Y-60237714D01*
X182189523Y-60332952D01*
X182141904Y-60380571D01*
X182046666Y-60428190D01*
X181665714Y-60428190D01*
X183189523Y-60904380D02*
X182618095Y-60904380D01*
X182903809Y-60904380D02*
X182903809Y-59904380D01*
X182808571Y-60047238D01*
X182713333Y-60142476D01*
X182618095Y-60190095D01*
X184046666Y-59904380D02*
X183856190Y-59904380D01*
X183760952Y-59952000D01*
X183713333Y-59999619D01*
X183618095Y-60142476D01*
X183570476Y-60332952D01*
X183570476Y-60713904D01*
X183618095Y-60809142D01*
X183665714Y-60856761D01*
X183760952Y-60904380D01*
X183951428Y-60904380D01*
X184046666Y-60856761D01*
X184094285Y-60809142D01*
X184141904Y-60713904D01*
X184141904Y-60475809D01*
X184094285Y-60380571D01*
X184046666Y-60332952D01*
X183951428Y-60285333D01*
X183760952Y-60285333D01*
X183665714Y-60332952D01*
X183618095Y-60380571D01*
X183570476Y-60475809D01*
X200096380Y-37980857D02*
X199620190Y-38314190D01*
X200096380Y-38552285D02*
X199096380Y-38552285D01*
X199096380Y-38171333D01*
X199144000Y-38076095D01*
X199191619Y-38028476D01*
X199286857Y-37980857D01*
X199429714Y-37980857D01*
X199524952Y-38028476D01*
X199572571Y-38076095D01*
X199620190Y-38171333D01*
X199620190Y-38552285D01*
X200096380Y-37028476D02*
X200096380Y-37599904D01*
X200096380Y-37314190D02*
X199096380Y-37314190D01*
X199239238Y-37409428D01*
X199334476Y-37504666D01*
X199382095Y-37599904D01*
X199096380Y-36695142D02*
X199096380Y-36028476D01*
X200096380Y-36457047D01*
X206192380Y-36964857D02*
X205716190Y-37298190D01*
X206192380Y-37536285D02*
X205192380Y-37536285D01*
X205192380Y-37155333D01*
X205240000Y-37060095D01*
X205287619Y-37012476D01*
X205382857Y-36964857D01*
X205525714Y-36964857D01*
X205620952Y-37012476D01*
X205668571Y-37060095D01*
X205716190Y-37155333D01*
X205716190Y-37536285D01*
X206192380Y-36012476D02*
X206192380Y-36583904D01*
X206192380Y-36298190D02*
X205192380Y-36298190D01*
X205335238Y-36393428D01*
X205430476Y-36488666D01*
X205478095Y-36583904D01*
X205620952Y-35441047D02*
X205573333Y-35536285D01*
X205525714Y-35583904D01*
X205430476Y-35631523D01*
X205382857Y-35631523D01*
X205287619Y-35583904D01*
X205240000Y-35536285D01*
X205192380Y-35441047D01*
X205192380Y-35250571D01*
X205240000Y-35155333D01*
X205287619Y-35107714D01*
X205382857Y-35060095D01*
X205430476Y-35060095D01*
X205525714Y-35107714D01*
X205573333Y-35155333D01*
X205620952Y-35250571D01*
X205620952Y-35441047D01*
X205668571Y-35536285D01*
X205716190Y-35583904D01*
X205811428Y-35631523D01*
X206001904Y-35631523D01*
X206097142Y-35583904D01*
X206144761Y-35536285D01*
X206192380Y-35441047D01*
X206192380Y-35250571D01*
X206144761Y-35155333D01*
X206097142Y-35107714D01*
X206001904Y-35060095D01*
X205811428Y-35060095D01*
X205716190Y-35107714D01*
X205668571Y-35155333D01*
X205620952Y-35250571D01*
X181221142Y-42616380D02*
X180887809Y-42140190D01*
X180649714Y-42616380D02*
X180649714Y-41616380D01*
X181030666Y-41616380D01*
X181125904Y-41664000D01*
X181173523Y-41711619D01*
X181221142Y-41806857D01*
X181221142Y-41949714D01*
X181173523Y-42044952D01*
X181125904Y-42092571D01*
X181030666Y-42140190D01*
X180649714Y-42140190D01*
X182173523Y-42616380D02*
X181602095Y-42616380D01*
X181887809Y-42616380D02*
X181887809Y-41616380D01*
X181792571Y-41759238D01*
X181697333Y-41854476D01*
X181602095Y-41902095D01*
X182649714Y-42616380D02*
X182840190Y-42616380D01*
X182935428Y-42568761D01*
X182983047Y-42521142D01*
X183078285Y-42378285D01*
X183125904Y-42187809D01*
X183125904Y-41806857D01*
X183078285Y-41711619D01*
X183030666Y-41664000D01*
X182935428Y-41616380D01*
X182744952Y-41616380D01*
X182649714Y-41664000D01*
X182602095Y-41711619D01*
X182554476Y-41806857D01*
X182554476Y-42044952D01*
X182602095Y-42140190D01*
X182649714Y-42187809D01*
X182744952Y-42235428D01*
X182935428Y-42235428D01*
X183030666Y-42187809D01*
X183078285Y-42140190D01*
X183125904Y-42044952D01*
X198826380Y-37980857D02*
X198350190Y-38314190D01*
X198826380Y-38552285D02*
X197826380Y-38552285D01*
X197826380Y-38171333D01*
X197874000Y-38076095D01*
X197921619Y-38028476D01*
X198016857Y-37980857D01*
X198159714Y-37980857D01*
X198254952Y-38028476D01*
X198302571Y-38076095D01*
X198350190Y-38171333D01*
X198350190Y-38552285D01*
X197921619Y-37599904D02*
X197874000Y-37552285D01*
X197826380Y-37457047D01*
X197826380Y-37218952D01*
X197874000Y-37123714D01*
X197921619Y-37076095D01*
X198016857Y-37028476D01*
X198112095Y-37028476D01*
X198254952Y-37076095D01*
X198826380Y-37647523D01*
X198826380Y-37028476D01*
X197826380Y-36409428D02*
X197826380Y-36314190D01*
X197874000Y-36218952D01*
X197921619Y-36171333D01*
X198016857Y-36123714D01*
X198207333Y-36076095D01*
X198445428Y-36076095D01*
X198635904Y-36123714D01*
X198731142Y-36171333D01*
X198778761Y-36218952D01*
X198826380Y-36314190D01*
X198826380Y-36409428D01*
X198778761Y-36504666D01*
X198731142Y-36552285D01*
X198635904Y-36599904D01*
X198445428Y-36647523D01*
X198207333Y-36647523D01*
X198016857Y-36599904D01*
X197921619Y-36552285D01*
X197874000Y-36504666D01*
X197826380Y-36409428D01*
X200096380Y-28582857D02*
X199620190Y-28916190D01*
X200096380Y-29154285D02*
X199096380Y-29154285D01*
X199096380Y-28773333D01*
X199144000Y-28678095D01*
X199191619Y-28630476D01*
X199286857Y-28582857D01*
X199429714Y-28582857D01*
X199524952Y-28630476D01*
X199572571Y-28678095D01*
X199620190Y-28773333D01*
X199620190Y-29154285D01*
X199191619Y-28201904D02*
X199144000Y-28154285D01*
X199096380Y-28059047D01*
X199096380Y-27820952D01*
X199144000Y-27725714D01*
X199191619Y-27678095D01*
X199286857Y-27630476D01*
X199382095Y-27630476D01*
X199524952Y-27678095D01*
X200096380Y-28249523D01*
X200096380Y-27630476D01*
X200096380Y-26678095D02*
X200096380Y-27249523D01*
X200096380Y-26963809D02*
X199096380Y-26963809D01*
X199239238Y-27059047D01*
X199334476Y-27154285D01*
X199382095Y-27249523D01*
X177650380Y-83827857D02*
X177174190Y-84161190D01*
X177650380Y-84399285D02*
X176650380Y-84399285D01*
X176650380Y-84018333D01*
X176698000Y-83923095D01*
X176745619Y-83875476D01*
X176840857Y-83827857D01*
X176983714Y-83827857D01*
X177078952Y-83875476D01*
X177126571Y-83923095D01*
X177174190Y-84018333D01*
X177174190Y-84399285D01*
X176745619Y-83446904D02*
X176698000Y-83399285D01*
X176650380Y-83304047D01*
X176650380Y-83065952D01*
X176698000Y-82970714D01*
X176745619Y-82923095D01*
X176840857Y-82875476D01*
X176936095Y-82875476D01*
X177078952Y-82923095D01*
X177650380Y-83494523D01*
X177650380Y-82875476D01*
X176650380Y-82018333D02*
X176650380Y-82208809D01*
X176698000Y-82304047D01*
X176745619Y-82351666D01*
X176888476Y-82446904D01*
X177078952Y-82494523D01*
X177459904Y-82494523D01*
X177555142Y-82446904D01*
X177602761Y-82399285D01*
X177650380Y-82304047D01*
X177650380Y-82113571D01*
X177602761Y-82018333D01*
X177555142Y-81970714D01*
X177459904Y-81923095D01*
X177221809Y-81923095D01*
X177126571Y-81970714D01*
X177078952Y-82018333D01*
X177031333Y-82113571D01*
X177031333Y-82304047D01*
X177078952Y-82399285D01*
X177126571Y-82446904D01*
X177221809Y-82494523D01*
X179838142Y-83223380D02*
X179504809Y-82747190D01*
X179266714Y-83223380D02*
X179266714Y-82223380D01*
X179647666Y-82223380D01*
X179742904Y-82271000D01*
X179790523Y-82318619D01*
X179838142Y-82413857D01*
X179838142Y-82556714D01*
X179790523Y-82651952D01*
X179742904Y-82699571D01*
X179647666Y-82747190D01*
X179266714Y-82747190D01*
X180219095Y-82318619D02*
X180266714Y-82271000D01*
X180361952Y-82223380D01*
X180600047Y-82223380D01*
X180695285Y-82271000D01*
X180742904Y-82318619D01*
X180790523Y-82413857D01*
X180790523Y-82509095D01*
X180742904Y-82651952D01*
X180171476Y-83223380D01*
X180790523Y-83223380D01*
X181266714Y-83223380D02*
X181457190Y-83223380D01*
X181552428Y-83175761D01*
X181600047Y-83128142D01*
X181695285Y-82985285D01*
X181742904Y-82794809D01*
X181742904Y-82413857D01*
X181695285Y-82318619D01*
X181647666Y-82271000D01*
X181552428Y-82223380D01*
X181361952Y-82223380D01*
X181266714Y-82271000D01*
X181219095Y-82318619D01*
X181171476Y-82413857D01*
X181171476Y-82651952D01*
X181219095Y-82747190D01*
X181266714Y-82794809D01*
X181361952Y-82842428D01*
X181552428Y-82842428D01*
X181647666Y-82794809D01*
X181695285Y-82747190D01*
X181742904Y-82651952D01*
X159956666Y-85748761D02*
X160099523Y-85796380D01*
X160337619Y-85796380D01*
X160432857Y-85748761D01*
X160480476Y-85701142D01*
X160528095Y-85605904D01*
X160528095Y-85510666D01*
X160480476Y-85415428D01*
X160432857Y-85367809D01*
X160337619Y-85320190D01*
X160147142Y-85272571D01*
X160051904Y-85224952D01*
X160004285Y-85177333D01*
X159956666Y-85082095D01*
X159956666Y-84986857D01*
X160004285Y-84891619D01*
X160051904Y-84844000D01*
X160147142Y-84796380D01*
X160385238Y-84796380D01*
X160528095Y-84844000D01*
X160861428Y-84796380D02*
X161099523Y-85796380D01*
X161290000Y-85082095D01*
X161480476Y-85796380D01*
X161718571Y-84796380D01*
X162623333Y-85796380D02*
X162051904Y-85796380D01*
X162337619Y-85796380D02*
X162337619Y-84796380D01*
X162242380Y-84939238D01*
X162147142Y-85034476D01*
X162051904Y-85082095D01*
X165504761Y-82359333D02*
X165552380Y-82216476D01*
X165552380Y-81978380D01*
X165504761Y-81883142D01*
X165457142Y-81835523D01*
X165361904Y-81787904D01*
X165266666Y-81787904D01*
X165171428Y-81835523D01*
X165123809Y-81883142D01*
X165076190Y-81978380D01*
X165028571Y-82168857D01*
X164980952Y-82264095D01*
X164933333Y-82311714D01*
X164838095Y-82359333D01*
X164742857Y-82359333D01*
X164647619Y-82311714D01*
X164600000Y-82264095D01*
X164552380Y-82168857D01*
X164552380Y-81930761D01*
X164600000Y-81787904D01*
X164552380Y-81454571D02*
X165552380Y-81216476D01*
X164838095Y-81026000D01*
X165552380Y-80835523D01*
X164552380Y-80597428D01*
X164647619Y-80264095D02*
X164600000Y-80216476D01*
X164552380Y-80121238D01*
X164552380Y-79883142D01*
X164600000Y-79787904D01*
X164647619Y-79740285D01*
X164742857Y-79692666D01*
X164838095Y-79692666D01*
X164980952Y-79740285D01*
X165552380Y-80311714D01*
X165552380Y-79692666D01*
X175664761Y-99885333D02*
X175712380Y-99742476D01*
X175712380Y-99504380D01*
X175664761Y-99409142D01*
X175617142Y-99361523D01*
X175521904Y-99313904D01*
X175426666Y-99313904D01*
X175331428Y-99361523D01*
X175283809Y-99409142D01*
X175236190Y-99504380D01*
X175188571Y-99694857D01*
X175140952Y-99790095D01*
X175093333Y-99837714D01*
X174998095Y-99885333D01*
X174902857Y-99885333D01*
X174807619Y-99837714D01*
X174760000Y-99790095D01*
X174712380Y-99694857D01*
X174712380Y-99456761D01*
X174760000Y-99313904D01*
X174712380Y-98980571D02*
X175712380Y-98742476D01*
X174998095Y-98552000D01*
X175712380Y-98361523D01*
X174712380Y-98123428D01*
X174712380Y-97837714D02*
X174712380Y-97218666D01*
X175093333Y-97552000D01*
X175093333Y-97409142D01*
X175140952Y-97313904D01*
X175188571Y-97266285D01*
X175283809Y-97218666D01*
X175521904Y-97218666D01*
X175617142Y-97266285D01*
X175664761Y-97313904D01*
X175712380Y-97409142D01*
X175712380Y-97694857D01*
X175664761Y-97790095D01*
X175617142Y-97837714D01*
X183688761Y-91428333D02*
X183736380Y-91285476D01*
X183736380Y-91047380D01*
X183688761Y-90952142D01*
X183641142Y-90904523D01*
X183545904Y-90856904D01*
X183450666Y-90856904D01*
X183355428Y-90904523D01*
X183307809Y-90952142D01*
X183260190Y-91047380D01*
X183212571Y-91237857D01*
X183164952Y-91333095D01*
X183117333Y-91380714D01*
X183022095Y-91428333D01*
X182926857Y-91428333D01*
X182831619Y-91380714D01*
X182784000Y-91333095D01*
X182736380Y-91237857D01*
X182736380Y-90999761D01*
X182784000Y-90856904D01*
X182736380Y-90523571D02*
X183736380Y-90285476D01*
X183022095Y-90095000D01*
X183736380Y-89904523D01*
X182736380Y-89666428D01*
X183069714Y-88856904D02*
X183736380Y-88856904D01*
X182688761Y-89095000D02*
X183403047Y-89333095D01*
X183403047Y-88714047D01*
X168794666Y-85979761D02*
X168937523Y-86027380D01*
X169175619Y-86027380D01*
X169270857Y-85979761D01*
X169318476Y-85932142D01*
X169366095Y-85836904D01*
X169366095Y-85741666D01*
X169318476Y-85646428D01*
X169270857Y-85598809D01*
X169175619Y-85551190D01*
X168985142Y-85503571D01*
X168889904Y-85455952D01*
X168842285Y-85408333D01*
X168794666Y-85313095D01*
X168794666Y-85217857D01*
X168842285Y-85122619D01*
X168889904Y-85075000D01*
X168985142Y-85027380D01*
X169223238Y-85027380D01*
X169366095Y-85075000D01*
X169699428Y-85027380D02*
X169937523Y-86027380D01*
X170128000Y-85313095D01*
X170318476Y-86027380D01*
X170556571Y-85027380D01*
X171413714Y-85027380D02*
X170937523Y-85027380D01*
X170889904Y-85503571D01*
X170937523Y-85455952D01*
X171032761Y-85408333D01*
X171270857Y-85408333D01*
X171366095Y-85455952D01*
X171413714Y-85503571D01*
X171461333Y-85598809D01*
X171461333Y-85836904D01*
X171413714Y-85932142D01*
X171366095Y-85979761D01*
X171270857Y-86027380D01*
X171032761Y-86027380D01*
X170937523Y-85979761D01*
X170889904Y-85932142D01*
X171966095Y-60796380D02*
X172537523Y-60796380D01*
X172251809Y-61796380D02*
X172251809Y-60796380D01*
X172870857Y-61796380D02*
X172870857Y-60796380D01*
X173251809Y-60796380D01*
X173347047Y-60844000D01*
X173394666Y-60891619D01*
X173442285Y-60986857D01*
X173442285Y-61129714D01*
X173394666Y-61224952D01*
X173347047Y-61272571D01*
X173251809Y-61320190D01*
X172870857Y-61320190D01*
X173775619Y-60796380D02*
X174394666Y-60796380D01*
X174061333Y-61177333D01*
X174204190Y-61177333D01*
X174299428Y-61224952D01*
X174347047Y-61272571D01*
X174394666Y-61367809D01*
X174394666Y-61605904D01*
X174347047Y-61701142D01*
X174299428Y-61748761D01*
X174204190Y-61796380D01*
X173918476Y-61796380D01*
X173823238Y-61748761D01*
X173775619Y-61701142D01*
X197620095Y-39714380D02*
X198191523Y-39714380D01*
X197905809Y-40714380D02*
X197905809Y-39714380D01*
X198524857Y-40714380D02*
X198524857Y-39714380D01*
X198905809Y-39714380D01*
X199001047Y-39762000D01*
X199048666Y-39809619D01*
X199096285Y-39904857D01*
X199096285Y-40047714D01*
X199048666Y-40142952D01*
X199001047Y-40190571D01*
X198905809Y-40238190D01*
X198524857Y-40238190D01*
X199953428Y-40047714D02*
X199953428Y-40714380D01*
X199715333Y-39666761D02*
X199477238Y-40381047D01*
X200096285Y-40381047D01*
X199144095Y-63714380D02*
X199715523Y-63714380D01*
X199429809Y-64714380D02*
X199429809Y-63714380D01*
X200048857Y-64714380D02*
X200048857Y-63714380D01*
X200429809Y-63714380D01*
X200525047Y-63762000D01*
X200572666Y-63809619D01*
X200620285Y-63904857D01*
X200620285Y-64047714D01*
X200572666Y-64142952D01*
X200525047Y-64190571D01*
X200429809Y-64238190D01*
X200048857Y-64238190D01*
X201525047Y-63714380D02*
X201048857Y-63714380D01*
X201001238Y-64190571D01*
X201048857Y-64142952D01*
X201144095Y-64095333D01*
X201382190Y-64095333D01*
X201477428Y-64142952D01*
X201525047Y-64190571D01*
X201572666Y-64285809D01*
X201572666Y-64523904D01*
X201525047Y-64619142D01*
X201477428Y-64666761D01*
X201382190Y-64714380D01*
X201144095Y-64714380D01*
X201048857Y-64666761D01*
X201001238Y-64619142D01*
X203462095Y-65492380D02*
X204033523Y-65492380D01*
X203747809Y-66492380D02*
X203747809Y-65492380D01*
X204366857Y-66492380D02*
X204366857Y-65492380D01*
X204747809Y-65492380D01*
X204843047Y-65540000D01*
X204890666Y-65587619D01*
X204938285Y-65682857D01*
X204938285Y-65825714D01*
X204890666Y-65920952D01*
X204843047Y-65968571D01*
X204747809Y-66016190D01*
X204366857Y-66016190D01*
X205795428Y-65492380D02*
X205604952Y-65492380D01*
X205509714Y-65540000D01*
X205462095Y-65587619D01*
X205366857Y-65730476D01*
X205319238Y-65920952D01*
X205319238Y-66301904D01*
X205366857Y-66397142D01*
X205414476Y-66444761D01*
X205509714Y-66492380D01*
X205700190Y-66492380D01*
X205795428Y-66444761D01*
X205843047Y-66397142D01*
X205890666Y-66301904D01*
X205890666Y-66063809D01*
X205843047Y-65968571D01*
X205795428Y-65920952D01*
X205700190Y-65873333D01*
X205509714Y-65873333D01*
X205414476Y-65920952D01*
X205366857Y-65968571D01*
X205319238Y-66063809D01*
X162314095Y-97750380D02*
X162885523Y-97750380D01*
X162599809Y-98750380D02*
X162599809Y-97750380D01*
X163218857Y-98750380D02*
X163218857Y-97750380D01*
X163599809Y-97750380D01*
X163695047Y-97798000D01*
X163742666Y-97845619D01*
X163790285Y-97940857D01*
X163790285Y-98083714D01*
X163742666Y-98178952D01*
X163695047Y-98226571D01*
X163599809Y-98274190D01*
X163218857Y-98274190D01*
X164123619Y-97750380D02*
X164790285Y-97750380D01*
X164361714Y-98750380D01*
X196294476Y-74382380D02*
X196294476Y-75096666D01*
X196246857Y-75239523D01*
X196151619Y-75334761D01*
X196008761Y-75382380D01*
X195913523Y-75382380D01*
X197294476Y-75382380D02*
X196723047Y-75382380D01*
X197008761Y-75382380D02*
X197008761Y-74382380D01*
X196913523Y-74525238D01*
X196818285Y-74620476D01*
X196723047Y-74668095D01*
X198246857Y-75382380D02*
X197675428Y-75382380D01*
X197961142Y-75382380D02*
X197961142Y-74382380D01*
X197865904Y-74525238D01*
X197770666Y-74620476D01*
X197675428Y-74668095D01*
X181308476Y-80986380D02*
X181308476Y-81700666D01*
X181260857Y-81843523D01*
X181165619Y-81938761D01*
X181022761Y-81986380D01*
X180927523Y-81986380D01*
X182308476Y-81986380D02*
X181737047Y-81986380D01*
X182022761Y-81986380D02*
X182022761Y-80986380D01*
X181927523Y-81129238D01*
X181832285Y-81224476D01*
X181737047Y-81272095D01*
X182689428Y-81081619D02*
X182737047Y-81034000D01*
X182832285Y-80986380D01*
X183070380Y-80986380D01*
X183165619Y-81034000D01*
X183213238Y-81081619D01*
X183260857Y-81176857D01*
X183260857Y-81272095D01*
X183213238Y-81414952D01*
X182641809Y-81986380D01*
X183260857Y-81986380D01*
M02*
