G04 #@! TF.GenerationSoftware,KiCad,Pcbnew,5.1.5-52549c5~84~ubuntu18.04.1*
G04 #@! TF.CreationDate,2020-03-06T17:20:02+00:00*
G04 #@! TF.ProjectId,ANMLY_MTR-00,414e4d4c-595f-44d5-9452-2d30302e6b69,rev?*
G04 #@! TF.SameCoordinates,Original*
G04 #@! TF.FileFunction,Paste,Bot*
G04 #@! TF.FilePolarity,Positive*
%FSLAX46Y46*%
G04 Gerber Fmt 4.6, Leading zero omitted, Abs format (unit mm)*
G04 Created by KiCad (PCBNEW 5.1.5-52549c5~84~ubuntu18.04.1) date 2020-03-06 17:20:02*
%MOMM*%
%LPD*%
G04 APERTURE LIST*
%ADD10C,0.100000*%
%ADD11R,0.650000X1.060000*%
%ADD12R,3.800000X2.000000*%
%ADD13R,1.500000X2.000000*%
G04 APERTURE END LIST*
D10*
G36*
X191522779Y-39975144D02*
G01*
X191545834Y-39978563D01*
X191568443Y-39984227D01*
X191590387Y-39992079D01*
X191611457Y-40002044D01*
X191631448Y-40014026D01*
X191650168Y-40027910D01*
X191667438Y-40043562D01*
X191683090Y-40060832D01*
X191696974Y-40079552D01*
X191708956Y-40099543D01*
X191718921Y-40120613D01*
X191726773Y-40142557D01*
X191732437Y-40165166D01*
X191735856Y-40188221D01*
X191737000Y-40211500D01*
X191737000Y-40786500D01*
X191735856Y-40809779D01*
X191732437Y-40832834D01*
X191726773Y-40855443D01*
X191718921Y-40877387D01*
X191708956Y-40898457D01*
X191696974Y-40918448D01*
X191683090Y-40937168D01*
X191667438Y-40954438D01*
X191650168Y-40970090D01*
X191631448Y-40983974D01*
X191611457Y-40995956D01*
X191590387Y-41005921D01*
X191568443Y-41013773D01*
X191545834Y-41019437D01*
X191522779Y-41022856D01*
X191499500Y-41024000D01*
X191024500Y-41024000D01*
X191001221Y-41022856D01*
X190978166Y-41019437D01*
X190955557Y-41013773D01*
X190933613Y-41005921D01*
X190912543Y-40995956D01*
X190892552Y-40983974D01*
X190873832Y-40970090D01*
X190856562Y-40954438D01*
X190840910Y-40937168D01*
X190827026Y-40918448D01*
X190815044Y-40898457D01*
X190805079Y-40877387D01*
X190797227Y-40855443D01*
X190791563Y-40832834D01*
X190788144Y-40809779D01*
X190787000Y-40786500D01*
X190787000Y-40211500D01*
X190788144Y-40188221D01*
X190791563Y-40165166D01*
X190797227Y-40142557D01*
X190805079Y-40120613D01*
X190815044Y-40099543D01*
X190827026Y-40079552D01*
X190840910Y-40060832D01*
X190856562Y-40043562D01*
X190873832Y-40027910D01*
X190892552Y-40014026D01*
X190912543Y-40002044D01*
X190933613Y-39992079D01*
X190955557Y-39984227D01*
X190978166Y-39978563D01*
X191001221Y-39975144D01*
X191024500Y-39974000D01*
X191499500Y-39974000D01*
X191522779Y-39975144D01*
G37*
G36*
X191522779Y-38225144D02*
G01*
X191545834Y-38228563D01*
X191568443Y-38234227D01*
X191590387Y-38242079D01*
X191611457Y-38252044D01*
X191631448Y-38264026D01*
X191650168Y-38277910D01*
X191667438Y-38293562D01*
X191683090Y-38310832D01*
X191696974Y-38329552D01*
X191708956Y-38349543D01*
X191718921Y-38370613D01*
X191726773Y-38392557D01*
X191732437Y-38415166D01*
X191735856Y-38438221D01*
X191737000Y-38461500D01*
X191737000Y-39036500D01*
X191735856Y-39059779D01*
X191732437Y-39082834D01*
X191726773Y-39105443D01*
X191718921Y-39127387D01*
X191708956Y-39148457D01*
X191696974Y-39168448D01*
X191683090Y-39187168D01*
X191667438Y-39204438D01*
X191650168Y-39220090D01*
X191631448Y-39233974D01*
X191611457Y-39245956D01*
X191590387Y-39255921D01*
X191568443Y-39263773D01*
X191545834Y-39269437D01*
X191522779Y-39272856D01*
X191499500Y-39274000D01*
X191024500Y-39274000D01*
X191001221Y-39272856D01*
X190978166Y-39269437D01*
X190955557Y-39263773D01*
X190933613Y-39255921D01*
X190912543Y-39245956D01*
X190892552Y-39233974D01*
X190873832Y-39220090D01*
X190856562Y-39204438D01*
X190840910Y-39187168D01*
X190827026Y-39168448D01*
X190815044Y-39148457D01*
X190805079Y-39127387D01*
X190797227Y-39105443D01*
X190791563Y-39082834D01*
X190788144Y-39059779D01*
X190787000Y-39036500D01*
X190787000Y-38461500D01*
X190788144Y-38438221D01*
X190791563Y-38415166D01*
X190797227Y-38392557D01*
X190805079Y-38370613D01*
X190815044Y-38349543D01*
X190827026Y-38329552D01*
X190840910Y-38310832D01*
X190856562Y-38293562D01*
X190873832Y-38277910D01*
X190892552Y-38264026D01*
X190912543Y-38252044D01*
X190933613Y-38242079D01*
X190955557Y-38234227D01*
X190978166Y-38228563D01*
X191001221Y-38225144D01*
X191024500Y-38224000D01*
X191499500Y-38224000D01*
X191522779Y-38225144D01*
G37*
G36*
X205768779Y-49564144D02*
G01*
X205791834Y-49567563D01*
X205814443Y-49573227D01*
X205836387Y-49581079D01*
X205857457Y-49591044D01*
X205877448Y-49603026D01*
X205896168Y-49616910D01*
X205913438Y-49632562D01*
X205929090Y-49649832D01*
X205942974Y-49668552D01*
X205954956Y-49688543D01*
X205964921Y-49709613D01*
X205972773Y-49731557D01*
X205978437Y-49754166D01*
X205981856Y-49777221D01*
X205983000Y-49800500D01*
X205983000Y-50275500D01*
X205981856Y-50298779D01*
X205978437Y-50321834D01*
X205972773Y-50344443D01*
X205964921Y-50366387D01*
X205954956Y-50387457D01*
X205942974Y-50407448D01*
X205929090Y-50426168D01*
X205913438Y-50443438D01*
X205896168Y-50459090D01*
X205877448Y-50472974D01*
X205857457Y-50484956D01*
X205836387Y-50494921D01*
X205814443Y-50502773D01*
X205791834Y-50508437D01*
X205768779Y-50511856D01*
X205745500Y-50513000D01*
X205170500Y-50513000D01*
X205147221Y-50511856D01*
X205124166Y-50508437D01*
X205101557Y-50502773D01*
X205079613Y-50494921D01*
X205058543Y-50484956D01*
X205038552Y-50472974D01*
X205019832Y-50459090D01*
X205002562Y-50443438D01*
X204986910Y-50426168D01*
X204973026Y-50407448D01*
X204961044Y-50387457D01*
X204951079Y-50366387D01*
X204943227Y-50344443D01*
X204937563Y-50321834D01*
X204934144Y-50298779D01*
X204933000Y-50275500D01*
X204933000Y-49800500D01*
X204934144Y-49777221D01*
X204937563Y-49754166D01*
X204943227Y-49731557D01*
X204951079Y-49709613D01*
X204961044Y-49688543D01*
X204973026Y-49668552D01*
X204986910Y-49649832D01*
X205002562Y-49632562D01*
X205019832Y-49616910D01*
X205038552Y-49603026D01*
X205058543Y-49591044D01*
X205079613Y-49581079D01*
X205101557Y-49573227D01*
X205124166Y-49567563D01*
X205147221Y-49564144D01*
X205170500Y-49563000D01*
X205745500Y-49563000D01*
X205768779Y-49564144D01*
G37*
G36*
X204018779Y-49564144D02*
G01*
X204041834Y-49567563D01*
X204064443Y-49573227D01*
X204086387Y-49581079D01*
X204107457Y-49591044D01*
X204127448Y-49603026D01*
X204146168Y-49616910D01*
X204163438Y-49632562D01*
X204179090Y-49649832D01*
X204192974Y-49668552D01*
X204204956Y-49688543D01*
X204214921Y-49709613D01*
X204222773Y-49731557D01*
X204228437Y-49754166D01*
X204231856Y-49777221D01*
X204233000Y-49800500D01*
X204233000Y-50275500D01*
X204231856Y-50298779D01*
X204228437Y-50321834D01*
X204222773Y-50344443D01*
X204214921Y-50366387D01*
X204204956Y-50387457D01*
X204192974Y-50407448D01*
X204179090Y-50426168D01*
X204163438Y-50443438D01*
X204146168Y-50459090D01*
X204127448Y-50472974D01*
X204107457Y-50484956D01*
X204086387Y-50494921D01*
X204064443Y-50502773D01*
X204041834Y-50508437D01*
X204018779Y-50511856D01*
X203995500Y-50513000D01*
X203420500Y-50513000D01*
X203397221Y-50511856D01*
X203374166Y-50508437D01*
X203351557Y-50502773D01*
X203329613Y-50494921D01*
X203308543Y-50484956D01*
X203288552Y-50472974D01*
X203269832Y-50459090D01*
X203252562Y-50443438D01*
X203236910Y-50426168D01*
X203223026Y-50407448D01*
X203211044Y-50387457D01*
X203201079Y-50366387D01*
X203193227Y-50344443D01*
X203187563Y-50321834D01*
X203184144Y-50298779D01*
X203183000Y-50275500D01*
X203183000Y-49800500D01*
X203184144Y-49777221D01*
X203187563Y-49754166D01*
X203193227Y-49731557D01*
X203201079Y-49709613D01*
X203211044Y-49688543D01*
X203223026Y-49668552D01*
X203236910Y-49649832D01*
X203252562Y-49632562D01*
X203269832Y-49616910D01*
X203288552Y-49603026D01*
X203308543Y-49591044D01*
X203329613Y-49581079D01*
X203351557Y-49573227D01*
X203374166Y-49567563D01*
X203397221Y-49564144D01*
X203420500Y-49563000D01*
X203995500Y-49563000D01*
X204018779Y-49564144D01*
G37*
G36*
X167900779Y-42684144D02*
G01*
X167923834Y-42687563D01*
X167946443Y-42693227D01*
X167968387Y-42701079D01*
X167989457Y-42711044D01*
X168009448Y-42723026D01*
X168028168Y-42736910D01*
X168045438Y-42752562D01*
X168061090Y-42769832D01*
X168074974Y-42788552D01*
X168086956Y-42808543D01*
X168096921Y-42829613D01*
X168104773Y-42851557D01*
X168110437Y-42874166D01*
X168113856Y-42897221D01*
X168115000Y-42920500D01*
X168115000Y-43495500D01*
X168113856Y-43518779D01*
X168110437Y-43541834D01*
X168104773Y-43564443D01*
X168096921Y-43586387D01*
X168086956Y-43607457D01*
X168074974Y-43627448D01*
X168061090Y-43646168D01*
X168045438Y-43663438D01*
X168028168Y-43679090D01*
X168009448Y-43692974D01*
X167989457Y-43704956D01*
X167968387Y-43714921D01*
X167946443Y-43722773D01*
X167923834Y-43728437D01*
X167900779Y-43731856D01*
X167877500Y-43733000D01*
X167402500Y-43733000D01*
X167379221Y-43731856D01*
X167356166Y-43728437D01*
X167333557Y-43722773D01*
X167311613Y-43714921D01*
X167290543Y-43704956D01*
X167270552Y-43692974D01*
X167251832Y-43679090D01*
X167234562Y-43663438D01*
X167218910Y-43646168D01*
X167205026Y-43627448D01*
X167193044Y-43607457D01*
X167183079Y-43586387D01*
X167175227Y-43564443D01*
X167169563Y-43541834D01*
X167166144Y-43518779D01*
X167165000Y-43495500D01*
X167165000Y-42920500D01*
X167166144Y-42897221D01*
X167169563Y-42874166D01*
X167175227Y-42851557D01*
X167183079Y-42829613D01*
X167193044Y-42808543D01*
X167205026Y-42788552D01*
X167218910Y-42769832D01*
X167234562Y-42752562D01*
X167251832Y-42736910D01*
X167270552Y-42723026D01*
X167290543Y-42711044D01*
X167311613Y-42701079D01*
X167333557Y-42693227D01*
X167356166Y-42687563D01*
X167379221Y-42684144D01*
X167402500Y-42683000D01*
X167877500Y-42683000D01*
X167900779Y-42684144D01*
G37*
G36*
X167900779Y-44434144D02*
G01*
X167923834Y-44437563D01*
X167946443Y-44443227D01*
X167968387Y-44451079D01*
X167989457Y-44461044D01*
X168009448Y-44473026D01*
X168028168Y-44486910D01*
X168045438Y-44502562D01*
X168061090Y-44519832D01*
X168074974Y-44538552D01*
X168086956Y-44558543D01*
X168096921Y-44579613D01*
X168104773Y-44601557D01*
X168110437Y-44624166D01*
X168113856Y-44647221D01*
X168115000Y-44670500D01*
X168115000Y-45245500D01*
X168113856Y-45268779D01*
X168110437Y-45291834D01*
X168104773Y-45314443D01*
X168096921Y-45336387D01*
X168086956Y-45357457D01*
X168074974Y-45377448D01*
X168061090Y-45396168D01*
X168045438Y-45413438D01*
X168028168Y-45429090D01*
X168009448Y-45442974D01*
X167989457Y-45454956D01*
X167968387Y-45464921D01*
X167946443Y-45472773D01*
X167923834Y-45478437D01*
X167900779Y-45481856D01*
X167877500Y-45483000D01*
X167402500Y-45483000D01*
X167379221Y-45481856D01*
X167356166Y-45478437D01*
X167333557Y-45472773D01*
X167311613Y-45464921D01*
X167290543Y-45454956D01*
X167270552Y-45442974D01*
X167251832Y-45429090D01*
X167234562Y-45413438D01*
X167218910Y-45396168D01*
X167205026Y-45377448D01*
X167193044Y-45357457D01*
X167183079Y-45336387D01*
X167175227Y-45314443D01*
X167169563Y-45291834D01*
X167166144Y-45268779D01*
X167165000Y-45245500D01*
X167165000Y-44670500D01*
X167166144Y-44647221D01*
X167169563Y-44624166D01*
X167175227Y-44601557D01*
X167183079Y-44579613D01*
X167193044Y-44558543D01*
X167205026Y-44538552D01*
X167218910Y-44519832D01*
X167234562Y-44502562D01*
X167251832Y-44486910D01*
X167270552Y-44473026D01*
X167290543Y-44461044D01*
X167311613Y-44451079D01*
X167333557Y-44443227D01*
X167356166Y-44437563D01*
X167379221Y-44434144D01*
X167402500Y-44433000D01*
X167877500Y-44433000D01*
X167900779Y-44434144D01*
G37*
G36*
X163836779Y-41668144D02*
G01*
X163859834Y-41671563D01*
X163882443Y-41677227D01*
X163904387Y-41685079D01*
X163925457Y-41695044D01*
X163945448Y-41707026D01*
X163964168Y-41720910D01*
X163981438Y-41736562D01*
X163997090Y-41753832D01*
X164010974Y-41772552D01*
X164022956Y-41792543D01*
X164032921Y-41813613D01*
X164040773Y-41835557D01*
X164046437Y-41858166D01*
X164049856Y-41881221D01*
X164051000Y-41904500D01*
X164051000Y-42479500D01*
X164049856Y-42502779D01*
X164046437Y-42525834D01*
X164040773Y-42548443D01*
X164032921Y-42570387D01*
X164022956Y-42591457D01*
X164010974Y-42611448D01*
X163997090Y-42630168D01*
X163981438Y-42647438D01*
X163964168Y-42663090D01*
X163945448Y-42676974D01*
X163925457Y-42688956D01*
X163904387Y-42698921D01*
X163882443Y-42706773D01*
X163859834Y-42712437D01*
X163836779Y-42715856D01*
X163813500Y-42717000D01*
X163338500Y-42717000D01*
X163315221Y-42715856D01*
X163292166Y-42712437D01*
X163269557Y-42706773D01*
X163247613Y-42698921D01*
X163226543Y-42688956D01*
X163206552Y-42676974D01*
X163187832Y-42663090D01*
X163170562Y-42647438D01*
X163154910Y-42630168D01*
X163141026Y-42611448D01*
X163129044Y-42591457D01*
X163119079Y-42570387D01*
X163111227Y-42548443D01*
X163105563Y-42525834D01*
X163102144Y-42502779D01*
X163101000Y-42479500D01*
X163101000Y-41904500D01*
X163102144Y-41881221D01*
X163105563Y-41858166D01*
X163111227Y-41835557D01*
X163119079Y-41813613D01*
X163129044Y-41792543D01*
X163141026Y-41772552D01*
X163154910Y-41753832D01*
X163170562Y-41736562D01*
X163187832Y-41720910D01*
X163206552Y-41707026D01*
X163226543Y-41695044D01*
X163247613Y-41685079D01*
X163269557Y-41677227D01*
X163292166Y-41671563D01*
X163315221Y-41668144D01*
X163338500Y-41667000D01*
X163813500Y-41667000D01*
X163836779Y-41668144D01*
G37*
G36*
X163836779Y-43418144D02*
G01*
X163859834Y-43421563D01*
X163882443Y-43427227D01*
X163904387Y-43435079D01*
X163925457Y-43445044D01*
X163945448Y-43457026D01*
X163964168Y-43470910D01*
X163981438Y-43486562D01*
X163997090Y-43503832D01*
X164010974Y-43522552D01*
X164022956Y-43542543D01*
X164032921Y-43563613D01*
X164040773Y-43585557D01*
X164046437Y-43608166D01*
X164049856Y-43631221D01*
X164051000Y-43654500D01*
X164051000Y-44229500D01*
X164049856Y-44252779D01*
X164046437Y-44275834D01*
X164040773Y-44298443D01*
X164032921Y-44320387D01*
X164022956Y-44341457D01*
X164010974Y-44361448D01*
X163997090Y-44380168D01*
X163981438Y-44397438D01*
X163964168Y-44413090D01*
X163945448Y-44426974D01*
X163925457Y-44438956D01*
X163904387Y-44448921D01*
X163882443Y-44456773D01*
X163859834Y-44462437D01*
X163836779Y-44465856D01*
X163813500Y-44467000D01*
X163338500Y-44467000D01*
X163315221Y-44465856D01*
X163292166Y-44462437D01*
X163269557Y-44456773D01*
X163247613Y-44448921D01*
X163226543Y-44438956D01*
X163206552Y-44426974D01*
X163187832Y-44413090D01*
X163170562Y-44397438D01*
X163154910Y-44380168D01*
X163141026Y-44361448D01*
X163129044Y-44341457D01*
X163119079Y-44320387D01*
X163111227Y-44298443D01*
X163105563Y-44275834D01*
X163102144Y-44252779D01*
X163101000Y-44229500D01*
X163101000Y-43654500D01*
X163102144Y-43631221D01*
X163105563Y-43608166D01*
X163111227Y-43585557D01*
X163119079Y-43563613D01*
X163129044Y-43542543D01*
X163141026Y-43522552D01*
X163154910Y-43503832D01*
X163170562Y-43486562D01*
X163187832Y-43470910D01*
X163206552Y-43457026D01*
X163226543Y-43445044D01*
X163247613Y-43435079D01*
X163269557Y-43427227D01*
X163292166Y-43421563D01*
X163315221Y-43418144D01*
X163338500Y-43417000D01*
X163813500Y-43417000D01*
X163836779Y-43418144D01*
G37*
G36*
X171788779Y-64804144D02*
G01*
X171811834Y-64807563D01*
X171834443Y-64813227D01*
X171856387Y-64821079D01*
X171877457Y-64831044D01*
X171897448Y-64843026D01*
X171916168Y-64856910D01*
X171933438Y-64872562D01*
X171949090Y-64889832D01*
X171962974Y-64908552D01*
X171974956Y-64928543D01*
X171984921Y-64949613D01*
X171992773Y-64971557D01*
X171998437Y-64994166D01*
X172001856Y-65017221D01*
X172003000Y-65040500D01*
X172003000Y-65515500D01*
X172001856Y-65538779D01*
X171998437Y-65561834D01*
X171992773Y-65584443D01*
X171984921Y-65606387D01*
X171974956Y-65627457D01*
X171962974Y-65647448D01*
X171949090Y-65666168D01*
X171933438Y-65683438D01*
X171916168Y-65699090D01*
X171897448Y-65712974D01*
X171877457Y-65724956D01*
X171856387Y-65734921D01*
X171834443Y-65742773D01*
X171811834Y-65748437D01*
X171788779Y-65751856D01*
X171765500Y-65753000D01*
X171190500Y-65753000D01*
X171167221Y-65751856D01*
X171144166Y-65748437D01*
X171121557Y-65742773D01*
X171099613Y-65734921D01*
X171078543Y-65724956D01*
X171058552Y-65712974D01*
X171039832Y-65699090D01*
X171022562Y-65683438D01*
X171006910Y-65666168D01*
X170993026Y-65647448D01*
X170981044Y-65627457D01*
X170971079Y-65606387D01*
X170963227Y-65584443D01*
X170957563Y-65561834D01*
X170954144Y-65538779D01*
X170953000Y-65515500D01*
X170953000Y-65040500D01*
X170954144Y-65017221D01*
X170957563Y-64994166D01*
X170963227Y-64971557D01*
X170971079Y-64949613D01*
X170981044Y-64928543D01*
X170993026Y-64908552D01*
X171006910Y-64889832D01*
X171022562Y-64872562D01*
X171039832Y-64856910D01*
X171058552Y-64843026D01*
X171078543Y-64831044D01*
X171099613Y-64821079D01*
X171121557Y-64813227D01*
X171144166Y-64807563D01*
X171167221Y-64804144D01*
X171190500Y-64803000D01*
X171765500Y-64803000D01*
X171788779Y-64804144D01*
G37*
G36*
X173538779Y-64804144D02*
G01*
X173561834Y-64807563D01*
X173584443Y-64813227D01*
X173606387Y-64821079D01*
X173627457Y-64831044D01*
X173647448Y-64843026D01*
X173666168Y-64856910D01*
X173683438Y-64872562D01*
X173699090Y-64889832D01*
X173712974Y-64908552D01*
X173724956Y-64928543D01*
X173734921Y-64949613D01*
X173742773Y-64971557D01*
X173748437Y-64994166D01*
X173751856Y-65017221D01*
X173753000Y-65040500D01*
X173753000Y-65515500D01*
X173751856Y-65538779D01*
X173748437Y-65561834D01*
X173742773Y-65584443D01*
X173734921Y-65606387D01*
X173724956Y-65627457D01*
X173712974Y-65647448D01*
X173699090Y-65666168D01*
X173683438Y-65683438D01*
X173666168Y-65699090D01*
X173647448Y-65712974D01*
X173627457Y-65724956D01*
X173606387Y-65734921D01*
X173584443Y-65742773D01*
X173561834Y-65748437D01*
X173538779Y-65751856D01*
X173515500Y-65753000D01*
X172940500Y-65753000D01*
X172917221Y-65751856D01*
X172894166Y-65748437D01*
X172871557Y-65742773D01*
X172849613Y-65734921D01*
X172828543Y-65724956D01*
X172808552Y-65712974D01*
X172789832Y-65699090D01*
X172772562Y-65683438D01*
X172756910Y-65666168D01*
X172743026Y-65647448D01*
X172731044Y-65627457D01*
X172721079Y-65606387D01*
X172713227Y-65584443D01*
X172707563Y-65561834D01*
X172704144Y-65538779D01*
X172703000Y-65515500D01*
X172703000Y-65040500D01*
X172704144Y-65017221D01*
X172707563Y-64994166D01*
X172713227Y-64971557D01*
X172721079Y-64949613D01*
X172731044Y-64928543D01*
X172743026Y-64908552D01*
X172756910Y-64889832D01*
X172772562Y-64872562D01*
X172789832Y-64856910D01*
X172808552Y-64843026D01*
X172828543Y-64831044D01*
X172849613Y-64821079D01*
X172871557Y-64813227D01*
X172894166Y-64807563D01*
X172917221Y-64804144D01*
X172940500Y-64803000D01*
X173515500Y-64803000D01*
X173538779Y-64804144D01*
G37*
G36*
X175965779Y-64804144D02*
G01*
X175988834Y-64807563D01*
X176011443Y-64813227D01*
X176033387Y-64821079D01*
X176054457Y-64831044D01*
X176074448Y-64843026D01*
X176093168Y-64856910D01*
X176110438Y-64872562D01*
X176126090Y-64889832D01*
X176139974Y-64908552D01*
X176151956Y-64928543D01*
X176161921Y-64949613D01*
X176169773Y-64971557D01*
X176175437Y-64994166D01*
X176178856Y-65017221D01*
X176180000Y-65040500D01*
X176180000Y-65515500D01*
X176178856Y-65538779D01*
X176175437Y-65561834D01*
X176169773Y-65584443D01*
X176161921Y-65606387D01*
X176151956Y-65627457D01*
X176139974Y-65647448D01*
X176126090Y-65666168D01*
X176110438Y-65683438D01*
X176093168Y-65699090D01*
X176074448Y-65712974D01*
X176054457Y-65724956D01*
X176033387Y-65734921D01*
X176011443Y-65742773D01*
X175988834Y-65748437D01*
X175965779Y-65751856D01*
X175942500Y-65753000D01*
X175367500Y-65753000D01*
X175344221Y-65751856D01*
X175321166Y-65748437D01*
X175298557Y-65742773D01*
X175276613Y-65734921D01*
X175255543Y-65724956D01*
X175235552Y-65712974D01*
X175216832Y-65699090D01*
X175199562Y-65683438D01*
X175183910Y-65666168D01*
X175170026Y-65647448D01*
X175158044Y-65627457D01*
X175148079Y-65606387D01*
X175140227Y-65584443D01*
X175134563Y-65561834D01*
X175131144Y-65538779D01*
X175130000Y-65515500D01*
X175130000Y-65040500D01*
X175131144Y-65017221D01*
X175134563Y-64994166D01*
X175140227Y-64971557D01*
X175148079Y-64949613D01*
X175158044Y-64928543D01*
X175170026Y-64908552D01*
X175183910Y-64889832D01*
X175199562Y-64872562D01*
X175216832Y-64856910D01*
X175235552Y-64843026D01*
X175255543Y-64831044D01*
X175276613Y-64821079D01*
X175298557Y-64813227D01*
X175321166Y-64807563D01*
X175344221Y-64804144D01*
X175367500Y-64803000D01*
X175942500Y-64803000D01*
X175965779Y-64804144D01*
G37*
G36*
X177715779Y-64804144D02*
G01*
X177738834Y-64807563D01*
X177761443Y-64813227D01*
X177783387Y-64821079D01*
X177804457Y-64831044D01*
X177824448Y-64843026D01*
X177843168Y-64856910D01*
X177860438Y-64872562D01*
X177876090Y-64889832D01*
X177889974Y-64908552D01*
X177901956Y-64928543D01*
X177911921Y-64949613D01*
X177919773Y-64971557D01*
X177925437Y-64994166D01*
X177928856Y-65017221D01*
X177930000Y-65040500D01*
X177930000Y-65515500D01*
X177928856Y-65538779D01*
X177925437Y-65561834D01*
X177919773Y-65584443D01*
X177911921Y-65606387D01*
X177901956Y-65627457D01*
X177889974Y-65647448D01*
X177876090Y-65666168D01*
X177860438Y-65683438D01*
X177843168Y-65699090D01*
X177824448Y-65712974D01*
X177804457Y-65724956D01*
X177783387Y-65734921D01*
X177761443Y-65742773D01*
X177738834Y-65748437D01*
X177715779Y-65751856D01*
X177692500Y-65753000D01*
X177117500Y-65753000D01*
X177094221Y-65751856D01*
X177071166Y-65748437D01*
X177048557Y-65742773D01*
X177026613Y-65734921D01*
X177005543Y-65724956D01*
X176985552Y-65712974D01*
X176966832Y-65699090D01*
X176949562Y-65683438D01*
X176933910Y-65666168D01*
X176920026Y-65647448D01*
X176908044Y-65627457D01*
X176898079Y-65606387D01*
X176890227Y-65584443D01*
X176884563Y-65561834D01*
X176881144Y-65538779D01*
X176880000Y-65515500D01*
X176880000Y-65040500D01*
X176881144Y-65017221D01*
X176884563Y-64994166D01*
X176890227Y-64971557D01*
X176898079Y-64949613D01*
X176908044Y-64928543D01*
X176920026Y-64908552D01*
X176933910Y-64889832D01*
X176949562Y-64872562D01*
X176966832Y-64856910D01*
X176985552Y-64843026D01*
X177005543Y-64831044D01*
X177026613Y-64821079D01*
X177048557Y-64813227D01*
X177071166Y-64807563D01*
X177094221Y-64804144D01*
X177117500Y-64803000D01*
X177692500Y-64803000D01*
X177715779Y-64804144D01*
G37*
G36*
X182847505Y-64731204D02*
G01*
X182871773Y-64734804D01*
X182895572Y-64740765D01*
X182918671Y-64749030D01*
X182940850Y-64759520D01*
X182961893Y-64772132D01*
X182981599Y-64786747D01*
X182999777Y-64803223D01*
X183016253Y-64821401D01*
X183030868Y-64841107D01*
X183043480Y-64862150D01*
X183053970Y-64884329D01*
X183062235Y-64907428D01*
X183068196Y-64931227D01*
X183071796Y-64955495D01*
X183073000Y-64979999D01*
X183073000Y-65830001D01*
X183071796Y-65854505D01*
X183068196Y-65878773D01*
X183062235Y-65902572D01*
X183053970Y-65925671D01*
X183043480Y-65947850D01*
X183030868Y-65968893D01*
X183016253Y-65988599D01*
X182999777Y-66006777D01*
X182981599Y-66023253D01*
X182961893Y-66037868D01*
X182940850Y-66050480D01*
X182918671Y-66060970D01*
X182895572Y-66069235D01*
X182871773Y-66075196D01*
X182847505Y-66078796D01*
X182823001Y-66080000D01*
X181747999Y-66080000D01*
X181723495Y-66078796D01*
X181699227Y-66075196D01*
X181675428Y-66069235D01*
X181652329Y-66060970D01*
X181630150Y-66050480D01*
X181609107Y-66037868D01*
X181589401Y-66023253D01*
X181571223Y-66006777D01*
X181554747Y-65988599D01*
X181540132Y-65968893D01*
X181527520Y-65947850D01*
X181517030Y-65925671D01*
X181508765Y-65902572D01*
X181502804Y-65878773D01*
X181499204Y-65854505D01*
X181498000Y-65830001D01*
X181498000Y-64979999D01*
X181499204Y-64955495D01*
X181502804Y-64931227D01*
X181508765Y-64907428D01*
X181517030Y-64884329D01*
X181527520Y-64862150D01*
X181540132Y-64841107D01*
X181554747Y-64821401D01*
X181571223Y-64803223D01*
X181589401Y-64786747D01*
X181609107Y-64772132D01*
X181630150Y-64759520D01*
X181652329Y-64749030D01*
X181675428Y-64740765D01*
X181699227Y-64734804D01*
X181723495Y-64731204D01*
X181747999Y-64730000D01*
X182823001Y-64730000D01*
X182847505Y-64731204D01*
G37*
G36*
X179972505Y-64731204D02*
G01*
X179996773Y-64734804D01*
X180020572Y-64740765D01*
X180043671Y-64749030D01*
X180065850Y-64759520D01*
X180086893Y-64772132D01*
X180106599Y-64786747D01*
X180124777Y-64803223D01*
X180141253Y-64821401D01*
X180155868Y-64841107D01*
X180168480Y-64862150D01*
X180178970Y-64884329D01*
X180187235Y-64907428D01*
X180193196Y-64931227D01*
X180196796Y-64955495D01*
X180198000Y-64979999D01*
X180198000Y-65830001D01*
X180196796Y-65854505D01*
X180193196Y-65878773D01*
X180187235Y-65902572D01*
X180178970Y-65925671D01*
X180168480Y-65947850D01*
X180155868Y-65968893D01*
X180141253Y-65988599D01*
X180124777Y-66006777D01*
X180106599Y-66023253D01*
X180086893Y-66037868D01*
X180065850Y-66050480D01*
X180043671Y-66060970D01*
X180020572Y-66069235D01*
X179996773Y-66075196D01*
X179972505Y-66078796D01*
X179948001Y-66080000D01*
X178872999Y-66080000D01*
X178848495Y-66078796D01*
X178824227Y-66075196D01*
X178800428Y-66069235D01*
X178777329Y-66060970D01*
X178755150Y-66050480D01*
X178734107Y-66037868D01*
X178714401Y-66023253D01*
X178696223Y-66006777D01*
X178679747Y-65988599D01*
X178665132Y-65968893D01*
X178652520Y-65947850D01*
X178642030Y-65925671D01*
X178633765Y-65902572D01*
X178627804Y-65878773D01*
X178624204Y-65854505D01*
X178623000Y-65830001D01*
X178623000Y-64979999D01*
X178624204Y-64955495D01*
X178627804Y-64931227D01*
X178633765Y-64907428D01*
X178642030Y-64884329D01*
X178652520Y-64862150D01*
X178665132Y-64841107D01*
X178679747Y-64821401D01*
X178696223Y-64803223D01*
X178714401Y-64786747D01*
X178734107Y-64772132D01*
X178755150Y-64759520D01*
X178777329Y-64749030D01*
X178800428Y-64740765D01*
X178824227Y-64734804D01*
X178848495Y-64731204D01*
X178872999Y-64730000D01*
X179948001Y-64730000D01*
X179972505Y-64731204D01*
G37*
G36*
X200970779Y-46262144D02*
G01*
X200993834Y-46265563D01*
X201016443Y-46271227D01*
X201038387Y-46279079D01*
X201059457Y-46289044D01*
X201079448Y-46301026D01*
X201098168Y-46314910D01*
X201115438Y-46330562D01*
X201131090Y-46347832D01*
X201144974Y-46366552D01*
X201156956Y-46386543D01*
X201166921Y-46407613D01*
X201174773Y-46429557D01*
X201180437Y-46452166D01*
X201183856Y-46475221D01*
X201185000Y-46498500D01*
X201185000Y-46973500D01*
X201183856Y-46996779D01*
X201180437Y-47019834D01*
X201174773Y-47042443D01*
X201166921Y-47064387D01*
X201156956Y-47085457D01*
X201144974Y-47105448D01*
X201131090Y-47124168D01*
X201115438Y-47141438D01*
X201098168Y-47157090D01*
X201079448Y-47170974D01*
X201059457Y-47182956D01*
X201038387Y-47192921D01*
X201016443Y-47200773D01*
X200993834Y-47206437D01*
X200970779Y-47209856D01*
X200947500Y-47211000D01*
X200372500Y-47211000D01*
X200349221Y-47209856D01*
X200326166Y-47206437D01*
X200303557Y-47200773D01*
X200281613Y-47192921D01*
X200260543Y-47182956D01*
X200240552Y-47170974D01*
X200221832Y-47157090D01*
X200204562Y-47141438D01*
X200188910Y-47124168D01*
X200175026Y-47105448D01*
X200163044Y-47085457D01*
X200153079Y-47064387D01*
X200145227Y-47042443D01*
X200139563Y-47019834D01*
X200136144Y-46996779D01*
X200135000Y-46973500D01*
X200135000Y-46498500D01*
X200136144Y-46475221D01*
X200139563Y-46452166D01*
X200145227Y-46429557D01*
X200153079Y-46407613D01*
X200163044Y-46386543D01*
X200175026Y-46366552D01*
X200188910Y-46347832D01*
X200204562Y-46330562D01*
X200221832Y-46314910D01*
X200240552Y-46301026D01*
X200260543Y-46289044D01*
X200281613Y-46279079D01*
X200303557Y-46271227D01*
X200326166Y-46265563D01*
X200349221Y-46262144D01*
X200372500Y-46261000D01*
X200947500Y-46261000D01*
X200970779Y-46262144D01*
G37*
G36*
X202720779Y-46262144D02*
G01*
X202743834Y-46265563D01*
X202766443Y-46271227D01*
X202788387Y-46279079D01*
X202809457Y-46289044D01*
X202829448Y-46301026D01*
X202848168Y-46314910D01*
X202865438Y-46330562D01*
X202881090Y-46347832D01*
X202894974Y-46366552D01*
X202906956Y-46386543D01*
X202916921Y-46407613D01*
X202924773Y-46429557D01*
X202930437Y-46452166D01*
X202933856Y-46475221D01*
X202935000Y-46498500D01*
X202935000Y-46973500D01*
X202933856Y-46996779D01*
X202930437Y-47019834D01*
X202924773Y-47042443D01*
X202916921Y-47064387D01*
X202906956Y-47085457D01*
X202894974Y-47105448D01*
X202881090Y-47124168D01*
X202865438Y-47141438D01*
X202848168Y-47157090D01*
X202829448Y-47170974D01*
X202809457Y-47182956D01*
X202788387Y-47192921D01*
X202766443Y-47200773D01*
X202743834Y-47206437D01*
X202720779Y-47209856D01*
X202697500Y-47211000D01*
X202122500Y-47211000D01*
X202099221Y-47209856D01*
X202076166Y-47206437D01*
X202053557Y-47200773D01*
X202031613Y-47192921D01*
X202010543Y-47182956D01*
X201990552Y-47170974D01*
X201971832Y-47157090D01*
X201954562Y-47141438D01*
X201938910Y-47124168D01*
X201925026Y-47105448D01*
X201913044Y-47085457D01*
X201903079Y-47064387D01*
X201895227Y-47042443D01*
X201889563Y-47019834D01*
X201886144Y-46996779D01*
X201885000Y-46973500D01*
X201885000Y-46498500D01*
X201886144Y-46475221D01*
X201889563Y-46452166D01*
X201895227Y-46429557D01*
X201903079Y-46407613D01*
X201913044Y-46386543D01*
X201925026Y-46366552D01*
X201938910Y-46347832D01*
X201954562Y-46330562D01*
X201971832Y-46314910D01*
X201990552Y-46301026D01*
X202010543Y-46289044D01*
X202031613Y-46279079D01*
X202053557Y-46271227D01*
X202076166Y-46265563D01*
X202099221Y-46262144D01*
X202122500Y-46261000D01*
X202697500Y-46261000D01*
X202720779Y-46262144D01*
G37*
G36*
X170096504Y-67135204D02*
G01*
X170120773Y-67138804D01*
X170144571Y-67144765D01*
X170167671Y-67153030D01*
X170189849Y-67163520D01*
X170210893Y-67176133D01*
X170230598Y-67190747D01*
X170248777Y-67207223D01*
X170265253Y-67225402D01*
X170279867Y-67245107D01*
X170292480Y-67266151D01*
X170302970Y-67288329D01*
X170311235Y-67311429D01*
X170317196Y-67335227D01*
X170320796Y-67359496D01*
X170322000Y-67384000D01*
X170322000Y-70284000D01*
X170320796Y-70308504D01*
X170317196Y-70332773D01*
X170311235Y-70356571D01*
X170302970Y-70379671D01*
X170292480Y-70401849D01*
X170279867Y-70422893D01*
X170265253Y-70442598D01*
X170248777Y-70460777D01*
X170230598Y-70477253D01*
X170210893Y-70491867D01*
X170189849Y-70504480D01*
X170167671Y-70514970D01*
X170144571Y-70523235D01*
X170120773Y-70529196D01*
X170096504Y-70532796D01*
X170072000Y-70534000D01*
X169272000Y-70534000D01*
X169247496Y-70532796D01*
X169223227Y-70529196D01*
X169199429Y-70523235D01*
X169176329Y-70514970D01*
X169154151Y-70504480D01*
X169133107Y-70491867D01*
X169113402Y-70477253D01*
X169095223Y-70460777D01*
X169078747Y-70442598D01*
X169064133Y-70422893D01*
X169051520Y-70401849D01*
X169041030Y-70379671D01*
X169032765Y-70356571D01*
X169026804Y-70332773D01*
X169023204Y-70308504D01*
X169022000Y-70284000D01*
X169022000Y-67384000D01*
X169023204Y-67359496D01*
X169026804Y-67335227D01*
X169032765Y-67311429D01*
X169041030Y-67288329D01*
X169051520Y-67266151D01*
X169064133Y-67245107D01*
X169078747Y-67225402D01*
X169095223Y-67207223D01*
X169113402Y-67190747D01*
X169133107Y-67176133D01*
X169154151Y-67163520D01*
X169176329Y-67153030D01*
X169199429Y-67144765D01*
X169223227Y-67138804D01*
X169247496Y-67135204D01*
X169272000Y-67134000D01*
X170072000Y-67134000D01*
X170096504Y-67135204D01*
G37*
G36*
X174546504Y-67135204D02*
G01*
X174570773Y-67138804D01*
X174594571Y-67144765D01*
X174617671Y-67153030D01*
X174639849Y-67163520D01*
X174660893Y-67176133D01*
X174680598Y-67190747D01*
X174698777Y-67207223D01*
X174715253Y-67225402D01*
X174729867Y-67245107D01*
X174742480Y-67266151D01*
X174752970Y-67288329D01*
X174761235Y-67311429D01*
X174767196Y-67335227D01*
X174770796Y-67359496D01*
X174772000Y-67384000D01*
X174772000Y-70284000D01*
X174770796Y-70308504D01*
X174767196Y-70332773D01*
X174761235Y-70356571D01*
X174752970Y-70379671D01*
X174742480Y-70401849D01*
X174729867Y-70422893D01*
X174715253Y-70442598D01*
X174698777Y-70460777D01*
X174680598Y-70477253D01*
X174660893Y-70491867D01*
X174639849Y-70504480D01*
X174617671Y-70514970D01*
X174594571Y-70523235D01*
X174570773Y-70529196D01*
X174546504Y-70532796D01*
X174522000Y-70534000D01*
X173722000Y-70534000D01*
X173697496Y-70532796D01*
X173673227Y-70529196D01*
X173649429Y-70523235D01*
X173626329Y-70514970D01*
X173604151Y-70504480D01*
X173583107Y-70491867D01*
X173563402Y-70477253D01*
X173545223Y-70460777D01*
X173528747Y-70442598D01*
X173514133Y-70422893D01*
X173501520Y-70401849D01*
X173491030Y-70379671D01*
X173482765Y-70356571D01*
X173476804Y-70332773D01*
X173473204Y-70308504D01*
X173472000Y-70284000D01*
X173472000Y-67384000D01*
X173473204Y-67359496D01*
X173476804Y-67335227D01*
X173482765Y-67311429D01*
X173491030Y-67288329D01*
X173501520Y-67266151D01*
X173514133Y-67245107D01*
X173528747Y-67225402D01*
X173545223Y-67207223D01*
X173563402Y-67190747D01*
X173583107Y-67176133D01*
X173604151Y-67163520D01*
X173626329Y-67153030D01*
X173649429Y-67144765D01*
X173673227Y-67138804D01*
X173697496Y-67135204D01*
X173722000Y-67134000D01*
X174522000Y-67134000D01*
X174546504Y-67135204D01*
G37*
G36*
X200490779Y-49564144D02*
G01*
X200513834Y-49567563D01*
X200536443Y-49573227D01*
X200558387Y-49581079D01*
X200579457Y-49591044D01*
X200599448Y-49603026D01*
X200618168Y-49616910D01*
X200635438Y-49632562D01*
X200651090Y-49649832D01*
X200664974Y-49668552D01*
X200676956Y-49688543D01*
X200686921Y-49709613D01*
X200694773Y-49731557D01*
X200700437Y-49754166D01*
X200703856Y-49777221D01*
X200705000Y-49800500D01*
X200705000Y-50275500D01*
X200703856Y-50298779D01*
X200700437Y-50321834D01*
X200694773Y-50344443D01*
X200686921Y-50366387D01*
X200676956Y-50387457D01*
X200664974Y-50407448D01*
X200651090Y-50426168D01*
X200635438Y-50443438D01*
X200618168Y-50459090D01*
X200599448Y-50472974D01*
X200579457Y-50484956D01*
X200558387Y-50494921D01*
X200536443Y-50502773D01*
X200513834Y-50508437D01*
X200490779Y-50511856D01*
X200467500Y-50513000D01*
X199892500Y-50513000D01*
X199869221Y-50511856D01*
X199846166Y-50508437D01*
X199823557Y-50502773D01*
X199801613Y-50494921D01*
X199780543Y-50484956D01*
X199760552Y-50472974D01*
X199741832Y-50459090D01*
X199724562Y-50443438D01*
X199708910Y-50426168D01*
X199695026Y-50407448D01*
X199683044Y-50387457D01*
X199673079Y-50366387D01*
X199665227Y-50344443D01*
X199659563Y-50321834D01*
X199656144Y-50298779D01*
X199655000Y-50275500D01*
X199655000Y-49800500D01*
X199656144Y-49777221D01*
X199659563Y-49754166D01*
X199665227Y-49731557D01*
X199673079Y-49709613D01*
X199683044Y-49688543D01*
X199695026Y-49668552D01*
X199708910Y-49649832D01*
X199724562Y-49632562D01*
X199741832Y-49616910D01*
X199760552Y-49603026D01*
X199780543Y-49591044D01*
X199801613Y-49581079D01*
X199823557Y-49573227D01*
X199846166Y-49567563D01*
X199869221Y-49564144D01*
X199892500Y-49563000D01*
X200467500Y-49563000D01*
X200490779Y-49564144D01*
G37*
G36*
X202240779Y-49564144D02*
G01*
X202263834Y-49567563D01*
X202286443Y-49573227D01*
X202308387Y-49581079D01*
X202329457Y-49591044D01*
X202349448Y-49603026D01*
X202368168Y-49616910D01*
X202385438Y-49632562D01*
X202401090Y-49649832D01*
X202414974Y-49668552D01*
X202426956Y-49688543D01*
X202436921Y-49709613D01*
X202444773Y-49731557D01*
X202450437Y-49754166D01*
X202453856Y-49777221D01*
X202455000Y-49800500D01*
X202455000Y-50275500D01*
X202453856Y-50298779D01*
X202450437Y-50321834D01*
X202444773Y-50344443D01*
X202436921Y-50366387D01*
X202426956Y-50387457D01*
X202414974Y-50407448D01*
X202401090Y-50426168D01*
X202385438Y-50443438D01*
X202368168Y-50459090D01*
X202349448Y-50472974D01*
X202329457Y-50484956D01*
X202308387Y-50494921D01*
X202286443Y-50502773D01*
X202263834Y-50508437D01*
X202240779Y-50511856D01*
X202217500Y-50513000D01*
X201642500Y-50513000D01*
X201619221Y-50511856D01*
X201596166Y-50508437D01*
X201573557Y-50502773D01*
X201551613Y-50494921D01*
X201530543Y-50484956D01*
X201510552Y-50472974D01*
X201491832Y-50459090D01*
X201474562Y-50443438D01*
X201458910Y-50426168D01*
X201445026Y-50407448D01*
X201433044Y-50387457D01*
X201423079Y-50366387D01*
X201415227Y-50344443D01*
X201409563Y-50321834D01*
X201406144Y-50298779D01*
X201405000Y-50275500D01*
X201405000Y-49800500D01*
X201406144Y-49777221D01*
X201409563Y-49754166D01*
X201415227Y-49731557D01*
X201423079Y-49709613D01*
X201433044Y-49688543D01*
X201445026Y-49668552D01*
X201458910Y-49649832D01*
X201474562Y-49632562D01*
X201491832Y-49616910D01*
X201510552Y-49603026D01*
X201530543Y-49591044D01*
X201551613Y-49581079D01*
X201573557Y-49573227D01*
X201596166Y-49567563D01*
X201619221Y-49564144D01*
X201642500Y-49563000D01*
X202217500Y-49563000D01*
X202240779Y-49564144D01*
G37*
G36*
X198571779Y-39150144D02*
G01*
X198594834Y-39153563D01*
X198617443Y-39159227D01*
X198639387Y-39167079D01*
X198660457Y-39177044D01*
X198680448Y-39189026D01*
X198699168Y-39202910D01*
X198716438Y-39218562D01*
X198732090Y-39235832D01*
X198745974Y-39254552D01*
X198757956Y-39274543D01*
X198767921Y-39295613D01*
X198775773Y-39317557D01*
X198781437Y-39340166D01*
X198784856Y-39363221D01*
X198786000Y-39386500D01*
X198786000Y-39861500D01*
X198784856Y-39884779D01*
X198781437Y-39907834D01*
X198775773Y-39930443D01*
X198767921Y-39952387D01*
X198757956Y-39973457D01*
X198745974Y-39993448D01*
X198732090Y-40012168D01*
X198716438Y-40029438D01*
X198699168Y-40045090D01*
X198680448Y-40058974D01*
X198660457Y-40070956D01*
X198639387Y-40080921D01*
X198617443Y-40088773D01*
X198594834Y-40094437D01*
X198571779Y-40097856D01*
X198548500Y-40099000D01*
X197973500Y-40099000D01*
X197950221Y-40097856D01*
X197927166Y-40094437D01*
X197904557Y-40088773D01*
X197882613Y-40080921D01*
X197861543Y-40070956D01*
X197841552Y-40058974D01*
X197822832Y-40045090D01*
X197805562Y-40029438D01*
X197789910Y-40012168D01*
X197776026Y-39993448D01*
X197764044Y-39973457D01*
X197754079Y-39952387D01*
X197746227Y-39930443D01*
X197740563Y-39907834D01*
X197737144Y-39884779D01*
X197736000Y-39861500D01*
X197736000Y-39386500D01*
X197737144Y-39363221D01*
X197740563Y-39340166D01*
X197746227Y-39317557D01*
X197754079Y-39295613D01*
X197764044Y-39274543D01*
X197776026Y-39254552D01*
X197789910Y-39235832D01*
X197805562Y-39218562D01*
X197822832Y-39202910D01*
X197841552Y-39189026D01*
X197861543Y-39177044D01*
X197882613Y-39167079D01*
X197904557Y-39159227D01*
X197927166Y-39153563D01*
X197950221Y-39150144D01*
X197973500Y-39149000D01*
X198548500Y-39149000D01*
X198571779Y-39150144D01*
G37*
G36*
X200321779Y-39150144D02*
G01*
X200344834Y-39153563D01*
X200367443Y-39159227D01*
X200389387Y-39167079D01*
X200410457Y-39177044D01*
X200430448Y-39189026D01*
X200449168Y-39202910D01*
X200466438Y-39218562D01*
X200482090Y-39235832D01*
X200495974Y-39254552D01*
X200507956Y-39274543D01*
X200517921Y-39295613D01*
X200525773Y-39317557D01*
X200531437Y-39340166D01*
X200534856Y-39363221D01*
X200536000Y-39386500D01*
X200536000Y-39861500D01*
X200534856Y-39884779D01*
X200531437Y-39907834D01*
X200525773Y-39930443D01*
X200517921Y-39952387D01*
X200507956Y-39973457D01*
X200495974Y-39993448D01*
X200482090Y-40012168D01*
X200466438Y-40029438D01*
X200449168Y-40045090D01*
X200430448Y-40058974D01*
X200410457Y-40070956D01*
X200389387Y-40080921D01*
X200367443Y-40088773D01*
X200344834Y-40094437D01*
X200321779Y-40097856D01*
X200298500Y-40099000D01*
X199723500Y-40099000D01*
X199700221Y-40097856D01*
X199677166Y-40094437D01*
X199654557Y-40088773D01*
X199632613Y-40080921D01*
X199611543Y-40070956D01*
X199591552Y-40058974D01*
X199572832Y-40045090D01*
X199555562Y-40029438D01*
X199539910Y-40012168D01*
X199526026Y-39993448D01*
X199514044Y-39973457D01*
X199504079Y-39952387D01*
X199496227Y-39930443D01*
X199490563Y-39907834D01*
X199487144Y-39884779D01*
X199486000Y-39861500D01*
X199486000Y-39386500D01*
X199487144Y-39363221D01*
X199490563Y-39340166D01*
X199496227Y-39317557D01*
X199504079Y-39295613D01*
X199514044Y-39274543D01*
X199526026Y-39254552D01*
X199539910Y-39235832D01*
X199555562Y-39218562D01*
X199572832Y-39202910D01*
X199591552Y-39189026D01*
X199611543Y-39177044D01*
X199632613Y-39167079D01*
X199654557Y-39159227D01*
X199677166Y-39153563D01*
X199700221Y-39150144D01*
X199723500Y-39149000D01*
X200298500Y-39149000D01*
X200321779Y-39150144D01*
G37*
G36*
X203736779Y-39150144D02*
G01*
X203759834Y-39153563D01*
X203782443Y-39159227D01*
X203804387Y-39167079D01*
X203825457Y-39177044D01*
X203845448Y-39189026D01*
X203864168Y-39202910D01*
X203881438Y-39218562D01*
X203897090Y-39235832D01*
X203910974Y-39254552D01*
X203922956Y-39274543D01*
X203932921Y-39295613D01*
X203940773Y-39317557D01*
X203946437Y-39340166D01*
X203949856Y-39363221D01*
X203951000Y-39386500D01*
X203951000Y-39861500D01*
X203949856Y-39884779D01*
X203946437Y-39907834D01*
X203940773Y-39930443D01*
X203932921Y-39952387D01*
X203922956Y-39973457D01*
X203910974Y-39993448D01*
X203897090Y-40012168D01*
X203881438Y-40029438D01*
X203864168Y-40045090D01*
X203845448Y-40058974D01*
X203825457Y-40070956D01*
X203804387Y-40080921D01*
X203782443Y-40088773D01*
X203759834Y-40094437D01*
X203736779Y-40097856D01*
X203713500Y-40099000D01*
X203138500Y-40099000D01*
X203115221Y-40097856D01*
X203092166Y-40094437D01*
X203069557Y-40088773D01*
X203047613Y-40080921D01*
X203026543Y-40070956D01*
X203006552Y-40058974D01*
X202987832Y-40045090D01*
X202970562Y-40029438D01*
X202954910Y-40012168D01*
X202941026Y-39993448D01*
X202929044Y-39973457D01*
X202919079Y-39952387D01*
X202911227Y-39930443D01*
X202905563Y-39907834D01*
X202902144Y-39884779D01*
X202901000Y-39861500D01*
X202901000Y-39386500D01*
X202902144Y-39363221D01*
X202905563Y-39340166D01*
X202911227Y-39317557D01*
X202919079Y-39295613D01*
X202929044Y-39274543D01*
X202941026Y-39254552D01*
X202954910Y-39235832D01*
X202970562Y-39218562D01*
X202987832Y-39202910D01*
X203006552Y-39189026D01*
X203026543Y-39177044D01*
X203047613Y-39167079D01*
X203069557Y-39159227D01*
X203092166Y-39153563D01*
X203115221Y-39150144D01*
X203138500Y-39149000D01*
X203713500Y-39149000D01*
X203736779Y-39150144D01*
G37*
G36*
X201986779Y-39150144D02*
G01*
X202009834Y-39153563D01*
X202032443Y-39159227D01*
X202054387Y-39167079D01*
X202075457Y-39177044D01*
X202095448Y-39189026D01*
X202114168Y-39202910D01*
X202131438Y-39218562D01*
X202147090Y-39235832D01*
X202160974Y-39254552D01*
X202172956Y-39274543D01*
X202182921Y-39295613D01*
X202190773Y-39317557D01*
X202196437Y-39340166D01*
X202199856Y-39363221D01*
X202201000Y-39386500D01*
X202201000Y-39861500D01*
X202199856Y-39884779D01*
X202196437Y-39907834D01*
X202190773Y-39930443D01*
X202182921Y-39952387D01*
X202172956Y-39973457D01*
X202160974Y-39993448D01*
X202147090Y-40012168D01*
X202131438Y-40029438D01*
X202114168Y-40045090D01*
X202095448Y-40058974D01*
X202075457Y-40070956D01*
X202054387Y-40080921D01*
X202032443Y-40088773D01*
X202009834Y-40094437D01*
X201986779Y-40097856D01*
X201963500Y-40099000D01*
X201388500Y-40099000D01*
X201365221Y-40097856D01*
X201342166Y-40094437D01*
X201319557Y-40088773D01*
X201297613Y-40080921D01*
X201276543Y-40070956D01*
X201256552Y-40058974D01*
X201237832Y-40045090D01*
X201220562Y-40029438D01*
X201204910Y-40012168D01*
X201191026Y-39993448D01*
X201179044Y-39973457D01*
X201169079Y-39952387D01*
X201161227Y-39930443D01*
X201155563Y-39907834D01*
X201152144Y-39884779D01*
X201151000Y-39861500D01*
X201151000Y-39386500D01*
X201152144Y-39363221D01*
X201155563Y-39340166D01*
X201161227Y-39317557D01*
X201169079Y-39295613D01*
X201179044Y-39274543D01*
X201191026Y-39254552D01*
X201204910Y-39235832D01*
X201220562Y-39218562D01*
X201237832Y-39202910D01*
X201256552Y-39189026D01*
X201276543Y-39177044D01*
X201297613Y-39167079D01*
X201319557Y-39159227D01*
X201342166Y-39153563D01*
X201365221Y-39150144D01*
X201388500Y-39149000D01*
X201963500Y-39149000D01*
X201986779Y-39150144D01*
G37*
G36*
X163858779Y-62264144D02*
G01*
X163881834Y-62267563D01*
X163904443Y-62273227D01*
X163926387Y-62281079D01*
X163947457Y-62291044D01*
X163967448Y-62303026D01*
X163986168Y-62316910D01*
X164003438Y-62332562D01*
X164019090Y-62349832D01*
X164032974Y-62368552D01*
X164044956Y-62388543D01*
X164054921Y-62409613D01*
X164062773Y-62431557D01*
X164068437Y-62454166D01*
X164071856Y-62477221D01*
X164073000Y-62500500D01*
X164073000Y-62975500D01*
X164071856Y-62998779D01*
X164068437Y-63021834D01*
X164062773Y-63044443D01*
X164054921Y-63066387D01*
X164044956Y-63087457D01*
X164032974Y-63107448D01*
X164019090Y-63126168D01*
X164003438Y-63143438D01*
X163986168Y-63159090D01*
X163967448Y-63172974D01*
X163947457Y-63184956D01*
X163926387Y-63194921D01*
X163904443Y-63202773D01*
X163881834Y-63208437D01*
X163858779Y-63211856D01*
X163835500Y-63213000D01*
X163260500Y-63213000D01*
X163237221Y-63211856D01*
X163214166Y-63208437D01*
X163191557Y-63202773D01*
X163169613Y-63194921D01*
X163148543Y-63184956D01*
X163128552Y-63172974D01*
X163109832Y-63159090D01*
X163092562Y-63143438D01*
X163076910Y-63126168D01*
X163063026Y-63107448D01*
X163051044Y-63087457D01*
X163041079Y-63066387D01*
X163033227Y-63044443D01*
X163027563Y-63021834D01*
X163024144Y-62998779D01*
X163023000Y-62975500D01*
X163023000Y-62500500D01*
X163024144Y-62477221D01*
X163027563Y-62454166D01*
X163033227Y-62431557D01*
X163041079Y-62409613D01*
X163051044Y-62388543D01*
X163063026Y-62368552D01*
X163076910Y-62349832D01*
X163092562Y-62332562D01*
X163109832Y-62316910D01*
X163128552Y-62303026D01*
X163148543Y-62291044D01*
X163169613Y-62281079D01*
X163191557Y-62273227D01*
X163214166Y-62267563D01*
X163237221Y-62264144D01*
X163260500Y-62263000D01*
X163835500Y-62263000D01*
X163858779Y-62264144D01*
G37*
G36*
X162108779Y-62264144D02*
G01*
X162131834Y-62267563D01*
X162154443Y-62273227D01*
X162176387Y-62281079D01*
X162197457Y-62291044D01*
X162217448Y-62303026D01*
X162236168Y-62316910D01*
X162253438Y-62332562D01*
X162269090Y-62349832D01*
X162282974Y-62368552D01*
X162294956Y-62388543D01*
X162304921Y-62409613D01*
X162312773Y-62431557D01*
X162318437Y-62454166D01*
X162321856Y-62477221D01*
X162323000Y-62500500D01*
X162323000Y-62975500D01*
X162321856Y-62998779D01*
X162318437Y-63021834D01*
X162312773Y-63044443D01*
X162304921Y-63066387D01*
X162294956Y-63087457D01*
X162282974Y-63107448D01*
X162269090Y-63126168D01*
X162253438Y-63143438D01*
X162236168Y-63159090D01*
X162217448Y-63172974D01*
X162197457Y-63184956D01*
X162176387Y-63194921D01*
X162154443Y-63202773D01*
X162131834Y-63208437D01*
X162108779Y-63211856D01*
X162085500Y-63213000D01*
X161510500Y-63213000D01*
X161487221Y-63211856D01*
X161464166Y-63208437D01*
X161441557Y-63202773D01*
X161419613Y-63194921D01*
X161398543Y-63184956D01*
X161378552Y-63172974D01*
X161359832Y-63159090D01*
X161342562Y-63143438D01*
X161326910Y-63126168D01*
X161313026Y-63107448D01*
X161301044Y-63087457D01*
X161291079Y-63066387D01*
X161283227Y-63044443D01*
X161277563Y-63021834D01*
X161274144Y-62998779D01*
X161273000Y-62975500D01*
X161273000Y-62500500D01*
X161274144Y-62477221D01*
X161277563Y-62454166D01*
X161283227Y-62431557D01*
X161291079Y-62409613D01*
X161301044Y-62388543D01*
X161313026Y-62368552D01*
X161326910Y-62349832D01*
X161342562Y-62332562D01*
X161359832Y-62316910D01*
X161378552Y-62303026D01*
X161398543Y-62291044D01*
X161419613Y-62281079D01*
X161441557Y-62273227D01*
X161464166Y-62267563D01*
X161487221Y-62264144D01*
X161510500Y-62263000D01*
X162085500Y-62263000D01*
X162108779Y-62264144D01*
G37*
G36*
X164535779Y-34578144D02*
G01*
X164558834Y-34581563D01*
X164581443Y-34587227D01*
X164603387Y-34595079D01*
X164624457Y-34605044D01*
X164644448Y-34617026D01*
X164663168Y-34630910D01*
X164680438Y-34646562D01*
X164696090Y-34663832D01*
X164709974Y-34682552D01*
X164721956Y-34702543D01*
X164731921Y-34723613D01*
X164739773Y-34745557D01*
X164745437Y-34768166D01*
X164748856Y-34791221D01*
X164750000Y-34814500D01*
X164750000Y-35289500D01*
X164748856Y-35312779D01*
X164745437Y-35335834D01*
X164739773Y-35358443D01*
X164731921Y-35380387D01*
X164721956Y-35401457D01*
X164709974Y-35421448D01*
X164696090Y-35440168D01*
X164680438Y-35457438D01*
X164663168Y-35473090D01*
X164644448Y-35486974D01*
X164624457Y-35498956D01*
X164603387Y-35508921D01*
X164581443Y-35516773D01*
X164558834Y-35522437D01*
X164535779Y-35525856D01*
X164512500Y-35527000D01*
X163937500Y-35527000D01*
X163914221Y-35525856D01*
X163891166Y-35522437D01*
X163868557Y-35516773D01*
X163846613Y-35508921D01*
X163825543Y-35498956D01*
X163805552Y-35486974D01*
X163786832Y-35473090D01*
X163769562Y-35457438D01*
X163753910Y-35440168D01*
X163740026Y-35421448D01*
X163728044Y-35401457D01*
X163718079Y-35380387D01*
X163710227Y-35358443D01*
X163704563Y-35335834D01*
X163701144Y-35312779D01*
X163700000Y-35289500D01*
X163700000Y-34814500D01*
X163701144Y-34791221D01*
X163704563Y-34768166D01*
X163710227Y-34745557D01*
X163718079Y-34723613D01*
X163728044Y-34702543D01*
X163740026Y-34682552D01*
X163753910Y-34663832D01*
X163769562Y-34646562D01*
X163786832Y-34630910D01*
X163805552Y-34617026D01*
X163825543Y-34605044D01*
X163846613Y-34595079D01*
X163868557Y-34587227D01*
X163891166Y-34581563D01*
X163914221Y-34578144D01*
X163937500Y-34577000D01*
X164512500Y-34577000D01*
X164535779Y-34578144D01*
G37*
G36*
X166285779Y-34578144D02*
G01*
X166308834Y-34581563D01*
X166331443Y-34587227D01*
X166353387Y-34595079D01*
X166374457Y-34605044D01*
X166394448Y-34617026D01*
X166413168Y-34630910D01*
X166430438Y-34646562D01*
X166446090Y-34663832D01*
X166459974Y-34682552D01*
X166471956Y-34702543D01*
X166481921Y-34723613D01*
X166489773Y-34745557D01*
X166495437Y-34768166D01*
X166498856Y-34791221D01*
X166500000Y-34814500D01*
X166500000Y-35289500D01*
X166498856Y-35312779D01*
X166495437Y-35335834D01*
X166489773Y-35358443D01*
X166481921Y-35380387D01*
X166471956Y-35401457D01*
X166459974Y-35421448D01*
X166446090Y-35440168D01*
X166430438Y-35457438D01*
X166413168Y-35473090D01*
X166394448Y-35486974D01*
X166374457Y-35498956D01*
X166353387Y-35508921D01*
X166331443Y-35516773D01*
X166308834Y-35522437D01*
X166285779Y-35525856D01*
X166262500Y-35527000D01*
X165687500Y-35527000D01*
X165664221Y-35525856D01*
X165641166Y-35522437D01*
X165618557Y-35516773D01*
X165596613Y-35508921D01*
X165575543Y-35498956D01*
X165555552Y-35486974D01*
X165536832Y-35473090D01*
X165519562Y-35457438D01*
X165503910Y-35440168D01*
X165490026Y-35421448D01*
X165478044Y-35401457D01*
X165468079Y-35380387D01*
X165460227Y-35358443D01*
X165454563Y-35335834D01*
X165451144Y-35312779D01*
X165450000Y-35289500D01*
X165450000Y-34814500D01*
X165451144Y-34791221D01*
X165454563Y-34768166D01*
X165460227Y-34745557D01*
X165468079Y-34723613D01*
X165478044Y-34702543D01*
X165490026Y-34682552D01*
X165503910Y-34663832D01*
X165519562Y-34646562D01*
X165536832Y-34630910D01*
X165555552Y-34617026D01*
X165575543Y-34605044D01*
X165596613Y-34595079D01*
X165618557Y-34587227D01*
X165641166Y-34581563D01*
X165664221Y-34578144D01*
X165687500Y-34577000D01*
X166262500Y-34577000D01*
X166285779Y-34578144D01*
G37*
G36*
X166285779Y-30260144D02*
G01*
X166308834Y-30263563D01*
X166331443Y-30269227D01*
X166353387Y-30277079D01*
X166374457Y-30287044D01*
X166394448Y-30299026D01*
X166413168Y-30312910D01*
X166430438Y-30328562D01*
X166446090Y-30345832D01*
X166459974Y-30364552D01*
X166471956Y-30384543D01*
X166481921Y-30405613D01*
X166489773Y-30427557D01*
X166495437Y-30450166D01*
X166498856Y-30473221D01*
X166500000Y-30496500D01*
X166500000Y-30971500D01*
X166498856Y-30994779D01*
X166495437Y-31017834D01*
X166489773Y-31040443D01*
X166481921Y-31062387D01*
X166471956Y-31083457D01*
X166459974Y-31103448D01*
X166446090Y-31122168D01*
X166430438Y-31139438D01*
X166413168Y-31155090D01*
X166394448Y-31168974D01*
X166374457Y-31180956D01*
X166353387Y-31190921D01*
X166331443Y-31198773D01*
X166308834Y-31204437D01*
X166285779Y-31207856D01*
X166262500Y-31209000D01*
X165687500Y-31209000D01*
X165664221Y-31207856D01*
X165641166Y-31204437D01*
X165618557Y-31198773D01*
X165596613Y-31190921D01*
X165575543Y-31180956D01*
X165555552Y-31168974D01*
X165536832Y-31155090D01*
X165519562Y-31139438D01*
X165503910Y-31122168D01*
X165490026Y-31103448D01*
X165478044Y-31083457D01*
X165468079Y-31062387D01*
X165460227Y-31040443D01*
X165454563Y-31017834D01*
X165451144Y-30994779D01*
X165450000Y-30971500D01*
X165450000Y-30496500D01*
X165451144Y-30473221D01*
X165454563Y-30450166D01*
X165460227Y-30427557D01*
X165468079Y-30405613D01*
X165478044Y-30384543D01*
X165490026Y-30364552D01*
X165503910Y-30345832D01*
X165519562Y-30328562D01*
X165536832Y-30312910D01*
X165555552Y-30299026D01*
X165575543Y-30287044D01*
X165596613Y-30277079D01*
X165618557Y-30269227D01*
X165641166Y-30263563D01*
X165664221Y-30260144D01*
X165687500Y-30259000D01*
X166262500Y-30259000D01*
X166285779Y-30260144D01*
G37*
G36*
X164535779Y-30260144D02*
G01*
X164558834Y-30263563D01*
X164581443Y-30269227D01*
X164603387Y-30277079D01*
X164624457Y-30287044D01*
X164644448Y-30299026D01*
X164663168Y-30312910D01*
X164680438Y-30328562D01*
X164696090Y-30345832D01*
X164709974Y-30364552D01*
X164721956Y-30384543D01*
X164731921Y-30405613D01*
X164739773Y-30427557D01*
X164745437Y-30450166D01*
X164748856Y-30473221D01*
X164750000Y-30496500D01*
X164750000Y-30971500D01*
X164748856Y-30994779D01*
X164745437Y-31017834D01*
X164739773Y-31040443D01*
X164731921Y-31062387D01*
X164721956Y-31083457D01*
X164709974Y-31103448D01*
X164696090Y-31122168D01*
X164680438Y-31139438D01*
X164663168Y-31155090D01*
X164644448Y-31168974D01*
X164624457Y-31180956D01*
X164603387Y-31190921D01*
X164581443Y-31198773D01*
X164558834Y-31204437D01*
X164535779Y-31207856D01*
X164512500Y-31209000D01*
X163937500Y-31209000D01*
X163914221Y-31207856D01*
X163891166Y-31204437D01*
X163868557Y-31198773D01*
X163846613Y-31190921D01*
X163825543Y-31180956D01*
X163805552Y-31168974D01*
X163786832Y-31155090D01*
X163769562Y-31139438D01*
X163753910Y-31122168D01*
X163740026Y-31103448D01*
X163728044Y-31083457D01*
X163718079Y-31062387D01*
X163710227Y-31040443D01*
X163704563Y-31017834D01*
X163701144Y-30994779D01*
X163700000Y-30971500D01*
X163700000Y-30496500D01*
X163701144Y-30473221D01*
X163704563Y-30450166D01*
X163710227Y-30427557D01*
X163718079Y-30405613D01*
X163728044Y-30384543D01*
X163740026Y-30364552D01*
X163753910Y-30345832D01*
X163769562Y-30328562D01*
X163786832Y-30312910D01*
X163805552Y-30299026D01*
X163825543Y-30287044D01*
X163846613Y-30277079D01*
X163868557Y-30269227D01*
X163891166Y-30263563D01*
X163914221Y-30260144D01*
X163937500Y-30259000D01*
X164512500Y-30259000D01*
X164535779Y-30260144D01*
G37*
G36*
X164535779Y-28736144D02*
G01*
X164558834Y-28739563D01*
X164581443Y-28745227D01*
X164603387Y-28753079D01*
X164624457Y-28763044D01*
X164644448Y-28775026D01*
X164663168Y-28788910D01*
X164680438Y-28804562D01*
X164696090Y-28821832D01*
X164709974Y-28840552D01*
X164721956Y-28860543D01*
X164731921Y-28881613D01*
X164739773Y-28903557D01*
X164745437Y-28926166D01*
X164748856Y-28949221D01*
X164750000Y-28972500D01*
X164750000Y-29447500D01*
X164748856Y-29470779D01*
X164745437Y-29493834D01*
X164739773Y-29516443D01*
X164731921Y-29538387D01*
X164721956Y-29559457D01*
X164709974Y-29579448D01*
X164696090Y-29598168D01*
X164680438Y-29615438D01*
X164663168Y-29631090D01*
X164644448Y-29644974D01*
X164624457Y-29656956D01*
X164603387Y-29666921D01*
X164581443Y-29674773D01*
X164558834Y-29680437D01*
X164535779Y-29683856D01*
X164512500Y-29685000D01*
X163937500Y-29685000D01*
X163914221Y-29683856D01*
X163891166Y-29680437D01*
X163868557Y-29674773D01*
X163846613Y-29666921D01*
X163825543Y-29656956D01*
X163805552Y-29644974D01*
X163786832Y-29631090D01*
X163769562Y-29615438D01*
X163753910Y-29598168D01*
X163740026Y-29579448D01*
X163728044Y-29559457D01*
X163718079Y-29538387D01*
X163710227Y-29516443D01*
X163704563Y-29493834D01*
X163701144Y-29470779D01*
X163700000Y-29447500D01*
X163700000Y-28972500D01*
X163701144Y-28949221D01*
X163704563Y-28926166D01*
X163710227Y-28903557D01*
X163718079Y-28881613D01*
X163728044Y-28860543D01*
X163740026Y-28840552D01*
X163753910Y-28821832D01*
X163769562Y-28804562D01*
X163786832Y-28788910D01*
X163805552Y-28775026D01*
X163825543Y-28763044D01*
X163846613Y-28753079D01*
X163868557Y-28745227D01*
X163891166Y-28739563D01*
X163914221Y-28736144D01*
X163937500Y-28735000D01*
X164512500Y-28735000D01*
X164535779Y-28736144D01*
G37*
G36*
X166285779Y-28736144D02*
G01*
X166308834Y-28739563D01*
X166331443Y-28745227D01*
X166353387Y-28753079D01*
X166374457Y-28763044D01*
X166394448Y-28775026D01*
X166413168Y-28788910D01*
X166430438Y-28804562D01*
X166446090Y-28821832D01*
X166459974Y-28840552D01*
X166471956Y-28860543D01*
X166481921Y-28881613D01*
X166489773Y-28903557D01*
X166495437Y-28926166D01*
X166498856Y-28949221D01*
X166500000Y-28972500D01*
X166500000Y-29447500D01*
X166498856Y-29470779D01*
X166495437Y-29493834D01*
X166489773Y-29516443D01*
X166481921Y-29538387D01*
X166471956Y-29559457D01*
X166459974Y-29579448D01*
X166446090Y-29598168D01*
X166430438Y-29615438D01*
X166413168Y-29631090D01*
X166394448Y-29644974D01*
X166374457Y-29656956D01*
X166353387Y-29666921D01*
X166331443Y-29674773D01*
X166308834Y-29680437D01*
X166285779Y-29683856D01*
X166262500Y-29685000D01*
X165687500Y-29685000D01*
X165664221Y-29683856D01*
X165641166Y-29680437D01*
X165618557Y-29674773D01*
X165596613Y-29666921D01*
X165575543Y-29656956D01*
X165555552Y-29644974D01*
X165536832Y-29631090D01*
X165519562Y-29615438D01*
X165503910Y-29598168D01*
X165490026Y-29579448D01*
X165478044Y-29559457D01*
X165468079Y-29538387D01*
X165460227Y-29516443D01*
X165454563Y-29493834D01*
X165451144Y-29470779D01*
X165450000Y-29447500D01*
X165450000Y-28972500D01*
X165451144Y-28949221D01*
X165454563Y-28926166D01*
X165460227Y-28903557D01*
X165468079Y-28881613D01*
X165478044Y-28860543D01*
X165490026Y-28840552D01*
X165503910Y-28821832D01*
X165519562Y-28804562D01*
X165536832Y-28788910D01*
X165555552Y-28775026D01*
X165575543Y-28763044D01*
X165596613Y-28753079D01*
X165618557Y-28745227D01*
X165641166Y-28739563D01*
X165664221Y-28736144D01*
X165687500Y-28735000D01*
X166262500Y-28735000D01*
X166285779Y-28736144D01*
G37*
G36*
X176028779Y-84185144D02*
G01*
X176051834Y-84188563D01*
X176074443Y-84194227D01*
X176096387Y-84202079D01*
X176117457Y-84212044D01*
X176137448Y-84224026D01*
X176156168Y-84237910D01*
X176173438Y-84253562D01*
X176189090Y-84270832D01*
X176202974Y-84289552D01*
X176214956Y-84309543D01*
X176224921Y-84330613D01*
X176232773Y-84352557D01*
X176238437Y-84375166D01*
X176241856Y-84398221D01*
X176243000Y-84421500D01*
X176243000Y-84996500D01*
X176241856Y-85019779D01*
X176238437Y-85042834D01*
X176232773Y-85065443D01*
X176224921Y-85087387D01*
X176214956Y-85108457D01*
X176202974Y-85128448D01*
X176189090Y-85147168D01*
X176173438Y-85164438D01*
X176156168Y-85180090D01*
X176137448Y-85193974D01*
X176117457Y-85205956D01*
X176096387Y-85215921D01*
X176074443Y-85223773D01*
X176051834Y-85229437D01*
X176028779Y-85232856D01*
X176005500Y-85234000D01*
X175530500Y-85234000D01*
X175507221Y-85232856D01*
X175484166Y-85229437D01*
X175461557Y-85223773D01*
X175439613Y-85215921D01*
X175418543Y-85205956D01*
X175398552Y-85193974D01*
X175379832Y-85180090D01*
X175362562Y-85164438D01*
X175346910Y-85147168D01*
X175333026Y-85128448D01*
X175321044Y-85108457D01*
X175311079Y-85087387D01*
X175303227Y-85065443D01*
X175297563Y-85042834D01*
X175294144Y-85019779D01*
X175293000Y-84996500D01*
X175293000Y-84421500D01*
X175294144Y-84398221D01*
X175297563Y-84375166D01*
X175303227Y-84352557D01*
X175311079Y-84330613D01*
X175321044Y-84309543D01*
X175333026Y-84289552D01*
X175346910Y-84270832D01*
X175362562Y-84253562D01*
X175379832Y-84237910D01*
X175398552Y-84224026D01*
X175418543Y-84212044D01*
X175439613Y-84202079D01*
X175461557Y-84194227D01*
X175484166Y-84188563D01*
X175507221Y-84185144D01*
X175530500Y-84184000D01*
X176005500Y-84184000D01*
X176028779Y-84185144D01*
G37*
G36*
X176028779Y-82435144D02*
G01*
X176051834Y-82438563D01*
X176074443Y-82444227D01*
X176096387Y-82452079D01*
X176117457Y-82462044D01*
X176137448Y-82474026D01*
X176156168Y-82487910D01*
X176173438Y-82503562D01*
X176189090Y-82520832D01*
X176202974Y-82539552D01*
X176214956Y-82559543D01*
X176224921Y-82580613D01*
X176232773Y-82602557D01*
X176238437Y-82625166D01*
X176241856Y-82648221D01*
X176243000Y-82671500D01*
X176243000Y-83246500D01*
X176241856Y-83269779D01*
X176238437Y-83292834D01*
X176232773Y-83315443D01*
X176224921Y-83337387D01*
X176214956Y-83358457D01*
X176202974Y-83378448D01*
X176189090Y-83397168D01*
X176173438Y-83414438D01*
X176156168Y-83430090D01*
X176137448Y-83443974D01*
X176117457Y-83455956D01*
X176096387Y-83465921D01*
X176074443Y-83473773D01*
X176051834Y-83479437D01*
X176028779Y-83482856D01*
X176005500Y-83484000D01*
X175530500Y-83484000D01*
X175507221Y-83482856D01*
X175484166Y-83479437D01*
X175461557Y-83473773D01*
X175439613Y-83465921D01*
X175418543Y-83455956D01*
X175398552Y-83443974D01*
X175379832Y-83430090D01*
X175362562Y-83414438D01*
X175346910Y-83397168D01*
X175333026Y-83378448D01*
X175321044Y-83358457D01*
X175311079Y-83337387D01*
X175303227Y-83315443D01*
X175297563Y-83292834D01*
X175294144Y-83269779D01*
X175293000Y-83246500D01*
X175293000Y-82671500D01*
X175294144Y-82648221D01*
X175297563Y-82625166D01*
X175303227Y-82602557D01*
X175311079Y-82580613D01*
X175321044Y-82559543D01*
X175333026Y-82539552D01*
X175346910Y-82520832D01*
X175362562Y-82503562D01*
X175379832Y-82487910D01*
X175398552Y-82474026D01*
X175418543Y-82462044D01*
X175439613Y-82452079D01*
X175461557Y-82444227D01*
X175484166Y-82438563D01*
X175507221Y-82435144D01*
X175530500Y-82434000D01*
X176005500Y-82434000D01*
X176028779Y-82435144D01*
G37*
G36*
X175429779Y-80679144D02*
G01*
X175452834Y-80682563D01*
X175475443Y-80688227D01*
X175497387Y-80696079D01*
X175518457Y-80706044D01*
X175538448Y-80718026D01*
X175557168Y-80731910D01*
X175574438Y-80747562D01*
X175590090Y-80764832D01*
X175603974Y-80783552D01*
X175615956Y-80803543D01*
X175625921Y-80824613D01*
X175633773Y-80846557D01*
X175639437Y-80869166D01*
X175642856Y-80892221D01*
X175644000Y-80915500D01*
X175644000Y-81390500D01*
X175642856Y-81413779D01*
X175639437Y-81436834D01*
X175633773Y-81459443D01*
X175625921Y-81481387D01*
X175615956Y-81502457D01*
X175603974Y-81522448D01*
X175590090Y-81541168D01*
X175574438Y-81558438D01*
X175557168Y-81574090D01*
X175538448Y-81587974D01*
X175518457Y-81599956D01*
X175497387Y-81609921D01*
X175475443Y-81617773D01*
X175452834Y-81623437D01*
X175429779Y-81626856D01*
X175406500Y-81628000D01*
X174831500Y-81628000D01*
X174808221Y-81626856D01*
X174785166Y-81623437D01*
X174762557Y-81617773D01*
X174740613Y-81609921D01*
X174719543Y-81599956D01*
X174699552Y-81587974D01*
X174680832Y-81574090D01*
X174663562Y-81558438D01*
X174647910Y-81541168D01*
X174634026Y-81522448D01*
X174622044Y-81502457D01*
X174612079Y-81481387D01*
X174604227Y-81459443D01*
X174598563Y-81436834D01*
X174595144Y-81413779D01*
X174594000Y-81390500D01*
X174594000Y-80915500D01*
X174595144Y-80892221D01*
X174598563Y-80869166D01*
X174604227Y-80846557D01*
X174612079Y-80824613D01*
X174622044Y-80803543D01*
X174634026Y-80783552D01*
X174647910Y-80764832D01*
X174663562Y-80747562D01*
X174680832Y-80731910D01*
X174699552Y-80718026D01*
X174719543Y-80706044D01*
X174740613Y-80696079D01*
X174762557Y-80688227D01*
X174785166Y-80682563D01*
X174808221Y-80679144D01*
X174831500Y-80678000D01*
X175406500Y-80678000D01*
X175429779Y-80679144D01*
G37*
G36*
X173679779Y-80679144D02*
G01*
X173702834Y-80682563D01*
X173725443Y-80688227D01*
X173747387Y-80696079D01*
X173768457Y-80706044D01*
X173788448Y-80718026D01*
X173807168Y-80731910D01*
X173824438Y-80747562D01*
X173840090Y-80764832D01*
X173853974Y-80783552D01*
X173865956Y-80803543D01*
X173875921Y-80824613D01*
X173883773Y-80846557D01*
X173889437Y-80869166D01*
X173892856Y-80892221D01*
X173894000Y-80915500D01*
X173894000Y-81390500D01*
X173892856Y-81413779D01*
X173889437Y-81436834D01*
X173883773Y-81459443D01*
X173875921Y-81481387D01*
X173865956Y-81502457D01*
X173853974Y-81522448D01*
X173840090Y-81541168D01*
X173824438Y-81558438D01*
X173807168Y-81574090D01*
X173788448Y-81587974D01*
X173768457Y-81599956D01*
X173747387Y-81609921D01*
X173725443Y-81617773D01*
X173702834Y-81623437D01*
X173679779Y-81626856D01*
X173656500Y-81628000D01*
X173081500Y-81628000D01*
X173058221Y-81626856D01*
X173035166Y-81623437D01*
X173012557Y-81617773D01*
X172990613Y-81609921D01*
X172969543Y-81599956D01*
X172949552Y-81587974D01*
X172930832Y-81574090D01*
X172913562Y-81558438D01*
X172897910Y-81541168D01*
X172884026Y-81522448D01*
X172872044Y-81502457D01*
X172862079Y-81481387D01*
X172854227Y-81459443D01*
X172848563Y-81436834D01*
X172845144Y-81413779D01*
X172844000Y-81390500D01*
X172844000Y-80915500D01*
X172845144Y-80892221D01*
X172848563Y-80869166D01*
X172854227Y-80846557D01*
X172862079Y-80824613D01*
X172872044Y-80803543D01*
X172884026Y-80783552D01*
X172897910Y-80764832D01*
X172913562Y-80747562D01*
X172930832Y-80731910D01*
X172949552Y-80718026D01*
X172969543Y-80706044D01*
X172990613Y-80696079D01*
X173012557Y-80688227D01*
X173035166Y-80682563D01*
X173058221Y-80679144D01*
X173081500Y-80678000D01*
X173656500Y-80678000D01*
X173679779Y-80679144D01*
G37*
G36*
X179584779Y-92821144D02*
G01*
X179607834Y-92824563D01*
X179630443Y-92830227D01*
X179652387Y-92838079D01*
X179673457Y-92848044D01*
X179693448Y-92860026D01*
X179712168Y-92873910D01*
X179729438Y-92889562D01*
X179745090Y-92906832D01*
X179758974Y-92925552D01*
X179770956Y-92945543D01*
X179780921Y-92966613D01*
X179788773Y-92988557D01*
X179794437Y-93011166D01*
X179797856Y-93034221D01*
X179799000Y-93057500D01*
X179799000Y-93632500D01*
X179797856Y-93655779D01*
X179794437Y-93678834D01*
X179788773Y-93701443D01*
X179780921Y-93723387D01*
X179770956Y-93744457D01*
X179758974Y-93764448D01*
X179745090Y-93783168D01*
X179729438Y-93800438D01*
X179712168Y-93816090D01*
X179693448Y-93829974D01*
X179673457Y-93841956D01*
X179652387Y-93851921D01*
X179630443Y-93859773D01*
X179607834Y-93865437D01*
X179584779Y-93868856D01*
X179561500Y-93870000D01*
X179086500Y-93870000D01*
X179063221Y-93868856D01*
X179040166Y-93865437D01*
X179017557Y-93859773D01*
X178995613Y-93851921D01*
X178974543Y-93841956D01*
X178954552Y-93829974D01*
X178935832Y-93816090D01*
X178918562Y-93800438D01*
X178902910Y-93783168D01*
X178889026Y-93764448D01*
X178877044Y-93744457D01*
X178867079Y-93723387D01*
X178859227Y-93701443D01*
X178853563Y-93678834D01*
X178850144Y-93655779D01*
X178849000Y-93632500D01*
X178849000Y-93057500D01*
X178850144Y-93034221D01*
X178853563Y-93011166D01*
X178859227Y-92988557D01*
X178867079Y-92966613D01*
X178877044Y-92945543D01*
X178889026Y-92925552D01*
X178902910Y-92906832D01*
X178918562Y-92889562D01*
X178935832Y-92873910D01*
X178954552Y-92860026D01*
X178974543Y-92848044D01*
X178995613Y-92838079D01*
X179017557Y-92830227D01*
X179040166Y-92824563D01*
X179063221Y-92821144D01*
X179086500Y-92820000D01*
X179561500Y-92820000D01*
X179584779Y-92821144D01*
G37*
G36*
X179584779Y-91071144D02*
G01*
X179607834Y-91074563D01*
X179630443Y-91080227D01*
X179652387Y-91088079D01*
X179673457Y-91098044D01*
X179693448Y-91110026D01*
X179712168Y-91123910D01*
X179729438Y-91139562D01*
X179745090Y-91156832D01*
X179758974Y-91175552D01*
X179770956Y-91195543D01*
X179780921Y-91216613D01*
X179788773Y-91238557D01*
X179794437Y-91261166D01*
X179797856Y-91284221D01*
X179799000Y-91307500D01*
X179799000Y-91882500D01*
X179797856Y-91905779D01*
X179794437Y-91928834D01*
X179788773Y-91951443D01*
X179780921Y-91973387D01*
X179770956Y-91994457D01*
X179758974Y-92014448D01*
X179745090Y-92033168D01*
X179729438Y-92050438D01*
X179712168Y-92066090D01*
X179693448Y-92079974D01*
X179673457Y-92091956D01*
X179652387Y-92101921D01*
X179630443Y-92109773D01*
X179607834Y-92115437D01*
X179584779Y-92118856D01*
X179561500Y-92120000D01*
X179086500Y-92120000D01*
X179063221Y-92118856D01*
X179040166Y-92115437D01*
X179017557Y-92109773D01*
X178995613Y-92101921D01*
X178974543Y-92091956D01*
X178954552Y-92079974D01*
X178935832Y-92066090D01*
X178918562Y-92050438D01*
X178902910Y-92033168D01*
X178889026Y-92014448D01*
X178877044Y-91994457D01*
X178867079Y-91973387D01*
X178859227Y-91951443D01*
X178853563Y-91928834D01*
X178850144Y-91905779D01*
X178849000Y-91882500D01*
X178849000Y-91307500D01*
X178850144Y-91284221D01*
X178853563Y-91261166D01*
X178859227Y-91238557D01*
X178867079Y-91216613D01*
X178877044Y-91195543D01*
X178889026Y-91175552D01*
X178902910Y-91156832D01*
X178918562Y-91139562D01*
X178935832Y-91123910D01*
X178954552Y-91110026D01*
X178974543Y-91098044D01*
X178995613Y-91088079D01*
X179017557Y-91080227D01*
X179040166Y-91074563D01*
X179063221Y-91071144D01*
X179086500Y-91070000D01*
X179561500Y-91070000D01*
X179584779Y-91071144D01*
G37*
G36*
X174272779Y-84743144D02*
G01*
X174295834Y-84746563D01*
X174318443Y-84752227D01*
X174340387Y-84760079D01*
X174361457Y-84770044D01*
X174381448Y-84782026D01*
X174400168Y-84795910D01*
X174417438Y-84811562D01*
X174433090Y-84828832D01*
X174446974Y-84847552D01*
X174458956Y-84867543D01*
X174468921Y-84888613D01*
X174476773Y-84910557D01*
X174482437Y-84933166D01*
X174485856Y-84956221D01*
X174487000Y-84979500D01*
X174487000Y-85454500D01*
X174485856Y-85477779D01*
X174482437Y-85500834D01*
X174476773Y-85523443D01*
X174468921Y-85545387D01*
X174458956Y-85566457D01*
X174446974Y-85586448D01*
X174433090Y-85605168D01*
X174417438Y-85622438D01*
X174400168Y-85638090D01*
X174381448Y-85651974D01*
X174361457Y-85663956D01*
X174340387Y-85673921D01*
X174318443Y-85681773D01*
X174295834Y-85687437D01*
X174272779Y-85690856D01*
X174249500Y-85692000D01*
X173674500Y-85692000D01*
X173651221Y-85690856D01*
X173628166Y-85687437D01*
X173605557Y-85681773D01*
X173583613Y-85673921D01*
X173562543Y-85663956D01*
X173542552Y-85651974D01*
X173523832Y-85638090D01*
X173506562Y-85622438D01*
X173490910Y-85605168D01*
X173477026Y-85586448D01*
X173465044Y-85566457D01*
X173455079Y-85545387D01*
X173447227Y-85523443D01*
X173441563Y-85500834D01*
X173438144Y-85477779D01*
X173437000Y-85454500D01*
X173437000Y-84979500D01*
X173438144Y-84956221D01*
X173441563Y-84933166D01*
X173447227Y-84910557D01*
X173455079Y-84888613D01*
X173465044Y-84867543D01*
X173477026Y-84847552D01*
X173490910Y-84828832D01*
X173506562Y-84811562D01*
X173523832Y-84795910D01*
X173542552Y-84782026D01*
X173562543Y-84770044D01*
X173583613Y-84760079D01*
X173605557Y-84752227D01*
X173628166Y-84746563D01*
X173651221Y-84743144D01*
X173674500Y-84742000D01*
X174249500Y-84742000D01*
X174272779Y-84743144D01*
G37*
G36*
X172522779Y-84743144D02*
G01*
X172545834Y-84746563D01*
X172568443Y-84752227D01*
X172590387Y-84760079D01*
X172611457Y-84770044D01*
X172631448Y-84782026D01*
X172650168Y-84795910D01*
X172667438Y-84811562D01*
X172683090Y-84828832D01*
X172696974Y-84847552D01*
X172708956Y-84867543D01*
X172718921Y-84888613D01*
X172726773Y-84910557D01*
X172732437Y-84933166D01*
X172735856Y-84956221D01*
X172737000Y-84979500D01*
X172737000Y-85454500D01*
X172735856Y-85477779D01*
X172732437Y-85500834D01*
X172726773Y-85523443D01*
X172718921Y-85545387D01*
X172708956Y-85566457D01*
X172696974Y-85586448D01*
X172683090Y-85605168D01*
X172667438Y-85622438D01*
X172650168Y-85638090D01*
X172631448Y-85651974D01*
X172611457Y-85663956D01*
X172590387Y-85673921D01*
X172568443Y-85681773D01*
X172545834Y-85687437D01*
X172522779Y-85690856D01*
X172499500Y-85692000D01*
X171924500Y-85692000D01*
X171901221Y-85690856D01*
X171878166Y-85687437D01*
X171855557Y-85681773D01*
X171833613Y-85673921D01*
X171812543Y-85663956D01*
X171792552Y-85651974D01*
X171773832Y-85638090D01*
X171756562Y-85622438D01*
X171740910Y-85605168D01*
X171727026Y-85586448D01*
X171715044Y-85566457D01*
X171705079Y-85545387D01*
X171697227Y-85523443D01*
X171691563Y-85500834D01*
X171688144Y-85477779D01*
X171687000Y-85454500D01*
X171687000Y-84979500D01*
X171688144Y-84956221D01*
X171691563Y-84933166D01*
X171697227Y-84910557D01*
X171705079Y-84888613D01*
X171715044Y-84867543D01*
X171727026Y-84847552D01*
X171740910Y-84828832D01*
X171756562Y-84811562D01*
X171773832Y-84795910D01*
X171792552Y-84782026D01*
X171812543Y-84770044D01*
X171833613Y-84760079D01*
X171855557Y-84752227D01*
X171878166Y-84746563D01*
X171901221Y-84743144D01*
X171924500Y-84742000D01*
X172499500Y-84742000D01*
X172522779Y-84743144D01*
G37*
G36*
X180142779Y-81187144D02*
G01*
X180165834Y-81190563D01*
X180188443Y-81196227D01*
X180210387Y-81204079D01*
X180231457Y-81214044D01*
X180251448Y-81226026D01*
X180270168Y-81239910D01*
X180287438Y-81255562D01*
X180303090Y-81272832D01*
X180316974Y-81291552D01*
X180328956Y-81311543D01*
X180338921Y-81332613D01*
X180346773Y-81354557D01*
X180352437Y-81377166D01*
X180355856Y-81400221D01*
X180357000Y-81423500D01*
X180357000Y-81898500D01*
X180355856Y-81921779D01*
X180352437Y-81944834D01*
X180346773Y-81967443D01*
X180338921Y-81989387D01*
X180328956Y-82010457D01*
X180316974Y-82030448D01*
X180303090Y-82049168D01*
X180287438Y-82066438D01*
X180270168Y-82082090D01*
X180251448Y-82095974D01*
X180231457Y-82107956D01*
X180210387Y-82117921D01*
X180188443Y-82125773D01*
X180165834Y-82131437D01*
X180142779Y-82134856D01*
X180119500Y-82136000D01*
X179544500Y-82136000D01*
X179521221Y-82134856D01*
X179498166Y-82131437D01*
X179475557Y-82125773D01*
X179453613Y-82117921D01*
X179432543Y-82107956D01*
X179412552Y-82095974D01*
X179393832Y-82082090D01*
X179376562Y-82066438D01*
X179360910Y-82049168D01*
X179347026Y-82030448D01*
X179335044Y-82010457D01*
X179325079Y-81989387D01*
X179317227Y-81967443D01*
X179311563Y-81944834D01*
X179308144Y-81921779D01*
X179307000Y-81898500D01*
X179307000Y-81423500D01*
X179308144Y-81400221D01*
X179311563Y-81377166D01*
X179317227Y-81354557D01*
X179325079Y-81332613D01*
X179335044Y-81311543D01*
X179347026Y-81291552D01*
X179360910Y-81272832D01*
X179376562Y-81255562D01*
X179393832Y-81239910D01*
X179412552Y-81226026D01*
X179432543Y-81214044D01*
X179453613Y-81204079D01*
X179475557Y-81196227D01*
X179498166Y-81190563D01*
X179521221Y-81187144D01*
X179544500Y-81186000D01*
X180119500Y-81186000D01*
X180142779Y-81187144D01*
G37*
G36*
X181892779Y-81187144D02*
G01*
X181915834Y-81190563D01*
X181938443Y-81196227D01*
X181960387Y-81204079D01*
X181981457Y-81214044D01*
X182001448Y-81226026D01*
X182020168Y-81239910D01*
X182037438Y-81255562D01*
X182053090Y-81272832D01*
X182066974Y-81291552D01*
X182078956Y-81311543D01*
X182088921Y-81332613D01*
X182096773Y-81354557D01*
X182102437Y-81377166D01*
X182105856Y-81400221D01*
X182107000Y-81423500D01*
X182107000Y-81898500D01*
X182105856Y-81921779D01*
X182102437Y-81944834D01*
X182096773Y-81967443D01*
X182088921Y-81989387D01*
X182078956Y-82010457D01*
X182066974Y-82030448D01*
X182053090Y-82049168D01*
X182037438Y-82066438D01*
X182020168Y-82082090D01*
X182001448Y-82095974D01*
X181981457Y-82107956D01*
X181960387Y-82117921D01*
X181938443Y-82125773D01*
X181915834Y-82131437D01*
X181892779Y-82134856D01*
X181869500Y-82136000D01*
X181294500Y-82136000D01*
X181271221Y-82134856D01*
X181248166Y-82131437D01*
X181225557Y-82125773D01*
X181203613Y-82117921D01*
X181182543Y-82107956D01*
X181162552Y-82095974D01*
X181143832Y-82082090D01*
X181126562Y-82066438D01*
X181110910Y-82049168D01*
X181097026Y-82030448D01*
X181085044Y-82010457D01*
X181075079Y-81989387D01*
X181067227Y-81967443D01*
X181061563Y-81944834D01*
X181058144Y-81921779D01*
X181057000Y-81898500D01*
X181057000Y-81423500D01*
X181058144Y-81400221D01*
X181061563Y-81377166D01*
X181067227Y-81354557D01*
X181075079Y-81332613D01*
X181085044Y-81311543D01*
X181097026Y-81291552D01*
X181110910Y-81272832D01*
X181126562Y-81255562D01*
X181143832Y-81239910D01*
X181162552Y-81226026D01*
X181182543Y-81214044D01*
X181203613Y-81204079D01*
X181225557Y-81196227D01*
X181248166Y-81190563D01*
X181271221Y-81187144D01*
X181294500Y-81186000D01*
X181869500Y-81186000D01*
X181892779Y-81187144D01*
G37*
G36*
X181892779Y-82711144D02*
G01*
X181915834Y-82714563D01*
X181938443Y-82720227D01*
X181960387Y-82728079D01*
X181981457Y-82738044D01*
X182001448Y-82750026D01*
X182020168Y-82763910D01*
X182037438Y-82779562D01*
X182053090Y-82796832D01*
X182066974Y-82815552D01*
X182078956Y-82835543D01*
X182088921Y-82856613D01*
X182096773Y-82878557D01*
X182102437Y-82901166D01*
X182105856Y-82924221D01*
X182107000Y-82947500D01*
X182107000Y-83422500D01*
X182105856Y-83445779D01*
X182102437Y-83468834D01*
X182096773Y-83491443D01*
X182088921Y-83513387D01*
X182078956Y-83534457D01*
X182066974Y-83554448D01*
X182053090Y-83573168D01*
X182037438Y-83590438D01*
X182020168Y-83606090D01*
X182001448Y-83619974D01*
X181981457Y-83631956D01*
X181960387Y-83641921D01*
X181938443Y-83649773D01*
X181915834Y-83655437D01*
X181892779Y-83658856D01*
X181869500Y-83660000D01*
X181294500Y-83660000D01*
X181271221Y-83658856D01*
X181248166Y-83655437D01*
X181225557Y-83649773D01*
X181203613Y-83641921D01*
X181182543Y-83631956D01*
X181162552Y-83619974D01*
X181143832Y-83606090D01*
X181126562Y-83590438D01*
X181110910Y-83573168D01*
X181097026Y-83554448D01*
X181085044Y-83534457D01*
X181075079Y-83513387D01*
X181067227Y-83491443D01*
X181061563Y-83468834D01*
X181058144Y-83445779D01*
X181057000Y-83422500D01*
X181057000Y-82947500D01*
X181058144Y-82924221D01*
X181061563Y-82901166D01*
X181067227Y-82878557D01*
X181075079Y-82856613D01*
X181085044Y-82835543D01*
X181097026Y-82815552D01*
X181110910Y-82796832D01*
X181126562Y-82779562D01*
X181143832Y-82763910D01*
X181162552Y-82750026D01*
X181182543Y-82738044D01*
X181203613Y-82728079D01*
X181225557Y-82720227D01*
X181248166Y-82714563D01*
X181271221Y-82711144D01*
X181294500Y-82710000D01*
X181869500Y-82710000D01*
X181892779Y-82711144D01*
G37*
G36*
X180142779Y-82711144D02*
G01*
X180165834Y-82714563D01*
X180188443Y-82720227D01*
X180210387Y-82728079D01*
X180231457Y-82738044D01*
X180251448Y-82750026D01*
X180270168Y-82763910D01*
X180287438Y-82779562D01*
X180303090Y-82796832D01*
X180316974Y-82815552D01*
X180328956Y-82835543D01*
X180338921Y-82856613D01*
X180346773Y-82878557D01*
X180352437Y-82901166D01*
X180355856Y-82924221D01*
X180357000Y-82947500D01*
X180357000Y-83422500D01*
X180355856Y-83445779D01*
X180352437Y-83468834D01*
X180346773Y-83491443D01*
X180338921Y-83513387D01*
X180328956Y-83534457D01*
X180316974Y-83554448D01*
X180303090Y-83573168D01*
X180287438Y-83590438D01*
X180270168Y-83606090D01*
X180251448Y-83619974D01*
X180231457Y-83631956D01*
X180210387Y-83641921D01*
X180188443Y-83649773D01*
X180165834Y-83655437D01*
X180142779Y-83658856D01*
X180119500Y-83660000D01*
X179544500Y-83660000D01*
X179521221Y-83658856D01*
X179498166Y-83655437D01*
X179475557Y-83649773D01*
X179453613Y-83641921D01*
X179432543Y-83631956D01*
X179412552Y-83619974D01*
X179393832Y-83606090D01*
X179376562Y-83590438D01*
X179360910Y-83573168D01*
X179347026Y-83554448D01*
X179335044Y-83534457D01*
X179325079Y-83513387D01*
X179317227Y-83491443D01*
X179311563Y-83468834D01*
X179308144Y-83445779D01*
X179307000Y-83422500D01*
X179307000Y-82947500D01*
X179308144Y-82924221D01*
X179311563Y-82901166D01*
X179317227Y-82878557D01*
X179325079Y-82856613D01*
X179335044Y-82835543D01*
X179347026Y-82815552D01*
X179360910Y-82796832D01*
X179376562Y-82779562D01*
X179393832Y-82763910D01*
X179412552Y-82750026D01*
X179432543Y-82738044D01*
X179453613Y-82728079D01*
X179475557Y-82720227D01*
X179498166Y-82714563D01*
X179521221Y-82711144D01*
X179544500Y-82710000D01*
X180119500Y-82710000D01*
X180142779Y-82711144D01*
G37*
D11*
X163576000Y-66548000D03*
X162626000Y-66548000D03*
X161676000Y-66548000D03*
X161676000Y-64348000D03*
X163576000Y-64348000D03*
D12*
X175500000Y-56692000D03*
D13*
X175500000Y-62992000D03*
X173200000Y-62992000D03*
X177800000Y-62992000D03*
D10*
G36*
X201986779Y-40674144D02*
G01*
X202009834Y-40677563D01*
X202032443Y-40683227D01*
X202054387Y-40691079D01*
X202075457Y-40701044D01*
X202095448Y-40713026D01*
X202114168Y-40726910D01*
X202131438Y-40742562D01*
X202147090Y-40759832D01*
X202160974Y-40778552D01*
X202172956Y-40798543D01*
X202182921Y-40819613D01*
X202190773Y-40841557D01*
X202196437Y-40864166D01*
X202199856Y-40887221D01*
X202201000Y-40910500D01*
X202201000Y-41385500D01*
X202199856Y-41408779D01*
X202196437Y-41431834D01*
X202190773Y-41454443D01*
X202182921Y-41476387D01*
X202172956Y-41497457D01*
X202160974Y-41517448D01*
X202147090Y-41536168D01*
X202131438Y-41553438D01*
X202114168Y-41569090D01*
X202095448Y-41582974D01*
X202075457Y-41594956D01*
X202054387Y-41604921D01*
X202032443Y-41612773D01*
X202009834Y-41618437D01*
X201986779Y-41621856D01*
X201963500Y-41623000D01*
X201388500Y-41623000D01*
X201365221Y-41621856D01*
X201342166Y-41618437D01*
X201319557Y-41612773D01*
X201297613Y-41604921D01*
X201276543Y-41594956D01*
X201256552Y-41582974D01*
X201237832Y-41569090D01*
X201220562Y-41553438D01*
X201204910Y-41536168D01*
X201191026Y-41517448D01*
X201179044Y-41497457D01*
X201169079Y-41476387D01*
X201161227Y-41454443D01*
X201155563Y-41431834D01*
X201152144Y-41408779D01*
X201151000Y-41385500D01*
X201151000Y-40910500D01*
X201152144Y-40887221D01*
X201155563Y-40864166D01*
X201161227Y-40841557D01*
X201169079Y-40819613D01*
X201179044Y-40798543D01*
X201191026Y-40778552D01*
X201204910Y-40759832D01*
X201220562Y-40742562D01*
X201237832Y-40726910D01*
X201256552Y-40713026D01*
X201276543Y-40701044D01*
X201297613Y-40691079D01*
X201319557Y-40683227D01*
X201342166Y-40677563D01*
X201365221Y-40674144D01*
X201388500Y-40673000D01*
X201963500Y-40673000D01*
X201986779Y-40674144D01*
G37*
G36*
X203736779Y-40674144D02*
G01*
X203759834Y-40677563D01*
X203782443Y-40683227D01*
X203804387Y-40691079D01*
X203825457Y-40701044D01*
X203845448Y-40713026D01*
X203864168Y-40726910D01*
X203881438Y-40742562D01*
X203897090Y-40759832D01*
X203910974Y-40778552D01*
X203922956Y-40798543D01*
X203932921Y-40819613D01*
X203940773Y-40841557D01*
X203946437Y-40864166D01*
X203949856Y-40887221D01*
X203951000Y-40910500D01*
X203951000Y-41385500D01*
X203949856Y-41408779D01*
X203946437Y-41431834D01*
X203940773Y-41454443D01*
X203932921Y-41476387D01*
X203922956Y-41497457D01*
X203910974Y-41517448D01*
X203897090Y-41536168D01*
X203881438Y-41553438D01*
X203864168Y-41569090D01*
X203845448Y-41582974D01*
X203825457Y-41594956D01*
X203804387Y-41604921D01*
X203782443Y-41612773D01*
X203759834Y-41618437D01*
X203736779Y-41621856D01*
X203713500Y-41623000D01*
X203138500Y-41623000D01*
X203115221Y-41621856D01*
X203092166Y-41618437D01*
X203069557Y-41612773D01*
X203047613Y-41604921D01*
X203026543Y-41594956D01*
X203006552Y-41582974D01*
X202987832Y-41569090D01*
X202970562Y-41553438D01*
X202954910Y-41536168D01*
X202941026Y-41517448D01*
X202929044Y-41497457D01*
X202919079Y-41476387D01*
X202911227Y-41454443D01*
X202905563Y-41431834D01*
X202902144Y-41408779D01*
X202901000Y-41385500D01*
X202901000Y-40910500D01*
X202902144Y-40887221D01*
X202905563Y-40864166D01*
X202911227Y-40841557D01*
X202919079Y-40819613D01*
X202929044Y-40798543D01*
X202941026Y-40778552D01*
X202954910Y-40759832D01*
X202970562Y-40742562D01*
X202987832Y-40726910D01*
X203006552Y-40713026D01*
X203026543Y-40701044D01*
X203047613Y-40691079D01*
X203069557Y-40683227D01*
X203092166Y-40677563D01*
X203115221Y-40674144D01*
X203138500Y-40673000D01*
X203713500Y-40673000D01*
X203736779Y-40674144D01*
G37*
G36*
X202268779Y-48040144D02*
G01*
X202291834Y-48043563D01*
X202314443Y-48049227D01*
X202336387Y-48057079D01*
X202357457Y-48067044D01*
X202377448Y-48079026D01*
X202396168Y-48092910D01*
X202413438Y-48108562D01*
X202429090Y-48125832D01*
X202442974Y-48144552D01*
X202454956Y-48164543D01*
X202464921Y-48185613D01*
X202472773Y-48207557D01*
X202478437Y-48230166D01*
X202481856Y-48253221D01*
X202483000Y-48276500D01*
X202483000Y-48751500D01*
X202481856Y-48774779D01*
X202478437Y-48797834D01*
X202472773Y-48820443D01*
X202464921Y-48842387D01*
X202454956Y-48863457D01*
X202442974Y-48883448D01*
X202429090Y-48902168D01*
X202413438Y-48919438D01*
X202396168Y-48935090D01*
X202377448Y-48948974D01*
X202357457Y-48960956D01*
X202336387Y-48970921D01*
X202314443Y-48978773D01*
X202291834Y-48984437D01*
X202268779Y-48987856D01*
X202245500Y-48989000D01*
X201670500Y-48989000D01*
X201647221Y-48987856D01*
X201624166Y-48984437D01*
X201601557Y-48978773D01*
X201579613Y-48970921D01*
X201558543Y-48960956D01*
X201538552Y-48948974D01*
X201519832Y-48935090D01*
X201502562Y-48919438D01*
X201486910Y-48902168D01*
X201473026Y-48883448D01*
X201461044Y-48863457D01*
X201451079Y-48842387D01*
X201443227Y-48820443D01*
X201437563Y-48797834D01*
X201434144Y-48774779D01*
X201433000Y-48751500D01*
X201433000Y-48276500D01*
X201434144Y-48253221D01*
X201437563Y-48230166D01*
X201443227Y-48207557D01*
X201451079Y-48185613D01*
X201461044Y-48164543D01*
X201473026Y-48144552D01*
X201486910Y-48125832D01*
X201502562Y-48108562D01*
X201519832Y-48092910D01*
X201538552Y-48079026D01*
X201558543Y-48067044D01*
X201579613Y-48057079D01*
X201601557Y-48049227D01*
X201624166Y-48043563D01*
X201647221Y-48040144D01*
X201670500Y-48039000D01*
X202245500Y-48039000D01*
X202268779Y-48040144D01*
G37*
G36*
X204018779Y-48040144D02*
G01*
X204041834Y-48043563D01*
X204064443Y-48049227D01*
X204086387Y-48057079D01*
X204107457Y-48067044D01*
X204127448Y-48079026D01*
X204146168Y-48092910D01*
X204163438Y-48108562D01*
X204179090Y-48125832D01*
X204192974Y-48144552D01*
X204204956Y-48164543D01*
X204214921Y-48185613D01*
X204222773Y-48207557D01*
X204228437Y-48230166D01*
X204231856Y-48253221D01*
X204233000Y-48276500D01*
X204233000Y-48751500D01*
X204231856Y-48774779D01*
X204228437Y-48797834D01*
X204222773Y-48820443D01*
X204214921Y-48842387D01*
X204204956Y-48863457D01*
X204192974Y-48883448D01*
X204179090Y-48902168D01*
X204163438Y-48919438D01*
X204146168Y-48935090D01*
X204127448Y-48948974D01*
X204107457Y-48960956D01*
X204086387Y-48970921D01*
X204064443Y-48978773D01*
X204041834Y-48984437D01*
X204018779Y-48987856D01*
X203995500Y-48989000D01*
X203420500Y-48989000D01*
X203397221Y-48987856D01*
X203374166Y-48984437D01*
X203351557Y-48978773D01*
X203329613Y-48970921D01*
X203308543Y-48960956D01*
X203288552Y-48948974D01*
X203269832Y-48935090D01*
X203252562Y-48919438D01*
X203236910Y-48902168D01*
X203223026Y-48883448D01*
X203211044Y-48863457D01*
X203201079Y-48842387D01*
X203193227Y-48820443D01*
X203187563Y-48797834D01*
X203184144Y-48774779D01*
X203183000Y-48751500D01*
X203183000Y-48276500D01*
X203184144Y-48253221D01*
X203187563Y-48230166D01*
X203193227Y-48207557D01*
X203201079Y-48185613D01*
X203211044Y-48164543D01*
X203223026Y-48144552D01*
X203236910Y-48125832D01*
X203252562Y-48108562D01*
X203269832Y-48092910D01*
X203288552Y-48079026D01*
X203308543Y-48067044D01*
X203329613Y-48057079D01*
X203351557Y-48049227D01*
X203374166Y-48043563D01*
X203397221Y-48040144D01*
X203420500Y-48039000D01*
X203995500Y-48039000D01*
X204018779Y-48040144D01*
G37*
M02*
