EESchema Schematic File Version 4
EELAYER 30 0
EELAYER END
$Descr A4 11693 8268
encoding utf-8
Sheet 1 1
Title ""
Date ""
Rev ""
Comp ""
Comment1 ""
Comment2 ""
Comment3 ""
Comment4 ""
$EndDescr
$Comp
L Connector_Generic:Conn_01x02 J1
U 1 1 5D765442
P 800 3300
F 0 "J1" H 800 3100 50  0000 C CNN
F 1 "PWR_BATT" V 900 3250 50  0000 C CNN
F 2 "Connector_PinHeader_2.54mm:PinHeader_1x02_P2.54mm_Horizontal" H 800 3300 50  0001 C CNN
F 3 "~" H 800 3300 50  0001 C CNN
	1    800  3300
	-1   0    0    1   
$EndComp
Wire Wire Line
	1600 2950 1600 3200
$Comp
L power:GND #PWR06
U 1 1 5D766A71
P 1600 3950
F 0 "#PWR06" H 1600 3700 50  0001 C CNN
F 1 "GND" H 1605 3777 50  0000 C CNN
F 2 "" H 1600 3950 50  0001 C CNN
F 3 "" H 1600 3950 50  0001 C CNN
	1    1600 3950
	1    0    0    -1  
$EndComp
$Comp
L Device:C C9
U 1 1 5D7693DC
P 8900 1050
F 0 "C9" V 8850 950 50  0000 C CNN
F 1 "100nF" V 8950 850 50  0000 C CNN
F 2 "Capacitor_SMD:C_0603_1608Metric_Pad1.05x0.95mm_HandSolder" H 8938 900 50  0001 C CNN
F 3 "~" H 8900 1050 50  0001 C CNN
	1    8900 1050
	0    1    1    0   
$EndComp
$Comp
L Device:C C8
U 1 1 5D7697AF
P 8900 850
F 0 "C8" V 8850 750 50  0000 C CNN
F 1 "47uF" V 8950 700 50  0000 C CNN
F 2 "Capacitor_SMD:C_1206_3216Metric_Pad1.42x1.75mm_HandSolder" H 8938 700 50  0001 C CNN
F 3 "~" H 8900 850 50  0001 C CNN
	1    8900 850 
	0    1    1    0   
$EndComp
$Comp
L power:GND #PWR038
U 1 1 5D76E297
P 9100 3900
F 0 "#PWR038" H 9100 3650 50  0001 C CNN
F 1 "GND" H 9105 3727 50  0000 C CNN
F 2 "" H 9100 3900 50  0001 C CNN
F 3 "" H 9100 3900 50  0001 C CNN
	1    9100 3900
	1    0    0    -1  
$EndComp
Wire Wire Line
	9050 850  9100 850 
Wire Wire Line
	9100 850  9100 1050
Wire Wire Line
	9050 1050 9100 1050
Connection ~ 9100 1050
Wire Wire Line
	9100 1050 9100 1100
$Comp
L power:GND #PWR034
U 1 1 5D77FFA0
P 8600 850
F 0 "#PWR034" H 8600 600 50  0001 C CNN
F 1 "GND" V 8605 722 50  0000 R CNN
F 2 "" H 8600 850 50  0001 C CNN
F 3 "" H 8600 850 50  0001 C CNN
	1    8600 850 
	0    1    1    0   
$EndComp
$Comp
L power:GND #PWR035
U 1 1 5D781695
P 8600 1050
F 0 "#PWR035" H 8600 800 50  0001 C CNN
F 1 "GND" V 8605 922 50  0000 R CNN
F 2 "" H 8600 1050 50  0001 C CNN
F 3 "" H 8600 1050 50  0001 C CNN
	1    8600 1050
	0    1    1    0   
$EndComp
$Comp
L power:+3V3 #PWR037
U 1 1 5D781935
P 9100 750
F 0 "#PWR037" H 9100 600 50  0001 C CNN
F 1 "+3V3" H 9115 923 50  0000 C CNN
F 2 "" H 9100 750 50  0001 C CNN
F 3 "" H 9100 750 50  0001 C CNN
	1    9100 750 
	1    0    0    -1  
$EndComp
Wire Wire Line
	9100 750  9100 850 
Connection ~ 9100 850 
$Comp
L power:GND #PWR03
U 1 1 5D78E6C0
P 1250 6500
F 0 "#PWR03" H 1250 6250 50  0001 C CNN
F 1 "GND" H 1255 6327 50  0000 C CNN
F 2 "" H 1250 6500 50  0001 C CNN
F 3 "" H 1250 6500 50  0001 C CNN
	1    1250 6500
	1    0    0    -1  
$EndComp
Wire Wire Line
	1200 6450 1250 6450
Wire Wire Line
	1250 6450 1250 6500
$Comp
L Device:R R2
U 1 1 5D79127E
P 1450 6250
F 0 "R2" V 1450 6250 50  0000 C CNN
F 1 "330R" V 1400 6450 50  0000 C CNN
F 2 "Resistor_SMD:R_0603_1608Metric_Pad1.05x0.95mm_HandSolder" V 1380 6250 50  0001 C CNN
F 3 "~" H 1450 6250 50  0001 C CNN
	1    1450 6250
	0    1    1    0   
$EndComp
$Comp
L Device:R R4
U 1 1 5D791539
P 1750 6350
F 0 "R4" V 1750 6350 50  0000 C CNN
F 1 "330R" V 1850 6350 50  0000 C CNN
F 2 "Resistor_SMD:R_0603_1608Metric_Pad1.05x0.95mm_HandSolder" V 1680 6350 50  0001 C CNN
F 3 "~" H 1750 6350 50  0001 C CNN
	1    1750 6350
	0    1    1    0   
$EndComp
Wire Wire Line
	1300 6250 1200 6250
Wire Wire Line
	1200 6350 1600 6350
Wire Wire Line
	9700 1400 9850 1400
Wire Wire Line
	9700 1600 9850 1600
Text Label 9850 1400 0    50   ~ 0
TXD0
Text Label 9850 1600 0    50   ~ 0
RXD0
Wire Wire Line
	1600 6250 2000 6250
Wire Wire Line
	1900 6350 2000 6350
Text Label 2000 6350 0    50   ~ 0
RXD0
Text Label 2000 6250 0    50   ~ 0
TXD0
$Comp
L Connector_Generic:Conn_01x05 J3
U 1 1 5D79780F
P 1000 6250
F 0 "J3" H 1000 5950 50  0000 C CNN
F 1 "Programming" V 1100 6250 50  0000 C CNN
F 2 "Connector_PinSocket_2.54mm:PinSocket_1x05_P2.54mm_Vertical" H 1000 6250 50  0001 C CNN
F 3 "~" H 1000 6250 50  0001 C CNN
	1    1000 6250
	-1   0    0    1   
$EndComp
$Comp
L Device:R R12
U 1 1 5D79816B
P 3550 6200
F 0 "R12" V 3550 6200 50  0000 C CNN
F 1 "12k" V 3650 6200 50  0000 C CNN
F 2 "Resistor_SMD:R_0603_1608Metric_Pad1.05x0.95mm_HandSolder" V 3480 6200 50  0001 C CNN
F 3 "~" H 3550 6200 50  0001 C CNN
	1    3550 6200
	0    1    1    0   
$EndComp
$Comp
L Device:R R13
U 1 1 5D7985EB
P 3550 6800
F 0 "R13" V 3550 6800 50  0000 C CNN
F 1 "12k" V 3650 6800 50  0000 C CNN
F 2 "Resistor_SMD:R_0603_1608Metric_Pad1.05x0.95mm_HandSolder" V 3480 6800 50  0001 C CNN
F 3 "~" H 3550 6800 50  0001 C CNN
	1    3550 6800
	0    1    1    0   
$EndComp
Text Label 2000 6150 0    50   ~ 0
DTR
Text Label 2000 6050 0    50   ~ 0
RTS
Wire Wire Line
	9700 1300 9850 1300
Text Label 9850 1300 0    50   ~ 0
BOOT
Wire Wire Line
	9700 2400 9850 2400
Wire Wire Line
	9700 2300 9850 2300
Text Label 9850 2300 0    50   ~ 0
UI_RXD_PIN
Text Label 9850 2400 0    50   ~ 0
UI_TXD_PIN
$Comp
L Connector_Generic:Conn_01x03 J4
U 1 1 5D7F7676
P 1000 7200
F 0 "J4" H 1000 7000 50  0000 C CNN
F 1 "User_Interface" V 1100 7200 50  0000 C CNN
F 2 "Connector_PinSocket_2.54mm:PinSocket_1x03_P2.54mm_Vertical" H 1000 7200 50  0001 C CNN
F 3 "~" H 1000 7200 50  0001 C CNN
	1    1000 7200
	-1   0    0    1   
$EndComp
$Comp
L Device:R R3
U 1 1 5D7F83FB
P 1450 7100
F 0 "R3" V 1450 7100 50  0000 C CNN
F 1 "330R" V 1334 7100 50  0000 C CNN
F 2 "Resistor_SMD:R_0603_1608Metric_Pad1.05x0.95mm_HandSolder" V 1380 7100 50  0001 C CNN
F 3 "~" H 1450 7100 50  0001 C CNN
	1    1450 7100
	0    1    1    0   
$EndComp
$Comp
L Device:R R5
U 1 1 5D7F8DB1
P 1750 7200
F 0 "R5" V 1750 7200 50  0000 C CNN
F 1 "330R" V 1850 7200 50  0000 C CNN
F 2 "Resistor_SMD:R_0603_1608Metric_Pad1.05x0.95mm_HandSolder" V 1680 7200 50  0001 C CNN
F 3 "~" H 1750 7200 50  0001 C CNN
	1    1750 7200
	0    1    1    0   
$EndComp
Wire Wire Line
	1200 7100 1300 7100
Wire Wire Line
	1200 7200 1600 7200
$Comp
L power:GND #PWR04
U 1 1 5D7FC01F
P 1250 7350
F 0 "#PWR04" H 1250 7100 50  0001 C CNN
F 1 "GND" H 1255 7177 50  0000 C CNN
F 2 "" H 1250 7350 50  0001 C CNN
F 3 "" H 1250 7350 50  0001 C CNN
	1    1250 7350
	1    0    0    -1  
$EndComp
Wire Wire Line
	1200 7300 1250 7300
Wire Wire Line
	1250 7300 1250 7350
Wire Wire Line
	1600 7100 2000 7100
Wire Wire Line
	1900 7200 2000 7200
Text Label 2000 7200 0    50   ~ 0
UI_RXD_PIN
Text Label 2000 7100 0    50   ~ 0
UI_TXD_PIN
$Comp
L Transistor_BJT:BC817 Q1
U 1 1 5D81092D
P 3950 6200
F 0 "Q1" H 3750 6400 50  0000 L CNN
F 1 "BC817" H 3650 6300 50  0000 L CNN
F 2 "Package_TO_SOT_SMD:SC-59_Handsoldering" H 3950 6200 50  0001 L CNN
F 3 "" H 3950 6200 50  0001 L CNN
	1    3950 6200
	1    0    0    -1  
$EndComp
$Comp
L Transistor_BJT:BC817 Q2
U 1 1 5D82C928
P 3950 6800
F 0 "Q2" H 3750 6650 50  0000 L CNN
F 1 "BC817" H 3650 6750 50  0000 L CNN
F 2 "Package_TO_SOT_SMD:SC-59_Handsoldering" H 3950 6800 50  0001 L CNN
F 3 "" H 3950 6800 50  0001 L CNN
	1    3950 6800
	1    0    0    1   
$EndComp
Wire Wire Line
	4050 6600 4050 6550
Wire Wire Line
	3300 6550 3300 6200
Wire Wire Line
	3300 6200 3100 6200
Wire Wire Line
	4050 6400 4050 6450
Wire Wire Line
	3250 6450 3250 6800
Wire Wire Line
	3250 6800 3100 6800
Wire Wire Line
	4050 6000 4050 5950
Wire Wire Line
	4050 5950 4250 5950
Wire Wire Line
	4050 7000 4050 7050
Wire Wire Line
	4050 7050 4250 7050
Text Label 4450 7050 0    50   ~ 0
BOOT
Text Label 4400 5950 0    50   ~ 0
EN
Wire Wire Line
	8500 1300 8350 1300
Text Label 8350 1300 2    50   ~ 0
EN
Text Label 3100 6200 2    50   ~ 0
DTR
Text Label 3100 6800 2    50   ~ 0
RTS
Wire Wire Line
	8750 850  8600 850 
Wire Wire Line
	8600 1050 8750 1050
$Comp
L Mechanical:MountingHole H1
U 1 1 5D899E96
P 5250 7300
F 0 "H1" H 5350 7346 50  0000 L CNN
F 1 "MountingHole" H 5350 7255 50  0000 L CNN
F 2 "MountingHole:MountingHole_3.2mm_M3" H 5250 7300 50  0001 C CNN
F 3 "~" H 5250 7300 50  0001 C CNN
	1    5250 7300
	1    0    0    -1  
$EndComp
$Comp
L Mechanical:MountingHole H2
U 1 1 5D89A8B6
P 5250 7550
F 0 "H2" H 5350 7596 50  0000 L CNN
F 1 "MountingHole" H 5350 7505 50  0000 L CNN
F 2 "MountingHole:MountingHole_3.2mm_M3" H 5250 7550 50  0001 C CNN
F 3 "~" H 5250 7550 50  0001 C CNN
	1    5250 7550
	1    0    0    -1  
$EndComp
$Comp
L Mechanical:MountingHole H3
U 1 1 5D89AB74
P 6200 7300
F 0 "H3" H 6300 7346 50  0000 L CNN
F 1 "MountingHole" H 6300 7255 50  0000 L CNN
F 2 "MountingHole:MountingHole_3.2mm_M3" H 6200 7300 50  0001 C CNN
F 3 "~" H 6200 7300 50  0001 C CNN
	1    6200 7300
	1    0    0    -1  
$EndComp
$Comp
L Mechanical:MountingHole H4
U 1 1 5D89ADDF
P 6200 7550
F 0 "H4" H 6300 7596 50  0000 L CNN
F 1 "MountingHole" H 6300 7505 50  0000 L CNN
F 2 "MountingHole:MountingHole_3.2mm_M3" H 6200 7550 50  0001 C CNN
F 3 "~" H 6200 7550 50  0001 C CNN
	1    6200 7550
	1    0    0    -1  
$EndComp
$Comp
L Connector:TestPoint TP4
U 1 1 5D91B66F
P 9850 3600
F 0 "TP4" V 9850 3800 50  0000 L CNN
F 1 "IO35" V 9750 4100 50  0001 L CNN
F 2 "TestPoint:TestPoint_Pad_D1.5mm" H 10050 3600 50  0001 C CNN
F 3 "~" H 10050 3600 50  0001 C CNN
	1    9850 3600
	0    1    1    0   
$EndComp
$Comp
L RF_Module:ESP32-WROOM-32 U3
U 1 1 5D75383F
P 9100 2500
F 0 "U3" H 9250 3950 50  0000 C CNN
F 1 "ESP32-WROOM-32" H 9550 3850 50  0000 C CNN
F 2 "RF_Module:ESP32-WROOM-32" H 9100 1000 50  0001 C CNN
F 3 "https://www.espressif.com/sites/default/files/documentation/esp32-wroom-32_datasheet_en.pdf" H 8800 2550 50  0001 C CNN
	1    9100 2500
	1    0    0    -1  
$EndComp
$Comp
L Device:R R15
U 1 1 5DBFF55F
P 4250 5750
F 0 "R15" V 4250 5750 50  0000 C CNN
F 1 "47k" V 4134 5750 50  0000 C CNN
F 2 "Resistor_SMD:R_0603_1608Metric_Pad1.05x0.95mm_HandSolder" V 4180 5750 50  0001 C CNN
F 3 "~" H 4250 5750 50  0001 C CNN
	1    4250 5750
	-1   0    0    1   
$EndComp
$Comp
L Device:R R16
U 1 1 5DC00506
P 4250 7250
F 0 "R16" V 4250 7250 50  0000 C CNN
F 1 "47k" V 4134 7250 50  0000 C CNN
F 2 "Resistor_SMD:R_0603_1608Metric_Pad1.05x0.95mm_HandSolder" V 4180 7250 50  0001 C CNN
F 3 "~" H 4250 7250 50  0001 C CNN
	1    4250 7250
	-1   0    0    1   
$EndComp
Wire Wire Line
	4250 7100 4250 7050
Connection ~ 4250 7050
Wire Wire Line
	4250 7050 4450 7050
Wire Wire Line
	4250 5900 4250 5950
Connection ~ 4250 5950
Wire Wire Line
	4250 5950 4400 5950
$Comp
L power:+3V3 #PWR019
U 1 1 5DC0D655
P 4250 5550
F 0 "#PWR019" H 4250 5400 50  0001 C CNN
F 1 "+3V3" H 4265 5723 50  0000 C CNN
F 2 "" H 4250 5550 50  0001 C CNN
F 3 "" H 4250 5550 50  0001 C CNN
	1    4250 5550
	1    0    0    -1  
$EndComp
Wire Wire Line
	4250 5550 4250 5600
$Comp
L power:+3V3 #PWR021
U 1 1 5DC13D33
P 4250 7450
F 0 "#PWR021" H 4250 7300 50  0001 C CNN
F 1 "+3V3" H 4265 7623 50  0000 C CNN
F 2 "" H 4250 7450 50  0001 C CNN
F 3 "" H 4250 7450 50  0001 C CNN
	1    4250 7450
	-1   0    0    1   
$EndComp
Wire Wire Line
	4250 7450 4250 7400
$Comp
L Device:C C7
U 1 1 5DC6021F
P 4250 6150
F 0 "C7" H 4400 6150 50  0000 C CNN
F 1 "1uF" H 4450 6050 50  0000 C CNN
F 2 "Capacitor_SMD:C_0603_1608Metric_Pad1.05x0.95mm_HandSolder" H 4288 6000 50  0001 C CNN
F 3 "~" H 4250 6150 50  0001 C CNN
	1    4250 6150
	1    0    0    -1  
$EndComp
Wire Wire Line
	1200 6050 2000 6050
Wire Wire Line
	1200 6150 2000 6150
Wire Wire Line
	3300 6200 3400 6200
Wire Wire Line
	3700 6200 3750 6200
Wire Wire Line
	3250 6450 4050 6450
Wire Wire Line
	3300 6550 4050 6550
Wire Wire Line
	3250 6800 3400 6800
Wire Wire Line
	3700 6800 3750 6800
Connection ~ 3250 6800
Connection ~ 3300 6200
Wire Wire Line
	4250 5950 4250 6000
$Comp
L power:GND #PWR020
U 1 1 5DC6B185
P 4250 6350
F 0 "#PWR020" H 4250 6100 50  0001 C CNN
F 1 "GND" V 4255 6222 50  0000 R CNN
F 2 "" H 4250 6350 50  0001 C CNN
F 3 "" H 4250 6350 50  0001 C CNN
	1    4250 6350
	1    0    0    -1  
$EndComp
Wire Wire Line
	4250 6300 4250 6350
Text Notes 4600 6400 0    50   ~ 0
Timing of DTR and RTS\nis not correct. Therefore\nEN signal have to be\ndelayed a bit (400 us and\nup) -> 100 nF cover that
Wire Wire Line
	10500 4800 10450 4800
$Comp
L Switch:SW_Push SW2
U 1 1 5D764B48
P 10250 4800
F 0 "SW2" H 10150 4900 50  0000 C CNN
F 1 "Up" H 10350 4900 50  0000 C CNN
F 2 "Button_Switch_THT:SW_PUSH_6mm_H7.3mm" H 10250 5000 50  0001 C CNN
F 3 "~" H 10250 5000 50  0001 C CNN
	1    10250 4800
	1    0    0    -1  
$EndComp
$Comp
L power:+BATT #PWR05
U 1 1 5E46A846
P 1600 2950
F 0 "#PWR05" H 1600 2800 50  0001 C CNN
F 1 "+BATT" H 1615 3123 50  0000 C CNN
F 2 "" H 1600 2950 50  0001 C CNN
F 3 "" H 1600 2950 50  0001 C CNN
	1    1600 2950
	1    0    0    -1  
$EndComp
$Comp
L Device:Polyfuse_Small F1
U 1 1 5E46C24C
P 1150 3200
F 0 "F1" V 945 3200 50  0000 C CNN
F 1 "0.75A ; 0.1R" V 1036 3200 50  0000 C CNN
F 2 "Resistor_SMD:R_1812_4532Metric_Pad1.30x3.40mm_HandSolder" H 1200 3000 50  0001 L CNN
F 3 "https://www.gme.cz/data/attachments/dsh.971-036.1.pdf" H 1150 3200 50  0001 C CNN
F 4 "R" H 1150 3200 50  0001 C CNN "Spice_Primitive"
F 5 "0.75" H 1150 3200 50  0001 C CNN "Spice_Model"
F 6 "Y" H 1150 3200 50  0001 C CNN "Spice_Netlist_Enabled"
	1    1150 3200
	0    1    1    0   
$EndComp
Wire Wire Line
	1000 3200 1050 3200
$Comp
L ANMLY_MTR-02-rescue:USB_B_Micro-Connector J5
U 1 1 5E47D000
P 1150 1150
F 0 "J5" H 1207 1617 50  0000 C CNN
F 1 "USB_B_Micro" H 1207 1526 50  0000 C CNN
F 2 "Connector_USB:USB_Micro-B_Molex_47346-0001" H 1300 1100 50  0001 C CNN
F 3 "~" H 1300 1100 50  0001 C CNN
	1    1150 1150
	1    0    0    -1  
$EndComp
$Comp
L Battery_Management:MCP73831-2-OT U1
U 1 1 5E4A94F1
P 3450 1300
F 0 "U1" H 3550 1650 50  0000 C CNN
F 1 "MCP73831-2-OT" H 3800 1550 50  0000 C CNN
F 2 "Package_TO_SOT_SMD:SOT-23-5" H 3500 1050 50  0001 L CIN
F 3 "http://ww1.microchip.com/downloads/en/DeviceDoc/20001984g.pdf" H 3300 1250 50  0001 C CNN
	1    3450 1300
	1    0    0    -1  
$EndComp
$Comp
L Device:R R1
U 1 1 5E4AB70A
P 700 1800
F 0 "R1" V 700 1800 50  0000 C CNN
F 1 "1M0" V 800 1800 50  0000 C CNN
F 2 "Resistor_SMD:R_0603_1608Metric_Pad1.05x0.95mm_HandSolder" V 630 1800 50  0001 C CNN
F 3 "~" H 700 1800 50  0001 C CNN
	1    700  1800
	-1   0    0    1   
$EndComp
$Comp
L Device:C C1
U 1 1 5E4AC283
P 900 1800
F 0 "C1" H 950 1900 50  0000 L CNN
F 1 "10nF" H 950 1700 50  0000 L CNN
F 2 "Capacitor_SMD:C_0603_1608Metric_Pad1.05x0.95mm_HandSolder" H 938 1650 50  0001 C CNN
F 3 "~" H 900 1800 50  0001 C CNN
	1    900  1800
	1    0    0    -1  
$EndComp
$Comp
L power:GND #PWR01
U 1 1 5E4ACBC5
P 1150 2200
F 0 "#PWR01" H 1150 1950 50  0001 C CNN
F 1 "GND" H 1155 2027 50  0000 C CNN
F 2 "" H 1150 2200 50  0001 C CNN
F 3 "" H 1150 2200 50  0001 C CNN
	1    1150 2200
	1    0    0    -1  
$EndComp
Wire Wire Line
	1050 1600 900  1600
Wire Wire Line
	700  1600 700  1650
Wire Wire Line
	900  1650 900  1600
Connection ~ 900  1600
Wire Wire Line
	900  1600 700  1600
Wire Wire Line
	700  1950 700  2000
Wire Wire Line
	700  2000 900  2000
Connection ~ 1150 2000
Wire Wire Line
	1150 2000 1150 2200
Wire Wire Line
	900  1950 900  2000
Connection ~ 900  2000
Wire Wire Line
	900  2000 1150 2000
$Comp
L Device:CP C6
U 1 1 5E4D82FB
P 4700 1450
F 0 "C6" H 4818 1496 50  0000 L CNN
F 1 "4u7" H 4818 1405 50  0000 L CNN
F 2 "Capacitor_Tantalum_SMD:CP_EIA-3216-18_Kemet-A_Pad1.58x1.35mm_HandSolder" H 4738 1300 50  0001 C CNN
F 3 "~" H 4700 1450 50  0001 C CNN
	1    4700 1450
	1    0    0    -1  
$EndComp
$Comp
L Device:R R10
U 1 1 5E4DA6DA
P 3000 1600
F 0 "R10" V 3000 1600 50  0000 C CNN
F 1 "6k8" V 3100 1600 50  0000 C CNN
F 2 "Resistor_SMD:R_0603_1608Metric_Pad1.05x0.95mm_HandSolder" V 2930 1600 50  0001 C CNN
F 3 "~" H 3000 1600 50  0001 C CNN
	1    3000 1600
	-1   0    0    1   
$EndComp
$Comp
L Device:CP C2
U 1 1 5E4DADF5
P 1700 1150
F 0 "C2" H 1818 1196 50  0000 L CNN
F 1 "4u7" H 1818 1105 50  0000 L CNN
F 2 "Capacitor_Tantalum_SMD:CP_EIA-3216-18_Kemet-A_Pad1.58x1.35mm_HandSolder" H 1738 1000 50  0001 C CNN
F 3 "~" H 1700 1150 50  0001 C CNN
	1    1700 1150
	1    0    0    -1  
$EndComp
Wire Wire Line
	3450 1000 3450 950 
Wire Wire Line
	1700 950  1700 1000
$Comp
L power:GND #PWR08
U 1 1 5E4EE89D
P 1700 2200
F 0 "#PWR08" H 1700 1950 50  0001 C CNN
F 1 "GND" H 1705 2027 50  0000 C CNN
F 2 "" H 1700 2200 50  0001 C CNN
F 3 "" H 1700 2200 50  0001 C CNN
	1    1700 2200
	1    0    0    -1  
$EndComp
Wire Wire Line
	1700 1300 1700 2200
Wire Wire Line
	1450 950  1700 950 
Connection ~ 1700 950 
Wire Wire Line
	1050 1550 1050 1600
Wire Wire Line
	1150 1550 1150 2000
NoConn ~ 1450 1150
NoConn ~ 1450 1250
NoConn ~ 1450 1350
Wire Wire Line
	3050 1400 3000 1400
Wire Wire Line
	3000 1400 3000 1450
$Comp
L power:GND #PWR011
U 1 1 5E51B7CA
P 3000 2200
F 0 "#PWR011" H 3000 1950 50  0001 C CNN
F 1 "GND" H 3005 2027 50  0000 C CNN
F 2 "" H 3000 2200 50  0001 C CNN
F 3 "" H 3000 2200 50  0001 C CNN
	1    3000 2200
	1    0    0    -1  
$EndComp
Wire Wire Line
	3000 1750 3000 2200
$Comp
L power:GND #PWR012
U 1 1 5E51F742
P 3450 2200
F 0 "#PWR012" H 3450 1950 50  0001 C CNN
F 1 "GND" H 3455 2027 50  0000 C CNN
F 2 "" H 3450 2200 50  0001 C CNN
F 3 "" H 3450 2200 50  0001 C CNN
	1    3450 2200
	1    0    0    -1  
$EndComp
Wire Wire Line
	3450 1600 3450 2200
Text Notes 3150 1750 1    50   ~ 0
150mA
$Comp
L Device:LED D1
U 1 1 5E536062
P 3950 1650
F 0 "D1" V 3897 1728 50  0000 L CNN
F 1 "Red" V 3988 1728 50  0000 L CNN
F 2 "LED_SMD:LED_0603_1608Metric_Pad1.05x0.95mm_HandSolder" H 3950 1650 50  0001 C CNN
F 3 "~" H 3950 1650 50  0001 C CNN
	1    3950 1650
	0    1    1    0   
$EndComp
$Comp
L power:+5V #PWR07
U 1 1 5E541ECC
P 1700 850
F 0 "#PWR07" H 1700 700 50  0001 C CNN
F 1 "+5V" H 1715 1023 50  0000 C CNN
F 2 "" H 1700 850 50  0001 C CNN
F 3 "" H 1700 850 50  0001 C CNN
	1    1700 850 
	1    0    0    -1  
$EndComp
Wire Wire Line
	1700 850  1700 950 
$Comp
L Device:LED D2
U 1 1 5E545F26
P 4250 2000
F 0 "D2" V 4289 1883 50  0000 R CNN
F 1 "Green" V 4198 1883 50  0000 R CNN
F 2 "LED_SMD:LED_0603_1608Metric_Pad1.05x0.95mm_HandSolder" H 4250 2000 50  0001 C CNN
F 3 "~" H 4250 2000 50  0001 C CNN
	1    4250 2000
	0    -1   -1   0   
$EndComp
$Comp
L Device:R R11
U 1 1 5E5491A8
P 3950 2000
F 0 "R11" V 3950 2000 50  0000 C CNN
F 1 "680R" V 4050 2000 50  0000 C CNN
F 2 "Resistor_SMD:R_0603_1608Metric_Pad1.05x0.95mm_HandSolder" V 3880 2000 50  0001 C CNN
F 3 "~" H 3950 2000 50  0001 C CNN
	1    3950 2000
	1    0    0    -1  
$EndComp
$Comp
L Device:R R14
U 1 1 5E54B39F
P 4250 1650
F 0 "R14" V 4250 1650 50  0000 C CNN
F 1 "560R" V 4350 1650 50  0000 C CNN
F 2 "Resistor_SMD:R_0603_1608Metric_Pad1.05x0.95mm_HandSolder" V 4180 1650 50  0001 C CNN
F 3 "~" H 4250 1650 50  0001 C CNN
	1    4250 1650
	1    0    0    -1  
$EndComp
Wire Wire Line
	3850 1400 3950 1400
Wire Wire Line
	4250 1400 4250 1500
Wire Wire Line
	3950 1500 3950 1400
Connection ~ 3950 1400
Wire Wire Line
	3950 1400 4250 1400
Wire Wire Line
	4250 1800 4250 1850
Wire Wire Line
	3950 1800 3950 1850
$Comp
L power:+5V #PWR014
U 1 1 5E55A741
P 3950 2200
F 0 "#PWR014" H 3950 2050 50  0001 C CNN
F 1 "+5V" H 3965 2373 50  0000 C CNN
F 2 "" H 3950 2200 50  0001 C CNN
F 3 "" H 3950 2200 50  0001 C CNN
	1    3950 2200
	-1   0    0    1   
$EndComp
Wire Wire Line
	3950 2150 3950 2200
$Comp
L power:GND #PWR016
U 1 1 5E560839
P 4250 2200
F 0 "#PWR016" H 4250 1950 50  0001 C CNN
F 1 "GND" H 4255 2027 50  0000 C CNN
F 2 "" H 4250 2200 50  0001 C CNN
F 3 "" H 4250 2200 50  0001 C CNN
	1    4250 2200
	1    0    0    -1  
$EndComp
Wire Wire Line
	4250 2150 4250 2200
Wire Wire Line
	3850 1200 4700 1200
Wire Wire Line
	4700 1200 4700 1300
$Comp
L power:GND #PWR018
U 1 1 5E56DC43
P 4700 2200
F 0 "#PWR018" H 4700 1950 50  0001 C CNN
F 1 "GND" H 4705 2027 50  0000 C CNN
F 2 "" H 4700 2200 50  0001 C CNN
F 3 "" H 4700 2200 50  0001 C CNN
	1    4700 2200
	1    0    0    -1  
$EndComp
Wire Wire Line
	4700 1600 4700 2200
$Comp
L power:+BATT #PWR017
U 1 1 5E572F99
P 4700 1100
F 0 "#PWR017" H 4700 950 50  0001 C CNN
F 1 "+BATT" H 4715 1273 50  0000 C CNN
F 2 "" H 4700 1100 50  0001 C CNN
F 3 "" H 4700 1100 50  0001 C CNN
	1    4700 1100
	1    0    0    -1  
$EndComp
Wire Wire Line
	4700 1100 4700 1200
Connection ~ 4700 1200
$Comp
L Connector:Conn_01x08_Female J9
U 1 1 5E5D968D
P 5800 4900
F 0 "J9" H 5828 4876 50  0000 L CNN
F 1 "5110_bottom" H 5828 4785 50  0000 L CNN
F 2 "Connector_PinSocket_2.54mm:PinSocket_1x08_P2.54mm_Vertical" H 5800 4900 50  0001 C CNN
F 3 "~" H 5800 4900 50  0001 C CNN
	1    5800 4900
	1    0    0    -1  
$EndComp
$Comp
L power:GND #PWR031
U 1 1 5E5F1A13
P 5300 5350
F 0 "#PWR031" H 5300 5100 50  0001 C CNN
F 1 "GND" H 5305 5177 50  0000 C CNN
F 2 "" H 5300 5350 50  0001 C CNN
F 3 "" H 5300 5350 50  0001 C CNN
	1    5300 5350
	1    0    0    -1  
$EndComp
Wire Wire Line
	5600 5300 5300 5300
Wire Wire Line
	5300 5350 5300 5300
Wire Wire Line
	5600 4600 5300 4600
Text Label 5300 4600 2    50   ~ 0
EN
Wire Wire Line
	5300 4700 5600 4700
Text Label 5300 4700 2    50   ~ 0
VSPI_CS0
Text Label 5300 4800 2    50   ~ 0
LCD_DC
Wire Wire Line
	5300 4900 5600 4900
Text Label 5300 4900 2    50   ~ 0
VSPI_MISO
Wire Wire Line
	5300 5000 5600 5000
Text Label 5300 5000 2    50   ~ 0
VSPI_CLK
Wire Wire Line
	5300 5200 5600 5200
Wire Wire Line
	5450 5100 5450 4450
Wire Wire Line
	5450 5100 5600 5100
$Comp
L power:+3V3 #PWR033
U 1 1 5E629443
P 5450 4450
F 0 "#PWR033" H 5450 4300 50  0001 C CNN
F 1 "+3V3" H 5465 4623 50  0000 C CNN
F 2 "" H 5450 4450 50  0001 C CNN
F 3 "" H 5450 4450 50  0001 C CNN
	1    5450 4450
	1    0    0    -1  
$EndComp
Text Label 5300 5200 2    50   ~ 0
LCD_BCK_LGHT
$Comp
L Connector:Conn_01x08_Female J7
U 1 1 5E693D29
P 6000 3150
F 0 "J7" H 5892 3635 50  0000 C CNN
F 1 "GY-91" H 5892 3544 50  0000 C CNN
F 2 "Connector_PinSocket_2.54mm:PinSocket_1x08_P2.54mm_Vertical" H 6000 3150 50  0001 C CNN
F 3 "~" H 6000 3150 50  0001 C CNN
	1    6000 3150
	-1   0    0    -1  
$EndComp
Wire Wire Line
	9700 2600 9850 2600
Text Label 9850 2600 0    50   ~ 0
VSPI_MISO
Wire Wire Line
	9700 2500 9850 2500
Text Label 9850 2500 0    50   ~ 0
VSPI_CLK
Wire Wire Line
	9700 1800 9850 1800
Text Label 9850 1800 0    50   ~ 0
VSPI_CS0
Wire Wire Line
	9700 1700 9850 1700
Text Label 9850 1700 0    50   ~ 0
LCD_DC
Wire Wire Line
	9700 1500 9850 1500
Text Label 9850 1500 0    50   ~ 0
LCD_BCK_LGHT
$Comp
L power:GND #PWR026
U 1 1 5E6DFE97
P 6550 3050
F 0 "#PWR026" H 6550 2800 50  0001 C CNN
F 1 "GND" V 6555 2877 50  0000 C CNN
F 2 "" H 6550 3050 50  0001 C CNN
F 3 "" H 6550 3050 50  0001 C CNN
	1    6550 3050
	0    -1   -1   0   
$EndComp
Wire Wire Line
	6200 3050 6550 3050
$Comp
L power:+3V3 #PWR025
U 1 1 5E6E688F
P 6600 2950
F 0 "#PWR025" H 6600 2800 50  0001 C CNN
F 1 "+3V3" V 6615 3123 50  0000 C CNN
F 2 "" H 6600 2950 50  0001 C CNN
F 3 "" H 6600 2950 50  0001 C CNN
	1    6600 2950
	0    1    1    0   
$EndComp
Text Label 6300 2850 0    50   ~ 0
VIN
Wire Wire Line
	6200 3150 6300 3150
Text Label 6300 3150 0    50   ~ 0
I2C_SCL
Wire Wire Line
	6200 3250 6300 3250
Text Label 6300 3250 0    50   ~ 0
I2C_SDA
Text Label 6300 3350 0    50   ~ 0
SA0
Text Label 6300 3450 0    50   ~ 0
NCS
Text Label 6300 3550 0    50   ~ 0
CSB
$Comp
L Device:R R18
U 1 1 5E7172FE
P 7200 3450
F 0 "R18" V 7200 3450 50  0000 C CNN
F 1 "N.A." V 7200 3800 50  0000 C CNN
F 2 "Resistor_SMD:R_0603_1608Metric_Pad1.05x0.95mm_HandSolder" V 7130 3450 50  0001 C CNN
F 3 "~" H 7200 3450 50  0001 C CNN
	1    7200 3450
	0    1    1    0   
$EndComp
$Comp
L Device:R R17
U 1 1 5E752FE5
P 7200 3250
F 0 "R17" V 7200 3250 50  0000 C CNN
F 1 "N.A." V 7200 3600 50  0000 C CNN
F 2 "Resistor_SMD:R_0603_1608Metric_Pad1.05x0.95mm_HandSolder" V 7130 3250 50  0001 C CNN
F 3 "~" H 7200 3250 50  0001 C CNN
	1    7200 3250
	0    1    1    0   
$EndComp
$Comp
L Device:R R21
U 1 1 5E75EFCD
P 7200 3150
F 0 "R21" V 7200 3150 50  0000 C CNN
F 1 "N.A." V 7200 3500 50  0000 C CNN
F 2 "Resistor_SMD:R_0603_1608Metric_Pad1.05x0.95mm_HandSolder" V 7130 3150 50  0001 C CNN
F 3 "~" H 7200 3150 50  0001 C CNN
	1    7200 3150
	0    1    1    0   
$EndComp
$Comp
L power:GND #PWR030
U 1 1 5E75F1C9
P 7400 3700
F 0 "#PWR030" H 7400 3450 50  0001 C CNN
F 1 "GND" V 7405 3527 50  0000 C CNN
F 2 "" H 7400 3700 50  0001 C CNN
F 3 "" H 7400 3700 50  0001 C CNN
	1    7400 3700
	1    0    0    -1  
$EndComp
$Comp
L Device:R R20
U 1 1 5E789592
P 7200 3050
F 0 "R20" V 7200 3050 50  0000 C CNN
F 1 "N.A." V 7200 3400 50  0000 C CNN
F 2 "Resistor_SMD:R_0603_1608Metric_Pad1.05x0.95mm_HandSolder" V 7130 3050 50  0001 C CNN
F 3 "~" H 7200 3050 50  0001 C CNN
	1    7200 3050
	0    1    1    0   
$EndComp
$Comp
L power:+3V3 #PWR029
U 1 1 5E78A980
P 7450 2950
F 0 "#PWR029" H 7450 2800 50  0001 C CNN
F 1 "+3V3" V 7450 3150 50  0000 C CNN
F 2 "" H 7450 2950 50  0001 C CNN
F 3 "" H 7450 2950 50  0001 C CNN
	1    7450 2950
	1    0    0    -1  
$EndComp
Wire Wire Line
	7050 3050 6850 3050
Wire Wire Line
	6850 3050 6850 3150
Wire Wire Line
	6850 3150 7050 3150
Wire Wire Line
	9700 2800 9850 2800
Text Label 9850 2800 0    50   ~ 0
I2C_SCL
Wire Wire Line
	9700 2700 9850 2700
Text Label 9850 2700 0    50   ~ 0
I2C_SDA
$Comp
L power:GND #PWR02
U 1 1 5E7C9F65
P 1200 5550
F 0 "#PWR02" H 1200 5300 50  0001 C CNN
F 1 "GND" H 1205 5377 50  0000 C CNN
F 2 "" H 1200 5550 50  0001 C CNN
F 3 "" H 1200 5550 50  0001 C CNN
	1    1200 5550
	1    0    0    -1  
$EndComp
Wire Wire Line
	1150 5500 1200 5500
Wire Wire Line
	1200 5500 1200 5550
Wire Wire Line
	1150 5400 1250 5400
Wire Wire Line
	1150 5300 1250 5300
Wire Wire Line
	1150 5200 1250 5200
Wire Wire Line
	1150 5100 1250 5100
Text Label 1250 5400 0    50   ~ 0
JTAG_TDI
Text Label 1250 5300 0    50   ~ 0
JTAG_TCK
$Comp
L Connector_Generic:Conn_01x06 J2
U 1 1 5E7ECBCF
P 950 5300
F 0 "J2" H 950 4900 50  0000 C CNN
F 1 "Debug" V 1050 5250 50  0000 C CNN
F 2 "Connector_PinSocket_2.54mm:PinSocket_1x06_P2.54mm_Vertical" H 950 5300 50  0001 C CNN
F 3 "~" H 950 5300 50  0001 C CNN
	1    950  5300
	-1   0    0    1   
$EndComp
Wire Wire Line
	1150 5000 1250 5000
Text Label 1250 5000 0    50   ~ 0
EN
Text Label 1250 5200 0    50   ~ 0
JTAG_TMS
Text Label 1250 5100 0    50   ~ 0
JTAG_TDO
Wire Wire Line
	9700 1900 9800 1900
Text Label 9800 1900 0    50   ~ 0
JTAG_TDI
Wire Wire Line
	9700 2000 9800 2000
Text Label 9800 2000 0    50   ~ 0
JTAG_TCK
Wire Wire Line
	9700 2100 9800 2100
Text Label 9800 2100 0    50   ~ 0
JTAG_TMS
Wire Wire Line
	9700 2200 9800 2200
Text Label 9800 2200 0    50   ~ 0
JTAG_TDO
NoConn ~ 9700 2900
Text Notes 9750 2900 0    50   ~ 0
Part of SPI, but can not be used
$Comp
L Device:Buzzer BZ1
U 1 1 5E8433EC
P 6050 1550
F 0 "BZ1" H 6300 1600 50  0000 C CNN
F 1 "Buzzer" H 6300 1500 50  0000 C CNN
F 2 "Buzzer_Beeper:Buzzer_15x7.5RM7.6" V 6025 1650 50  0001 C CNN
F 3 "~" V 6025 1650 50  0001 C CNN
	1    6050 1550
	-1   0    0    -1  
$EndComp
$Comp
L Transistor_BJT:BC817 Q3
U 1 1 5E855332
P 6250 1150
F 0 "Q3" H 6050 1350 50  0000 L CNN
F 1 "BC817" H 5950 1250 50  0000 L CNN
F 2 "Package_TO_SOT_SMD:SC-59_Handsoldering" H 6250 1150 50  0001 L CNN
F 3 "" H 6250 1150 50  0001 L CNN
	1    6250 1150
	-1   0    0    -1  
$EndComp
$Comp
L power:+3V3 #PWR022
U 1 1 5E88BA19
P 6150 900
F 0 "#PWR022" H 6150 750 50  0001 C CNN
F 1 "+3V3" H 6165 1073 50  0000 C CNN
F 2 "" H 6150 900 50  0001 C CNN
F 3 "" H 6150 900 50  0001 C CNN
	1    6150 900 
	1    0    0    -1  
$EndComp
$Comp
L Device:R R19
U 1 1 5E8979D4
P 6700 1150
F 0 "R19" V 6700 1150 50  0000 C CNN
F 1 "12k" V 6800 1150 50  0000 C CNN
F 2 "Resistor_SMD:R_0603_1608Metric_Pad1.05x0.95mm_HandSolder" V 6630 1150 50  0001 C CNN
F 3 "~" H 6700 1150 50  0001 C CNN
	1    6700 1150
	0    1    1    0   
$EndComp
Wire Wire Line
	6450 1150 6500 1150
Wire Wire Line
	6150 1350 6150 1400
Text Label 7050 1150 0    50   ~ 0
BUZZER
Text Label 9850 3000 0    50   ~ 0
GAUGE_VMETER
Wire Wire Line
	6850 1150 7050 1150
$Comp
L LED:APFA3010 D3
U 1 1 5E903217
P 7000 4500
F 0 "D3" V 7046 4120 50  0000 R CNN
F 1 "APFA3010" V 6955 4120 50  0000 R CNN
F 2 "Connector_PinSocket_2.54mm:PinSocket_1x04_P2.54mm_Vertical" H 7000 5000 50  0001 C CNN
F 3 "http://www.kingbrightusa.com/images/catalog/SPEC/APFA3010LSEEZGKQBKC.pdf" H 7000 4050 50  0001 C CNN
	1    7000 4500
	0    -1   -1   0   
$EndComp
$Comp
L power:+3V3 #PWR032
U 1 1 5E92ECB7
P 7000 4250
F 0 "#PWR032" H 7000 4100 50  0001 C CNN
F 1 "+3V3" H 7015 4423 50  0000 C CNN
F 2 "" H 7000 4250 50  0001 C CNN
F 3 "" H 7000 4250 50  0001 C CNN
	1    7000 4250
	1    0    0    -1  
$EndComp
Wire Wire Line
	7000 4250 7000 4300
Text Label 9850 3400 0    50   ~ 0
LED_G
Text Label 9850 3300 0    50   ~ 0
LED_B
Text Label 9850 3200 0    50   ~ 0
LED_R
$Comp
L Device:R R22
U 1 1 5E9893DF
P 6800 4900
F 0 "R22" V 6800 4900 50  0000 C CNN
F 1 "75R" V 6750 5100 50  0000 C CNN
F 2 "Resistor_SMD:R_0603_1608Metric_Pad1.05x0.95mm_HandSolder" V 6730 4900 50  0001 C CNN
F 3 "~" H 6800 4900 50  0001 C CNN
	1    6800 4900
	-1   0    0    1   
$EndComp
$Comp
L Device:R R23
U 1 1 5E98A657
P 7000 4900
F 0 "R23" V 7000 4900 50  0000 C CNN
F 1 "10R" V 6950 5100 50  0000 C CNN
F 2 "Resistor_SMD:R_0603_1608Metric_Pad1.05x0.95mm_HandSolder" V 6930 4900 50  0001 C CNN
F 3 "~" H 7000 4900 50  0001 C CNN
	1    7000 4900
	-1   0    0    1   
$EndComp
$Comp
L Device:R R24
U 1 1 5E98A8A3
P 7200 4900
F 0 "R24" V 7200 4900 50  0000 C CNN
F 1 "22R" V 7150 5100 50  0000 C CNN
F 2 "Resistor_SMD:R_0603_1608Metric_Pad1.05x0.95mm_HandSolder" V 7130 4900 50  0001 C CNN
F 3 "~" H 7200 4900 50  0001 C CNN
	1    7200 4900
	-1   0    0    1   
$EndComp
Wire Wire Line
	7200 4700 7200 4750
Wire Wire Line
	7000 4700 7000 4750
Wire Wire Line
	6800 4700 6800 4750
Wire Wire Line
	6800 5050 6800 5250
Wire Wire Line
	7000 5050 7000 5250
Wire Wire Line
	7200 5050 7200 5250
Text Label 7200 5250 3    50   ~ 0
LED_B
Text Label 7000 5250 3    50   ~ 0
LED_G
Text Label 6800 5250 3    50   ~ 0
LED_R
$Comp
L Switch:SW_Push SW3
U 1 1 5EA2AF71
P 10250 5050
F 0 "SW3" H 10150 5150 50  0000 C CNN
F 1 "Down" H 10350 5150 50  0000 C CNN
F 2 "Button_Switch_THT:SW_PUSH_6mm_H7.3mm" H 10250 5250 50  0001 C CNN
F 3 "~" H 10250 5250 50  0001 C CNN
	1    10250 5050
	1    0    0    -1  
$EndComp
Wire Wire Line
	10450 5050 10500 5050
Connection ~ 10500 5050
Wire Wire Line
	10500 5050 10500 4800
$Comp
L Switch:SW_Push SW4
U 1 1 5EA34099
P 10250 5300
F 0 "SW4" H 10150 5400 50  0000 C CNN
F 1 "Right" H 10350 5400 50  0000 C CNN
F 2 "Button_Switch_THT:SW_PUSH_6mm_H7.3mm" H 10250 5500 50  0001 C CNN
F 3 "~" H 10250 5500 50  0001 C CNN
	1    10250 5300
	1    0    0    -1  
$EndComp
$Comp
L Switch:SW_Push SW5
U 1 1 5EA34430
P 10250 5550
F 0 "SW5" H 10150 5650 50  0000 C CNN
F 1 "Enter" H 10350 5650 50  0000 C CNN
F 2 "Button_Switch_THT:SW_PUSH_6mm_H7.3mm" H 10250 5750 50  0001 C CNN
F 3 "~" H 10250 5750 50  0001 C CNN
	1    10250 5550
	1    0    0    -1  
$EndComp
Wire Wire Line
	10450 5300 10500 5300
Connection ~ 10500 5300
Wire Wire Line
	10500 5300 10500 5050
Wire Wire Line
	10450 5550 10500 5550
Wire Wire Line
	10500 5550 10500 5300
Text Label 10500 3500 0    50   ~ 0
BTNS
$Comp
L Switch:SW_Push SW1
U 1 1 5E48DEA4
P 10250 4550
F 0 "SW1" H 10150 4650 50  0000 C CNN
F 1 "Left" H 10350 4650 50  0000 C CNN
F 2 "Button_Switch_THT:SW_PUSH_6mm_H7.3mm" H 10250 4750 50  0001 C CNN
F 3 "~" H 10250 4750 50  0001 C CNN
	1    10250 4550
	1    0    0    -1  
$EndComp
Wire Wire Line
	10450 4550 10500 4550
Wire Wire Line
	10500 4550 10500 4800
Connection ~ 10500 4800
$Comp
L Device:R R30
U 1 1 5E4B8C38
P 9750 5550
F 0 "R30" V 9750 5550 50  0000 C CNN
F 1 "2k2" V 9650 5550 50  0000 C CNN
F 2 "Resistor_SMD:R_0603_1608Metric_Pad1.05x0.95mm_HandSolder" V 9680 5550 50  0001 C CNN
F 3 "~" H 9750 5550 50  0001 C CNN
	1    9750 5550
	0    -1   -1   0   
$EndComp
Wire Wire Line
	9900 5550 10050 5550
$Comp
L Device:R R29
U 1 1 5E4CCF97
P 9750 5300
F 0 "R29" V 9750 5300 50  0000 C CNN
F 1 "5k6" V 9650 5300 50  0000 C CNN
F 2 "Resistor_SMD:R_0603_1608Metric_Pad1.05x0.95mm_HandSolder" V 9680 5300 50  0001 C CNN
F 3 "~" H 9750 5300 50  0001 C CNN
	1    9750 5300
	0    -1   -1   0   
$EndComp
Wire Wire Line
	9900 5300 10050 5300
$Comp
L Device:R R25
U 1 1 5E4D6AD1
P 9400 5550
F 0 "R25" V 9400 5550 50  0000 C CNN
F 1 "8k2" V 9300 5550 50  0000 C CNN
F 2 "Resistor_SMD:R_0603_1608Metric_Pad1.05x0.95mm_HandSolder" V 9330 5550 50  0001 C CNN
F 3 "~" H 9400 5550 50  0001 C CNN
	1    9400 5550
	0    -1   -1   0   
$EndComp
Wire Wire Line
	9550 5550 9600 5550
$Comp
L Device:C C10
U 1 1 5E4E75A4
P 10300 3700
F 0 "C10" H 10300 3800 50  0000 L CNN
F 1 "100nF" H 10050 3600 50  0000 L CNN
F 2 "Capacitor_SMD:C_0603_1608Metric_Pad1.05x0.95mm_HandSolder" H 10338 3550 50  0001 C CNN
F 3 "~" H 10300 3700 50  0001 C CNN
	1    10300 3700
	1    0    0    -1  
$EndComp
Wire Wire Line
	11000 5750 10800 5750
Wire Wire Line
	11000 5750 11000 5850
Connection ~ 10500 5750
Wire Wire Line
	10800 5850 10800 5750
Connection ~ 10800 5750
Wire Wire Line
	10800 5750 10500 5750
Wire Wire Line
	11000 6150 11000 6200
Wire Wire Line
	11000 6200 10800 6200
Wire Wire Line
	10800 6150 10800 6200
Connection ~ 10800 6200
$Comp
L Device:R R28
U 1 1 5E53CB24
P 9750 5050
F 0 "R28" V 9750 5050 50  0000 C CNN
F 1 "3k3" V 9650 5050 50  0000 C CNN
F 2 "Resistor_SMD:R_0603_1608Metric_Pad1.05x0.95mm_HandSolder" V 9680 5050 50  0001 C CNN
F 3 "~" H 9750 5050 50  0001 C CNN
	1    9750 5050
	0    -1   -1   0   
$EndComp
$Comp
L Device:R R27
U 1 1 5E53D21A
P 9750 4800
F 0 "R27" V 9750 4800 50  0000 C CNN
F 1 "1k8" V 9650 4800 50  0000 C CNN
F 2 "Resistor_SMD:R_0603_1608Metric_Pad1.05x0.95mm_HandSolder" V 9680 4800 50  0001 C CNN
F 3 "~" H 9750 4800 50  0001 C CNN
	1    9750 4800
	0    -1   -1   0   
$EndComp
$Comp
L Device:R R26
U 1 1 5E53D9C6
P 9750 4550
F 0 "R26" V 9750 4550 50  0000 C CNN
F 1 "1k0" V 9650 4550 50  0000 C CNN
F 2 "Resistor_SMD:R_0603_1608Metric_Pad1.05x0.95mm_HandSolder" V 9680 4550 50  0001 C CNN
F 3 "~" H 9750 4550 50  0001 C CNN
	1    9750 4550
	0    -1   -1   0   
$EndComp
Wire Wire Line
	9900 4550 10050 4550
Wire Wire Line
	9900 4800 10050 4800
Wire Wire Line
	9900 5050 10050 5050
Wire Wire Line
	9250 5550 9200 5550
Wire Wire Line
	9200 5550 9200 5300
Wire Wire Line
	9200 4550 9600 4550
Wire Wire Line
	9600 4800 9200 4800
Connection ~ 9200 4800
Wire Wire Line
	9200 4800 9200 4550
Wire Wire Line
	9600 5050 9200 5050
Connection ~ 9200 5050
Wire Wire Line
	9200 5050 9200 4800
Wire Wire Line
	9600 5300 9200 5300
Connection ~ 9200 5300
Wire Wire Line
	9200 5300 9200 5050
Connection ~ 3100 3050
Connection ~ 4050 3050
Wire Wire Line
	4100 3050 4050 3050
Wire Wire Line
	4100 3000 4100 3050
$Comp
L power:+3V3 #PWR015
U 1 1 5D75D416
P 4100 3000
F 0 "#PWR015" H 4100 2850 50  0001 C CNN
F 1 "+3V3" H 4115 3173 50  0000 C CNN
F 2 "" H 4100 3000 50  0001 C CNN
F 3 "" H 4100 3000 50  0001 C CNN
	1    4100 3000
	1    0    0    -1  
$EndComp
Connection ~ 3800 3050
Wire Wire Line
	4050 3050 4050 3100
Wire Wire Line
	3800 3050 4050 3050
Wire Wire Line
	3800 3050 3800 3100
Wire Wire Line
	3750 3050 3800 3050
Wire Wire Line
	3100 3050 3100 3100
Wire Wire Line
	3150 3050 3100 3050
Wire Wire Line
	3450 3450 3450 3500
Wire Wire Line
	3450 3450 3800 3450
Connection ~ 3450 3450
Wire Wire Line
	3450 3350 3450 3450
Wire Wire Line
	3800 3450 4050 3450
Connection ~ 3800 3450
Wire Wire Line
	3800 3400 3800 3450
Wire Wire Line
	4050 3450 4050 3400
Wire Wire Line
	3100 3450 3450 3450
Wire Wire Line
	3100 3400 3100 3450
$Comp
L power:GND #PWR013
U 1 1 5D75B329
P 3450 3500
F 0 "#PWR013" H 3450 3250 50  0001 C CNN
F 1 "GND" H 3455 3327 50  0000 C CNN
F 2 "" H 3450 3500 50  0001 C CNN
F 3 "" H 3450 3500 50  0001 C CNN
	1    3450 3500
	1    0    0    -1  
$EndComp
$Comp
L Device:C C4
U 1 1 5D755C9B
P 3800 3250
F 0 "C4" H 3800 3350 50  0000 L CNN
F 1 "100nF" H 3550 3150 50  0000 L CNN
F 2 "Capacitor_SMD:C_0603_1608Metric_Pad1.05x0.95mm_HandSolder" H 3838 3100 50  0001 C CNN
F 3 "~" H 3800 3250 50  0001 C CNN
	1    3800 3250
	1    0    0    -1  
$EndComp
$Comp
L Device:C C3
U 1 1 5D754EC0
P 3100 3250
F 0 "C3" H 3000 3350 50  0000 L CNN
F 1 "100nF" H 2750 3250 50  0000 L CNN
F 2 "Capacitor_SMD:C_0603_1608Metric_Pad1.05x0.95mm_HandSolder" H 3138 3100 50  0001 C CNN
F 3 "~" H 3100 3250 50  0001 C CNN
	1    3100 3250
	1    0    0    -1  
$EndComp
$Comp
L Device:CP C5
U 1 1 5D754703
P 4050 3250
F 0 "C5" H 4168 3296 50  0000 L CNN
F 1 "4u7" H 4168 3205 50  0000 L CNN
F 2 "Capacitor_Tantalum_SMD:CP_EIA-3216-18_Kemet-A_Pad1.58x1.35mm_HandSolder" H 4088 3100 50  0001 C CNN
F 3 "~" H 4050 3250 50  0001 C CNN
	1    4050 3250
	1    0    0    -1  
$EndComp
$Comp
L Regulator_Linear:AMS1117-3.3 U2
U 1 1 5D753C0D
P 3450 3050
F 0 "U2" H 3450 3292 50  0000 C CNN
F 1 "TC2117-3.3V" H 3450 3201 50  0000 C CNN
F 2 "Package_TO_SOT_SMD:SOT-223-3_TabPin2" H 3450 3250 50  0001 C CNN
F 3 "http://www.advanced-monolithic.com/pdf/ds1117.pdf" H 3550 2800 50  0001 C CNN
	1    3450 3050
	1    0    0    -1  
$EndComp
$Comp
L Connector_Generic:Conn_01x02 J6
U 1 1 5E606AD9
P 2100 2800
F 0 "J6" H 2100 2900 50  0000 C CNN
F 1 "PWR_SWITCH" V 2200 2750 50  0000 C CNN
F 2 "Connector_PinHeader_2.54mm:PinHeader_1x02_P2.54mm_Horizontal" H 2100 2800 50  0001 C CNN
F 3 "~" H 2100 2800 50  0001 C CNN
	1    2100 2800
	0    1    -1   0   
$EndComp
Wire Wire Line
	2100 3050 2100 3000
Wire Wire Line
	2100 3050 2500 3050
Wire Wire Line
	2000 3200 1800 3200
Wire Wire Line
	2000 3000 2000 3200
Connection ~ 1600 3200
Wire Wire Line
	1700 950  2150 950 
$Comp
L Device:R R8
U 1 1 5E6E1253
P 2150 1200
F 0 "R8" V 2150 1200 50  0000 C CNN
F 1 "330k" V 2250 1200 50  0000 C CNN
F 2 "Resistor_SMD:R_0603_1608Metric_Pad1.05x0.95mm_HandSolder" V 2080 1200 50  0001 C CNN
F 3 "~" H 2150 1200 50  0001 C CNN
	1    2150 1200
	1    0    0    -1  
$EndComp
$Comp
L Device:R R9
U 1 1 5E6E180D
P 2150 1950
F 0 "R9" V 2150 1950 50  0000 C CNN
F 1 "47k" V 2250 1950 50  0000 C CNN
F 2 "Resistor_SMD:R_0603_1608Metric_Pad1.05x0.95mm_HandSolder" V 2080 1950 50  0001 C CNN
F 3 "~" H 2150 1950 50  0001 C CNN
	1    2150 1950
	1    0    0    -1  
$EndComp
$Comp
L power:GND #PWR010
U 1 1 5E6E2AB1
P 2150 2200
F 0 "#PWR010" H 2150 1950 50  0001 C CNN
F 1 "GND" H 2155 2027 50  0000 C CNN
F 2 "" H 2150 2200 50  0001 C CNN
F 3 "" H 2150 2200 50  0001 C CNN
	1    2150 2200
	1    0    0    -1  
$EndComp
Wire Wire Line
	2150 2100 2150 2200
Wire Wire Line
	2150 1050 2150 950 
Connection ~ 2150 950 
Wire Wire Line
	2150 1350 2150 1400
Connection ~ 2150 1400
Wire Wire Line
	2150 1400 2150 1800
Text Label 2100 1400 3    50   ~ 0
ADC_EXT_PWR
$Comp
L Device:R R6
U 1 1 5E724B76
P 2000 3800
F 0 "R6" V 2000 3800 50  0000 C CNN
F 1 "8k2" V 2100 3800 50  0000 C CNN
F 2 "Resistor_SMD:R_0603_1608Metric_Pad1.05x0.95mm_HandSolder" V 1930 3800 50  0001 C CNN
F 3 "~" H 2000 3800 50  0001 C CNN
	1    2000 3800
	1    0    0    -1  
$EndComp
$Comp
L Device:R R7
U 1 1 5E72582A
P 2000 4250
F 0 "R7" V 2000 4250 50  0000 C CNN
F 1 "2k2" V 2100 4250 50  0000 C CNN
F 2 "Resistor_SMD:R_0603_1608Metric_Pad1.05x0.95mm_HandSolder" V 1930 4250 50  0001 C CNN
F 3 "~" H 2000 4250 50  0001 C CNN
	1    2000 4250
	1    0    0    -1  
$EndComp
$Comp
L power:GND #PWR09
U 1 1 5E725D99
P 2000 4450
F 0 "#PWR09" H 2000 4200 50  0001 C CNN
F 1 "GND" H 2005 4277 50  0000 C CNN
F 2 "" H 2000 4450 50  0001 C CNN
F 3 "" H 2000 4450 50  0001 C CNN
	1    2000 4450
	1    0    0    -1  
$EndComp
Wire Wire Line
	2000 3950 2000 4050
Connection ~ 2000 4050
Wire Wire Line
	2000 4050 2000 4100
Text Label 2050 4050 0    50   ~ 0
ADC_BATT
Wire Wire Line
	8500 1500 8350 1500
Wire Wire Line
	8500 1600 8350 1600
Text Label 8350 1500 2    50   ~ 0
ADC_EXT_PWR
Text Label 8350 1600 2    50   ~ 0
ADC_BATT
NoConn ~ 8500 2500
NoConn ~ 8500 2600
NoConn ~ 8500 2700
NoConn ~ 8500 2800
NoConn ~ 8500 2900
NoConn ~ 8500 3000
Wire Wire Line
	9850 3600 9700 3600
$Comp
L Connector:TestPoint TP7
U 1 1 5E816F30
P 10600 5300
F 0 "TP7" V 10600 5500 50  0000 L CNN
F 1 "KBRD_BTNS" V 10500 5800 50  0001 L CNN
F 2 "TestPoint:TestPoint_Pad_D1.5mm" H 10800 5300 50  0001 C CNN
F 3 "~" H 10800 5300 50  0001 C CNN
	1    10600 5300
	0    1    1    0   
$EndComp
Wire Wire Line
	10600 5300 10500 5300
$Comp
L Connector:TestPoint TP1
U 1 1 5E83A3DD
P 1900 4050
F 0 "TP1" V 2000 4100 50  0000 L CNN
F 1 "ADC_BATT" V 1800 4550 50  0001 L CNN
F 2 "TestPoint:TestPoint_Pad_D1.5mm" H 2100 4050 50  0001 C CNN
F 3 "~" H 2100 4050 50  0001 C CNN
	1    1900 4050
	0    -1   -1   0   
$EndComp
Wire Wire Line
	1900 4050 2000 4050
$Comp
L Connector:TestPoint TP2
U 1 1 5E84A720
P 2050 1400
F 0 "TP2" V 1950 1500 50  0000 L CNN
F 1 "ADC_EXT_PWR" V 1950 1900 50  0001 L CNN
F 2 "TestPoint:TestPoint_Pad_D1.5mm" H 2250 1400 50  0001 C CNN
F 3 "~" H 2250 1400 50  0001 C CNN
	1    2050 1400
	0    -1   -1   0   
$EndComp
Wire Wire Line
	2050 1400 2150 1400
$Comp
L Connector:TestPoint TP3
U 1 1 5E85D920
P 3100 3000
F 0 "TP3" H 3050 3200 50  0000 L CNN
F 1 "BATT_SW" V 3000 3500 50  0001 L CNN
F 2 "TestPoint:TestPoint_Pad_D1.5mm" H 3300 3000 50  0001 C CNN
F 3 "~" H 3300 3000 50  0001 C CNN
	1    3100 3000
	1    0    0    -1  
$EndComp
Wire Wire Line
	3100 3000 3100 3050
$Comp
L Connector:TestPoint TP5
U 1 1 5E88A00D
P 8350 4050
F 0 "TP5" V 8350 4250 50  0000 L CNN
F 1 "SDA" V 8250 4550 50  0001 L CNN
F 2 "TestPoint:TestPoint_Pad_D1.5mm" H 8550 4050 50  0001 C CNN
F 3 "~" H 8550 4050 50  0001 C CNN
	1    8350 4050
	0    -1   -1   0   
$EndComp
$Comp
L Connector:TestPoint TP6
U 1 1 5E88BD01
P 8350 4200
F 0 "TP6" V 8350 4400 50  0000 L CNN
F 1 "SCL" V 8250 4700 50  0001 L CNN
F 2 "TestPoint:TestPoint_Pad_D1.5mm" H 8550 4200 50  0001 C CNN
F 3 "~" H 8550 4200 50  0001 C CNN
	1    8350 4200
	0    -1   -1   0   
$EndComp
Wire Wire Line
	8350 4050 8450 4050
Wire Wire Line
	8350 4200 8450 4200
Text Label 8450 4050 0    50   ~ 0
I2C_SDA
Text Label 8450 4200 0    50   ~ 0
I2C_SCL
$Comp
L Connector_Generic:Conn_01x02 J10
U 1 1 5E8DDA31
P 950 4650
F 0 "J10" H 950 4450 50  0000 C CNN
F 1 "UV" V 1050 4600 50  0000 C CNN
F 2 "Connector_PinSocket_2.54mm:PinSocket_1x02_P2.54mm_Vertical" H 950 4650 50  0001 C CNN
F 3 "~" H 950 4650 50  0001 C CNN
	1    950  4650
	-1   0    0    1   
$EndComp
$Comp
L power:GND #PWR0101
U 1 1 5E8E46DA
P 1200 4700
F 0 "#PWR0101" H 1200 4450 50  0001 C CNN
F 1 "GND" H 1205 4527 50  0000 C CNN
F 2 "" H 1200 4700 50  0001 C CNN
F 3 "" H 1200 4700 50  0001 C CNN
	1    1200 4700
	1    0    0    -1  
$EndComp
Wire Wire Line
	1150 4650 1200 4650
Wire Wire Line
	1200 4650 1200 4700
Wire Wire Line
	1150 4550 1200 4550
Text Label 1200 4550 0    50   ~ 0
GAUGE_VMETER
Wire Wire Line
	1250 3200 1600 3200
$Comp
L power:PWR_FLAG #FLG01
U 1 1 5E9BE3C4
P 2500 3000
F 0 "#FLG01" H 2500 3075 50  0001 C CNN
F 1 "PWR_FLAG" H 2500 3173 50  0000 C CNN
F 2 "" H 2500 3000 50  0001 C CNN
F 3 "~" H 2500 3000 50  0001 C CNN
	1    2500 3000
	1    0    0    -1  
$EndComp
Wire Wire Line
	2500 3000 2500 3050
$Comp
L Device:C C11
U 1 1 5EAFDBDE
P 2400 1750
F 0 "C11" H 2400 1650 50  0000 L CNN
F 1 "100nF" H 2150 1650 50  0000 L CNN
F 2 "Capacitor_SMD:C_0603_1608Metric_Pad1.05x0.95mm_HandSolder" H 2438 1600 50  0001 C CNN
F 3 "~" H 2400 1750 50  0001 C CNN
	1    2400 1750
	-1   0    0    1   
$EndComp
$Comp
L power:GND #PWR040
U 1 1 5EB01BBF
P 2400 2200
F 0 "#PWR040" H 2400 1950 50  0001 C CNN
F 1 "GND" H 2405 2027 50  0000 C CNN
F 2 "" H 2400 2200 50  0001 C CNN
F 3 "" H 2400 2200 50  0001 C CNN
	1    2400 2200
	1    0    0    -1  
$EndComp
Wire Wire Line
	2400 1900 2400 2200
Wire Wire Line
	2400 1600 2400 1400
Wire Wire Line
	2400 1400 2150 1400
Wire Wire Line
	2150 950  3450 950 
$Comp
L Device:C C12
U 1 1 5EB66E90
P 2450 4250
F 0 "C12" H 2200 4250 50  0000 L CNN
F 1 "100nF" H 2200 4150 50  0000 L CNN
F 2 "Capacitor_SMD:C_0603_1608Metric_Pad1.05x0.95mm_HandSolder" H 2488 4100 50  0001 C CNN
F 3 "~" H 2450 4250 50  0001 C CNN
	1    2450 4250
	1    0    0    -1  
$EndComp
$Comp
L power:GND #PWR041
U 1 1 5EB67304
P 2450 4450
F 0 "#PWR041" H 2450 4200 50  0001 C CNN
F 1 "GND" H 2455 4277 50  0000 C CNN
F 2 "" H 2450 4450 50  0001 C CNN
F 3 "" H 2450 4450 50  0001 C CNN
	1    2450 4450
	1    0    0    -1  
$EndComp
Wire Wire Line
	2450 4400 2450 4450
Wire Wire Line
	2450 4100 2450 4050
Wire Wire Line
	2000 4050 2450 4050
Wire Wire Line
	2500 3050 3000 3050
Connection ~ 2500 3050
$Comp
L Connector_Generic:Conn_01x03 J12
U 1 1 5EBDCED3
P 8850 5750
F 0 "J12" H 8850 5550 50  0000 C CNN
F 1 "KBRD" V 8950 5750 50  0000 C CNN
F 2 "Connector_PinHeader_2.54mm:PinHeader_1x03_P2.54mm_Horizontal" H 8850 5750 50  0001 C CNN
F 3 "~" H 8850 5750 50  0001 C CNN
	1    8850 5750
	-1   0    0    1   
$EndComp
Wire Wire Line
	9200 5550 9200 5650
Wire Wire Line
	9200 5650 9050 5650
Connection ~ 9200 5550
Wire Wire Line
	10500 5550 10500 5750
Connection ~ 10500 5550
Wire Wire Line
	9050 5750 10500 5750
Wire Wire Line
	9200 6200 9200 5850
Wire Wire Line
	9200 5850 9050 5850
$Comp
L Connector_Generic:Conn_01x03 J11
U 1 1 5EC399EE
P 8500 5750
F 0 "J11" H 8500 5550 50  0000 C CNN
F 1 "KBRD_MCU" V 8600 5750 50  0000 C CNN
F 2 "Connector_PinSocket_2.54mm:PinSocket_1x03_P2.54mm_Horizontal" H 8500 5750 50  0001 C CNN
F 3 "~" H 8500 5750 50  0001 C CNN
	1    8500 5750
	1    0    0    -1  
$EndComp
Wire Wire Line
	9200 6200 9450 6200
Wire Wire Line
	9700 3500 10300 3500
Wire Wire Line
	10300 3500 10500 3500
Connection ~ 10300 3500
Wire Wire Line
	10300 3550 10300 3500
$Comp
L power:GND #PWR042
U 1 1 5ECABFF1
P 10300 3900
F 0 "#PWR042" H 10300 3650 50  0001 C CNN
F 1 "GND" H 10305 3727 50  0000 C CNN
F 2 "" H 10300 3900 50  0001 C CNN
F 3 "" H 10300 3900 50  0001 C CNN
	1    10300 3900
	1    0    0    -1  
$EndComp
Wire Wire Line
	10300 3850 10300 3900
Wire Wire Line
	8300 5750 8200 5750
Text Label 8200 5750 2    50   ~ 0
BTNS
$Comp
L power:+3V3 #PWR036
U 1 1 5ECCF3F5
P 8250 5600
F 0 "#PWR036" H 8250 5450 50  0001 C CNN
F 1 "+3V3" H 8265 5773 50  0000 C CNN
F 2 "" H 8250 5600 50  0001 C CNN
F 3 "" H 8250 5600 50  0001 C CNN
	1    8250 5600
	1    0    0    -1  
$EndComp
Wire Wire Line
	8250 5600 8250 5650
Wire Wire Line
	8250 5650 8300 5650
$Comp
L power:GND #PWR039
U 1 1 5ECE3168
P 8250 5900
F 0 "#PWR039" H 8250 5650 50  0001 C CNN
F 1 "GND" H 8255 5727 50  0000 C CNN
F 2 "" H 8250 5900 50  0001 C CNN
F 3 "" H 8250 5900 50  0001 C CNN
	1    8250 5900
	1    0    0    -1  
$EndComp
Wire Wire Line
	8300 5850 8250 5850
Wire Wire Line
	8250 5850 8250 5900
Text Label 9850 3100 0    50   ~ 0
BUZZER
Wire Wire Line
	9850 3400 9700 3400
Wire Wire Line
	9700 3300 9850 3300
Wire Wire Line
	5300 4800 5600 4800
$Comp
L power:GNDA #PWR0102
U 1 1 5F025A48
P 9200 6250
F 0 "#PWR0102" H 9200 6000 50  0001 C CNN
F 1 "GNDA" H 9205 6077 50  0000 C CNN
F 2 "" H 9200 6250 50  0001 C CNN
F 3 "" H 9200 6250 50  0001 C CNN
	1    9200 6250
	1    0    0    -1  
$EndComp
Wire Wire Line
	9200 6250 9200 6200
Connection ~ 9200 6200
Text Label 9150 5650 1    50   ~ 0
KBRD_PWR_SUPPLY
Text Label 9050 5750 0    50   ~ 0
KBRD_BTNS
Wire Wire Line
	9850 3200 9700 3200
Wire Wire Line
	9850 3100 9700 3100
Wire Wire Line
	9850 3000 9700 3000
$Comp
L Device:C C13
U 1 1 5E524D42
P 6500 1400
F 0 "C13" H 6300 1400 50  0000 C CNN
F 1 "N.A." H 6300 1500 50  0000 C CNN
F 2 "Capacitor_SMD:C_0603_1608Metric_Pad1.05x0.95mm_HandSolder" H 6538 1250 50  0001 C CNN
F 3 "~" H 6500 1400 50  0001 C CNN
	1    6500 1400
	-1   0    0    1   
$EndComp
Wire Wire Line
	6500 1250 6500 1150
Connection ~ 6500 1150
Wire Wire Line
	6500 1150 6550 1150
$Comp
L power:GND #PWR0103
U 1 1 5E548014
P 6500 1600
F 0 "#PWR0103" H 6500 1350 50  0001 C CNN
F 1 "GND" H 6505 1427 50  0000 C CNN
F 2 "" H 6500 1600 50  0001 C CNN
F 3 "" H 6500 1600 50  0001 C CNN
	1    6500 1600
	1    0    0    -1  
$EndComp
Wire Wire Line
	6500 1600 6500 1550
$Comp
L power:GND #PWR0104
U 1 1 5E560046
P 6150 1750
F 0 "#PWR0104" H 6150 1500 50  0001 C CNN
F 1 "GND" H 6155 1577 50  0000 C CNN
F 2 "" H 6150 1750 50  0001 C CNN
F 3 "" H 6150 1750 50  0001 C CNN
	1    6150 1750
	1    0    0    -1  
$EndComp
Wire Wire Line
	6150 1750 6150 1700
Wire Wire Line
	6150 900  6150 950 
$Comp
L Diode:LL4148 D4
U 1 1 5E5CB439
P 6250 1550
F 0 "D4" H 6300 1500 50  0000 L CNN
F 1 "LL4148" H 6150 1650 50  0000 L CNN
F 2 "Diode_SMD:D_MiniMELF" H 6250 1375 50  0001 C CNN
F 3 "http://www.vishay.com/docs/85557/ll4148.pdf" H 6250 1550 50  0001 C CNN
	1    6250 1550
	0    1    1    0   
$EndComp
Wire Wire Line
	6250 1400 6150 1400
Connection ~ 6150 1400
Wire Wire Line
	6150 1400 6150 1450
Wire Wire Line
	6250 1700 6150 1700
Connection ~ 6150 1700
Wire Wire Line
	6150 1700 6150 1650
$Comp
L power:PWR_FLAG #FLG02
U 1 1 5E6299D4
P 9450 6200
F 0 "#FLG02" H 9450 6275 50  0001 C CNN
F 1 "PWR_FLAG" H 9450 6373 50  0000 C CNN
F 2 "" H 9450 6200 50  0001 C CNN
F 3 "~" H 9450 6200 50  0001 C CNN
	1    9450 6200
	1    0    0    -1  
$EndComp
Connection ~ 9450 6200
Wire Wire Line
	9450 6200 9800 6200
$Comp
L Device:R R33
U 1 1 5E605E2B
P 6600 2650
F 0 "R33" V 6600 2650 50  0000 C CNN
F 1 "0R" V 6700 2650 50  0000 C CNN
F 2 "Resistor_SMD:R_0603_1608Metric_Pad1.05x0.95mm_HandSolder" V 6530 2650 50  0001 C CNN
F 3 "~" H 6600 2650 50  0001 C CNN
	1    6600 2650
	-1   0    0    1   
$EndComp
$Comp
L Device:R R34
U 1 1 5E606507
P 6750 2650
F 0 "R34" V 6750 2650 50  0000 C CNN
F 1 "N.A." V 6650 2650 50  0000 C CNN
F 2 "Resistor_SMD:R_0603_1608Metric_Pad1.05x0.95mm_HandSolder" V 6680 2650 50  0001 C CNN
F 3 "~" H 6750 2650 50  0001 C CNN
	1    6750 2650
	-1   0    0    1   
$EndComp
$Comp
L power:+3V3 #PWR024
U 1 1 5E678CF7
P 6750 2450
F 0 "#PWR024" H 6750 2300 50  0001 C CNN
F 1 "+3V3" V 6850 2550 50  0000 C CNN
F 2 "" H 6750 2450 50  0001 C CNN
F 3 "" H 6750 2450 50  0001 C CNN
	1    6750 2450
	1    0    0    -1  
$EndComp
Wire Wire Line
	6600 2450 6600 2500
Wire Wire Line
	6750 2450 6750 2500
Wire Wire Line
	6600 2800 6600 2850
Wire Wire Line
	6200 2850 6600 2850
Wire Wire Line
	6750 2800 6750 2850
Wire Wire Line
	6750 2850 6600 2850
Connection ~ 6600 2850
Wire Wire Line
	7450 3050 7350 3050
Wire Wire Line
	7450 2950 7450 3050
Wire Wire Line
	6850 3350 6850 3150
Wire Wire Line
	6200 3350 6850 3350
Connection ~ 6850 3150
Wire Wire Line
	7350 3150 7400 3150
Wire Wire Line
	7400 3150 7400 3350
$Comp
L Device:R R35
U 1 1 5E82ECEE
P 7200 3350
F 0 "R35" V 7200 3350 50  0000 C CNN
F 1 "N.A." V 7200 3700 50  0000 C CNN
F 2 "Resistor_SMD:R_0603_1608Metric_Pad1.05x0.95mm_HandSolder" V 7130 3350 50  0001 C CNN
F 3 "~" H 7200 3350 50  0001 C CNN
	1    7200 3350
	0    1    1    0   
$EndComp
Wire Wire Line
	7050 3250 6900 3250
Wire Wire Line
	6900 3250 6900 3350
Wire Wire Line
	6200 3450 6900 3450
Wire Wire Line
	7050 3350 6900 3350
Connection ~ 6900 3350
Wire Wire Line
	6900 3350 6900 3450
Wire Wire Line
	7350 3250 7450 3250
Wire Wire Line
	7450 3250 7450 3050
Connection ~ 7450 3050
Wire Wire Line
	7350 3350 7400 3350
Connection ~ 7400 3350
Wire Wire Line
	7400 3350 7400 3550
Wire Wire Line
	6950 3550 6950 3450
Wire Wire Line
	6950 3450 7050 3450
Wire Wire Line
	6200 3550 6950 3550
$Comp
L Device:R R36
U 1 1 5E8E0A80
P 7200 3550
F 0 "R36" V 7200 3550 50  0000 C CNN
F 1 "N.A." V 7200 3900 50  0000 C CNN
F 2 "Resistor_SMD:R_0603_1608Metric_Pad1.05x0.95mm_HandSolder" V 7130 3550 50  0001 C CNN
F 3 "~" H 7200 3550 50  0001 C CNN
	1    7200 3550
	0    1    1    0   
$EndComp
Wire Wire Line
	7350 3450 7450 3450
Wire Wire Line
	7450 3450 7450 3250
Connection ~ 7450 3250
Wire Wire Line
	7350 3550 7400 3550
Connection ~ 7400 3550
Wire Wire Line
	7400 3550 7400 3700
Wire Wire Line
	7050 3550 6950 3550
Connection ~ 6950 3550
Text Label 2600 3050 0    50   ~ 0
BATT_SW
Text Label 6600 2450 1    50   ~ 0
BATT_SW
$Comp
L Device:R R37
U 1 1 5E95CF04
P 6400 2950
F 0 "R37" V 6400 2950 50  0000 C CNN
F 1 "N.A." V 6350 3100 50  0000 C CNN
F 2 "Resistor_SMD:R_0603_1608Metric_Pad1.05x0.95mm_HandSolder" V 6330 2950 50  0001 C CNN
F 3 "~" H 6400 2950 50  0001 C CNN
	1    6400 2950
	0    -1   -1   0   
$EndComp
Wire Wire Line
	6250 2950 6200 2950
Wire Wire Line
	6600 2950 6550 2950
$Comp
L Diode:1N5820 D5
U 1 1 5E823605
P 1600 3400
F 0 "D5" V 1550 3250 50  0000 L CNN
F 1 "1N5820" V 1650 3050 50  0000 L CNN
F 2 "Diode_THT:D_DO-201AD_P15.24mm_Horizontal" H 1600 3225 50  0001 C CNN
F 3 "http://www.vishay.com/docs/88526/1n5820.pdf" H 1600 3400 50  0001 C CNN
	1    1600 3400
	0    1    1    0   
$EndComp
Wire Wire Line
	1600 3250 1600 3200
Wire Wire Line
	1600 3550 1600 3600
Wire Wire Line
	1000 3300 1050 3300
Wire Wire Line
	1050 3300 1050 3600
Wire Wire Line
	1050 3600 1600 3600
Connection ~ 1600 3600
Wire Wire Line
	1600 3600 1600 3950
$Comp
L Connector:TestPoint TP8
U 1 1 5ECDD7A7
P 4200 3050
F 0 "TP8" V 4200 3250 50  0000 L CNN
F 1 "+3V3" V 4100 3550 50  0001 L CNN
F 2 "TestPoint:TestPoint_Pad_D1.5mm" H 4400 3050 50  0001 C CNN
F 3 "~" H 4400 3050 50  0001 C CNN
	1    4200 3050
	0    1    1    0   
$EndComp
$Comp
L Connector:TestPoint TP9
U 1 1 5ECE70EA
P 4200 3450
F 0 "TP9" V 4200 3650 50  0000 L CNN
F 1 "GND" V 4100 3950 50  0001 L CNN
F 2 "TestPoint:TestPoint_Pad_D1.5mm" H 4400 3450 50  0001 C CNN
F 3 "~" H 4400 3450 50  0001 C CNN
	1    4200 3450
	0    1    1    0   
$EndComp
Wire Wire Line
	4200 3050 4150 3050
Connection ~ 4100 3050
Wire Wire Line
	4200 3450 4150 3450
Connection ~ 4050 3450
Text Notes 7300 4850 0    50   ~ 0
LED need to be mounted\non case. Therefore there\nis connector footprint
$Comp
L Connector:TestPoint TP10
U 1 1 5F045ADC
P 3000 2900
F 0 "TP10" H 2950 3100 50  0000 L CNN
F 1 "BATT_SW" V 2900 3400 50  0001 L CNN
F 2 "TestPoint:TestPoint_Pad_D1.5mm" H 3200 2900 50  0001 C CNN
F 3 "~" H 3200 2900 50  0001 C CNN
	1    3000 2900
	1    0    0    -1  
$EndComp
Wire Wire Line
	3000 2900 3000 3050
Connection ~ 3000 3050
Wire Wire Line
	3000 3050 3100 3050
$Comp
L Connector:TestPoint TP11
U 1 1 5F061808
P 4250 2950
F 0 "TP11" V 4250 3150 50  0000 L CNN
F 1 "+3V3" V 4150 3450 50  0001 L CNN
F 2 "TestPoint:TestPoint_Pad_D1.5mm" H 4450 2950 50  0001 C CNN
F 3 "~" H 4450 2950 50  0001 C CNN
	1    4250 2950
	0    1    1    0   
$EndComp
$Comp
L Connector:TestPoint TP12
U 1 1 5F061C1C
P 4250 3550
F 0 "TP12" V 4250 3750 50  0000 L CNN
F 1 "GND" V 4150 4050 50  0001 L CNN
F 2 "TestPoint:TestPoint_Pad_D1.5mm" H 4450 3550 50  0001 C CNN
F 3 "~" H 4450 3550 50  0001 C CNN
	1    4250 3550
	0    1    1    0   
$EndComp
Wire Wire Line
	4250 2950 4150 2950
Wire Wire Line
	4150 2950 4150 3050
Connection ~ 4150 3050
Wire Wire Line
	4150 3050 4100 3050
Wire Wire Line
	4250 3550 4150 3550
Wire Wire Line
	4150 3550 4150 3450
Connection ~ 4150 3450
Wire Wire Line
	4150 3450 4050 3450
$Comp
L Connector:TestPoint TP13
U 1 1 5F10E650
P 1800 3150
F 0 "TP13" V 1800 3350 50  0000 L CNN
F 1 "+3V3" V 1700 3650 50  0001 L CNN
F 2 "TestPoint:TestPoint_Pad_D1.5mm" H 2000 3150 50  0001 C CNN
F 3 "~" H 2000 3150 50  0001 C CNN
	1    1800 3150
	1    0    0    -1  
$EndComp
Wire Wire Line
	1800 3150 1800 3200
Connection ~ 1800 3200
Wire Wire Line
	1800 3200 1600 3200
$Comp
L Connector:TestPoint TP14
U 1 1 5F12CB8C
P 3700 4000
F 0 "TP14" V 3700 4200 50  0000 L CNN
F 1 "GND" V 3600 4500 50  0001 L CNN
F 2 "TestPoint:TestPoint_Pad_D1.5mm" H 3900 4000 50  0001 C CNN
F 3 "~" H 3900 4000 50  0001 C CNN
	1    3700 4000
	1    0    0    -1  
$EndComp
$Comp
L Connector:TestPoint TP15
U 1 1 5F1305C7
P 3800 4000
F 0 "TP15" V 3800 4200 50  0000 L CNN
F 1 "GND" V 3700 4500 50  0001 L CNN
F 2 "TestPoint:TestPoint_Pad_D1.5mm" H 4000 4000 50  0001 C CNN
F 3 "~" H 4000 4000 50  0001 C CNN
	1    3800 4000
	1    0    0    -1  
$EndComp
$Comp
L Connector:TestPoint TP16
U 1 1 5F130A02
P 3900 4000
F 0 "TP16" V 3900 4200 50  0000 L CNN
F 1 "GND" V 3800 4500 50  0001 L CNN
F 2 "TestPoint:TestPoint_Pad_D1.5mm" H 4100 4000 50  0001 C CNN
F 3 "~" H 4100 4000 50  0001 C CNN
	1    3900 4000
	1    0    0    -1  
$EndComp
$Comp
L Connector:TestPoint TP17
U 1 1 5F130E7C
P 4000 4000
F 0 "TP17" V 4000 4200 50  0000 L CNN
F 1 "GND" V 3900 4500 50  0001 L CNN
F 2 "TestPoint:TestPoint_Pad_D1.5mm" H 4200 4000 50  0001 C CNN
F 3 "~" H 4200 4000 50  0001 C CNN
	1    4000 4000
	1    0    0    -1  
$EndComp
$Comp
L power:GND #PWR023
U 1 1 5F1313A8
P 3900 4100
F 0 "#PWR023" H 3900 3850 50  0001 C CNN
F 1 "GND" H 3905 3927 50  0000 C CNN
F 2 "" H 3900 4100 50  0001 C CNN
F 3 "" H 3900 4100 50  0001 C CNN
	1    3900 4100
	1    0    0    -1  
$EndComp
Wire Wire Line
	3700 4000 3700 4050
Wire Wire Line
	3700 4050 3800 4050
Wire Wire Line
	4000 4050 4000 4000
Wire Wire Line
	3900 4000 3900 4050
Connection ~ 3900 4050
Wire Wire Line
	3900 4050 4000 4050
Wire Wire Line
	3800 4000 3800 4050
Connection ~ 3800 4050
$Comp
L Connector:TestPoint TP18
U 1 1 5F1AD632
P 4100 4000
F 0 "TP18" V 4100 4200 50  0000 L CNN
F 1 "GND" V 4000 4500 50  0001 L CNN
F 2 "TestPoint:TestPoint_Pad_D1.5mm" H 4300 4000 50  0001 C CNN
F 3 "~" H 4300 4000 50  0001 C CNN
	1    4100 4000
	1    0    0    -1  
$EndComp
Wire Wire Line
	4100 4000 4100 4050
Wire Wire Line
	4100 4050 4000 4050
Connection ~ 4000 4050
Wire Wire Line
	3800 4050 3900 4050
Wire Wire Line
	3900 4100 3900 4050
$Comp
L Connector:TestPoint TP19
U 1 1 5F1E69EC
P 9800 6150
F 0 "TP19" V 9800 6350 50  0000 L CNN
F 1 "KBRD_BTNS" V 9700 6650 50  0001 L CNN
F 2 "TestPoint:TestPoint_Pad_D1.5mm" H 10000 6150 50  0001 C CNN
F 3 "~" H 10000 6150 50  0001 C CNN
	1    9800 6150
	1    0    0    -1  
$EndComp
Wire Wire Line
	9800 6150 9800 6200
Connection ~ 9800 6200
Wire Wire Line
	9800 6200 10800 6200
Text Notes 3700 2650 0    50   ~ 0
To reduce brightness,\nR11 and R14 might be\n1k5
$Comp
L Device:R R31
U 1 1 5E4FC8E0
P 10800 6000
F 0 "R31" V 10800 6000 50  0000 C CNN
F 1 "8k2" V 10700 6000 50  0000 C CNN
F 2 "Resistor_SMD:R_0603_1608Metric_Pad1.05x0.95mm_HandSolder" V 10730 6000 50  0001 C CNN
F 3 "~" H 10800 6000 50  0001 C CNN
	1    10800 6000
	1    0    0    -1  
$EndComp
$Comp
L Device:R R32
U 1 1 5E4FCE8E
P 11000 6000
F 0 "R32" V 11000 6000 50  0000 C CNN
F 1 "680R" V 10900 6000 50  0000 C CNN
F 2 "Resistor_SMD:R_0603_1608Metric_Pad1.05x0.95mm_HandSolder" V 10930 6000 50  0001 C CNN
F 3 "~" H 11000 6000 50  0001 C CNN
	1    11000 6000
	1    0    0    -1  
$EndComp
Wire Wire Line
	2000 3650 2000 3600
$Comp
L Device:R R38
U 1 1 60F37A21
P 2750 3600
F 0 "R38" V 2750 3600 50  0000 C CNN
F 1 "12k" V 2850 3600 50  0000 C CNN
F 2 "Resistor_SMD:R_0603_1608Metric_Pad1.05x0.95mm_HandSolder" V 2680 3600 50  0001 C CNN
F 3 "~" H 2750 3600 50  0001 C CNN
	1    2750 3600
	0    1    1    0   
$EndComp
$Comp
L power:+3V3 #PWR0105
U 1 1 60F8C195
P 2950 3550
F 0 "#PWR0105" H 2950 3400 50  0001 C CNN
F 1 "+3V3" H 2965 3723 50  0000 C CNN
F 2 "" H 2950 3550 50  0001 C CNN
F 3 "" H 2950 3550 50  0001 C CNN
	1    2950 3550
	1    0    0    -1  
$EndComp
Wire Wire Line
	2000 4400 2000 4450
$Comp
L Transistor_FET:AO3401A Q4
U 1 1 6104E825
P 2100 3400
F 0 "Q4" H 2400 3400 50  0000 L CNN
F 1 "AO3407" V 2350 3300 50  0000 L CNN
F 2 "Package_TO_SOT_SMD:SOT-23_Handsoldering" H 2300 3325 50  0001 L CIN
F 3 "http://www.aosmd.com/pdfs/datasheet/AO3401A.pdf" H 2100 3400 50  0001 L CNN
	1    2100 3400
	-1   0    0    1   
$EndComp
Connection ~ 2000 3200
$Comp
L Transistor_BJT:BC817 Q5
U 1 1 610AA91C
P 2400 3600
F 0 "Q5" H 2200 3800 50  0000 L CNN
F 1 "BC817" H 2100 3700 50  0000 L CNN
F 2 "Package_TO_SOT_SMD:SC-59_Handsoldering" H 2400 3600 50  0001 L CNN
F 3 "" H 2400 3600 50  0001 L CNN
	1    2400 3600
	-1   0    0    -1  
$EndComp
$Comp
L Device:R R39
U 1 1 610B10B0
P 2150 3200
F 0 "R39" V 2150 3200 50  0000 C CNN
F 1 "100k" V 2250 3250 50  0000 C CNN
F 2 "Resistor_SMD:R_0603_1608Metric_Pad1.05x0.95mm_HandSolder" V 2080 3200 50  0001 C CNN
F 3 "~" H 2150 3200 50  0001 C CNN
	1    2150 3200
	0    1    1    0   
$EndComp
Wire Wire Line
	2300 3400 2300 3200
Connection ~ 2300 3400
$Comp
L power:GND #PWR027
U 1 1 610CEB86
P 2300 3800
F 0 "#PWR027" H 2300 3550 50  0001 C CNN
F 1 "GND" H 2450 3700 50  0000 C CNN
F 2 "" H 2300 3800 50  0001 C CNN
F 3 "" H 2300 3800 50  0001 C CNN
	1    2300 3800
	1    0    0    -1  
$EndComp
Wire Wire Line
	2950 3550 2950 3600
Wire Wire Line
	2950 3600 2900 3600
Text Notes 1900 4950 0    50   ~ 0
In order to save power, this\nvoltage divider is active only\nwhen device is powered on
$EndSCHEMATC
