G04 #@! TF.GenerationSoftware,KiCad,Pcbnew,5.1.6-c6e7f7d~86~ubuntu18.04.1*
G04 #@! TF.CreationDate,2020-05-31T13:43:33+00:00*
G04 #@! TF.ProjectId,ANMLY_MTR-01_prod,414e4d4c-595f-44d5-9452-2d30315f7072,rev?*
G04 #@! TF.SameCoordinates,Original*
G04 #@! TF.FileFunction,Legend,Bot*
G04 #@! TF.FilePolarity,Positive*
%FSLAX46Y46*%
G04 Gerber Fmt 4.6, Leading zero omitted, Abs format (unit mm)*
G04 Created by KiCad (PCBNEW 5.1.6-c6e7f7d~86~ubuntu18.04.1) date 2020-05-31 13:43:33*
%MOMM*%
%LPD*%
G01*
G04 APERTURE LIST*
%ADD10C,0.150000*%
%ADD11C,0.120000*%
G04 APERTURE END LIST*
D10*
X200262428Y-62015666D02*
X199786238Y-62015666D01*
X200357666Y-62301380D02*
X200024333Y-61301380D01*
X199691000Y-62301380D01*
X199357666Y-62301380D02*
X199357666Y-61301380D01*
X198786238Y-62301380D01*
X198786238Y-61301380D01*
X198310047Y-62301380D02*
X198310047Y-61301380D01*
X197976714Y-62015666D01*
X197643380Y-61301380D01*
X197643380Y-62301380D01*
X196691000Y-62301380D02*
X197167190Y-62301380D01*
X197167190Y-61301380D01*
X196167190Y-61825190D02*
X196167190Y-62301380D01*
X196500523Y-61301380D02*
X196167190Y-61825190D01*
X195833857Y-61301380D01*
X195738619Y-62396619D02*
X194976714Y-62396619D01*
X194738619Y-62301380D02*
X194738619Y-61301380D01*
X194405285Y-62015666D01*
X194071952Y-61301380D01*
X194071952Y-62301380D01*
X193738619Y-61301380D02*
X193167190Y-61301380D01*
X193452904Y-62301380D02*
X193452904Y-61301380D01*
X192262428Y-62301380D02*
X192595761Y-61825190D01*
X192833857Y-62301380D02*
X192833857Y-61301380D01*
X192452904Y-61301380D01*
X192357666Y-61349000D01*
X192310047Y-61396619D01*
X192262428Y-61491857D01*
X192262428Y-61634714D01*
X192310047Y-61729952D01*
X192357666Y-61777571D01*
X192452904Y-61825190D01*
X192833857Y-61825190D01*
X191833857Y-61920428D02*
X191071952Y-61920428D01*
X190405285Y-61301380D02*
X190310047Y-61301380D01*
X190214809Y-61349000D01*
X190167190Y-61396619D01*
X190119571Y-61491857D01*
X190071952Y-61682333D01*
X190071952Y-61920428D01*
X190119571Y-62110904D01*
X190167190Y-62206142D01*
X190214809Y-62253761D01*
X190310047Y-62301380D01*
X190405285Y-62301380D01*
X190500523Y-62253761D01*
X190548142Y-62206142D01*
X190595761Y-62110904D01*
X190643380Y-61920428D01*
X190643380Y-61682333D01*
X190595761Y-61491857D01*
X190548142Y-61396619D01*
X190500523Y-61349000D01*
X190405285Y-61301380D01*
X189119571Y-62301380D02*
X189691000Y-62301380D01*
X189405285Y-62301380D02*
X189405285Y-61301380D01*
X189500523Y-61444238D01*
X189595761Y-61539476D01*
X189691000Y-61587095D01*
X163123333Y-50236380D02*
X163456666Y-49760190D01*
X163694761Y-50236380D02*
X163694761Y-49236380D01*
X163313809Y-49236380D01*
X163218571Y-49284000D01*
X163170952Y-49331619D01*
X163123333Y-49426857D01*
X163123333Y-49569714D01*
X163170952Y-49664952D01*
X163218571Y-49712571D01*
X163313809Y-49760190D01*
X163694761Y-49760190D01*
X162837619Y-49236380D02*
X162266190Y-49236380D01*
X162551904Y-50236380D02*
X162551904Y-49236380D01*
X161980476Y-50188761D02*
X161837619Y-50236380D01*
X161599523Y-50236380D01*
X161504285Y-50188761D01*
X161456666Y-50141142D01*
X161409047Y-50045904D01*
X161409047Y-49950666D01*
X161456666Y-49855428D01*
X161504285Y-49807809D01*
X161599523Y-49760190D01*
X161790000Y-49712571D01*
X161885238Y-49664952D01*
X161932857Y-49617333D01*
X161980476Y-49522095D01*
X161980476Y-49426857D01*
X161932857Y-49331619D01*
X161885238Y-49284000D01*
X161790000Y-49236380D01*
X161551904Y-49236380D01*
X161409047Y-49284000D01*
X159932857Y-50617333D02*
X159980476Y-50569714D01*
X160075714Y-50426857D01*
X160123333Y-50331619D01*
X160170952Y-50188761D01*
X160218571Y-49950666D01*
X160218571Y-49760190D01*
X160170952Y-49522095D01*
X160123333Y-49379238D01*
X160075714Y-49284000D01*
X159980476Y-49141142D01*
X159932857Y-49093523D01*
X159551904Y-50236380D02*
X159551904Y-49236380D01*
X159170952Y-50617333D02*
X159123333Y-50569714D01*
X159028095Y-50426857D01*
X158980476Y-50331619D01*
X158932857Y-50188761D01*
X158885238Y-49950666D01*
X158885238Y-49760190D01*
X158932857Y-49522095D01*
X158980476Y-49379238D01*
X159028095Y-49284000D01*
X159123333Y-49141142D01*
X159170952Y-49093523D01*
X163718571Y-47950380D02*
X163718571Y-46950380D01*
X163480476Y-46950380D01*
X163337619Y-46998000D01*
X163242380Y-47093238D01*
X163194761Y-47188476D01*
X163147142Y-47378952D01*
X163147142Y-47521809D01*
X163194761Y-47712285D01*
X163242380Y-47807523D01*
X163337619Y-47902761D01*
X163480476Y-47950380D01*
X163718571Y-47950380D01*
X162861428Y-46950380D02*
X162290000Y-46950380D01*
X162575714Y-47950380D02*
X162575714Y-46950380D01*
X161385238Y-47950380D02*
X161718571Y-47474190D01*
X161956666Y-47950380D02*
X161956666Y-46950380D01*
X161575714Y-46950380D01*
X161480476Y-46998000D01*
X161432857Y-47045619D01*
X161385238Y-47140857D01*
X161385238Y-47283714D01*
X161432857Y-47378952D01*
X161480476Y-47426571D01*
X161575714Y-47474190D01*
X161956666Y-47474190D01*
X159909047Y-48331333D02*
X159956666Y-48283714D01*
X160051904Y-48140857D01*
X160099523Y-48045619D01*
X160147142Y-47902761D01*
X160194761Y-47664666D01*
X160194761Y-47474190D01*
X160147142Y-47236095D01*
X160099523Y-47093238D01*
X160051904Y-46998000D01*
X159956666Y-46855142D01*
X159909047Y-46807523D01*
X159528095Y-47950380D02*
X159528095Y-46950380D01*
X159147142Y-48331333D02*
X159099523Y-48283714D01*
X159004285Y-48140857D01*
X158956666Y-48045619D01*
X158909047Y-47902761D01*
X158861428Y-47664666D01*
X158861428Y-47474190D01*
X158909047Y-47236095D01*
X158956666Y-47093238D01*
X159004285Y-46998000D01*
X159099523Y-46855142D01*
X159147142Y-46807523D01*
D11*
X162306000Y-43434000D02*
X162052000Y-43180000D01*
X162306000Y-42926000D02*
X162306000Y-43434000D01*
X162052000Y-43180000D02*
X162306000Y-42926000D01*
X163576000Y-42418000D02*
X163830000Y-42164000D01*
X163576000Y-41910000D02*
X163576000Y-42418000D01*
X163830000Y-42164000D02*
X163576000Y-41910000D01*
X162052000Y-42164000D02*
X163830000Y-42164000D01*
X163576000Y-43180000D02*
X162052000Y-43180000D01*
X164084000Y-44704000D02*
X163576000Y-43180000D01*
X162814000Y-40386000D02*
X162814000Y-38608000D01*
X163830000Y-40386000D02*
X161798000Y-40386000D01*
X214122000Y-33782000D02*
X214122000Y-32004000D01*
X215138000Y-33782000D02*
X213106000Y-33782000D01*
D10*
X216590380Y-30932380D02*
X216923714Y-30456190D01*
X217161809Y-30932380D02*
X217161809Y-29932380D01*
X216780857Y-29932380D01*
X216685619Y-29980000D01*
X216638000Y-30027619D01*
X216590380Y-30122857D01*
X216590380Y-30265714D01*
X216638000Y-30360952D01*
X216685619Y-30408571D01*
X216780857Y-30456190D01*
X217161809Y-30456190D01*
X216257047Y-29932380D02*
X215590380Y-30932380D01*
X215590380Y-29932380D02*
X216257047Y-30932380D01*
X214161809Y-31313333D02*
X214209428Y-31265714D01*
X214304666Y-31122857D01*
X214352285Y-31027619D01*
X214399904Y-30884761D01*
X214447523Y-30646666D01*
X214447523Y-30456190D01*
X214399904Y-30218095D01*
X214352285Y-30075238D01*
X214304666Y-29980000D01*
X214209428Y-29837142D01*
X214161809Y-29789523D01*
X213780857Y-30932380D02*
X213780857Y-29932380D01*
X213399904Y-31313333D02*
X213352285Y-31265714D01*
X213257047Y-31122857D01*
X213209428Y-31027619D01*
X213161809Y-30884761D01*
X213114190Y-30646666D01*
X213114190Y-30456190D01*
X213161809Y-30218095D01*
X213209428Y-30075238D01*
X213257047Y-29980000D01*
X213352285Y-29837142D01*
X213399904Y-29789523D01*
X217471333Y-27392380D02*
X216899904Y-27392380D01*
X217185619Y-28392380D02*
X217185619Y-27392380D01*
X216661809Y-27392380D02*
X215995142Y-28392380D01*
X215995142Y-27392380D02*
X216661809Y-28392380D01*
X214566571Y-28773333D02*
X214614190Y-28725714D01*
X214709428Y-28582857D01*
X214757047Y-28487619D01*
X214804666Y-28344761D01*
X214852285Y-28106666D01*
X214852285Y-27916190D01*
X214804666Y-27678095D01*
X214757047Y-27535238D01*
X214709428Y-27440000D01*
X214614190Y-27297142D01*
X214566571Y-27249523D01*
X213995142Y-27392380D02*
X213804666Y-27392380D01*
X213709428Y-27440000D01*
X213614190Y-27535238D01*
X213566571Y-27725714D01*
X213566571Y-28059047D01*
X213614190Y-28249523D01*
X213709428Y-28344761D01*
X213804666Y-28392380D01*
X213995142Y-28392380D01*
X214090380Y-28344761D01*
X214185619Y-28249523D01*
X214233238Y-28059047D01*
X214233238Y-27725714D01*
X214185619Y-27535238D01*
X214090380Y-27440000D01*
X213995142Y-27392380D01*
X213233238Y-28773333D02*
X213185619Y-28725714D01*
X213090380Y-28582857D01*
X213042761Y-28487619D01*
X212995142Y-28344761D01*
X212947523Y-28106666D01*
X212947523Y-27916190D01*
X212995142Y-27678095D01*
X213042761Y-27535238D01*
X213090380Y-27440000D01*
X213185619Y-27297142D01*
X213233238Y-27249523D01*
X218844761Y-26329142D02*
X218892380Y-26472000D01*
X218892380Y-26710095D01*
X218844761Y-26805333D01*
X218797142Y-26852952D01*
X218701904Y-26900571D01*
X218606666Y-26900571D01*
X218511428Y-26852952D01*
X218463809Y-26805333D01*
X218416190Y-26710095D01*
X218368571Y-26519619D01*
X218320952Y-26424380D01*
X218273333Y-26376761D01*
X218178095Y-26329142D01*
X218082857Y-26329142D01*
X217987619Y-26376761D01*
X217940000Y-26424380D01*
X217892380Y-26519619D01*
X217892380Y-26757714D01*
X217940000Y-26900571D01*
X218844761Y-27710095D02*
X218892380Y-27614857D01*
X218892380Y-27424380D01*
X218844761Y-27329142D01*
X218749523Y-27281523D01*
X218368571Y-27281523D01*
X218273333Y-27329142D01*
X218225714Y-27424380D01*
X218225714Y-27614857D01*
X218273333Y-27710095D01*
X218368571Y-27757714D01*
X218463809Y-27757714D01*
X218559047Y-27281523D01*
X218892380Y-28186285D02*
X218225714Y-28186285D01*
X218416190Y-28186285D02*
X218320952Y-28233904D01*
X218273333Y-28281523D01*
X218225714Y-28376761D01*
X218225714Y-28472000D01*
X218225714Y-28710095D02*
X218892380Y-28948190D01*
X218225714Y-29186285D01*
X218892380Y-29567238D02*
X218225714Y-29567238D01*
X217892380Y-29567238D02*
X217940000Y-29519619D01*
X217987619Y-29567238D01*
X217940000Y-29614857D01*
X217892380Y-29567238D01*
X217987619Y-29567238D01*
X218844761Y-30472000D02*
X218892380Y-30376761D01*
X218892380Y-30186285D01*
X218844761Y-30091047D01*
X218797142Y-30043428D01*
X218701904Y-29995809D01*
X218416190Y-29995809D01*
X218320952Y-30043428D01*
X218273333Y-30091047D01*
X218225714Y-30186285D01*
X218225714Y-30376761D01*
X218273333Y-30472000D01*
X218844761Y-31281523D02*
X218892380Y-31186285D01*
X218892380Y-30995809D01*
X218844761Y-30900571D01*
X218749523Y-30852952D01*
X218368571Y-30852952D01*
X218273333Y-30900571D01*
X218225714Y-30995809D01*
X218225714Y-31186285D01*
X218273333Y-31281523D01*
X218368571Y-31329142D01*
X218463809Y-31329142D01*
X218559047Y-30852952D01*
X217892380Y-32519619D02*
X218701904Y-32519619D01*
X218797142Y-32567238D01*
X218844761Y-32614857D01*
X218892380Y-32710095D01*
X218892380Y-32900571D01*
X218844761Y-32995809D01*
X218797142Y-33043428D01*
X218701904Y-33091047D01*
X217892380Y-33091047D01*
X218892380Y-33567238D02*
X217892380Y-33567238D01*
X163845619Y-55824380D02*
X163845619Y-54824380D01*
X163607523Y-54824380D01*
X163464666Y-54872000D01*
X163369428Y-54967238D01*
X163321809Y-55062476D01*
X163274190Y-55252952D01*
X163274190Y-55395809D01*
X163321809Y-55586285D01*
X163369428Y-55681523D01*
X163464666Y-55776761D01*
X163607523Y-55824380D01*
X163845619Y-55824380D01*
X162464666Y-55776761D02*
X162559904Y-55824380D01*
X162750380Y-55824380D01*
X162845619Y-55776761D01*
X162893238Y-55681523D01*
X162893238Y-55300571D01*
X162845619Y-55205333D01*
X162750380Y-55157714D01*
X162559904Y-55157714D01*
X162464666Y-55205333D01*
X162417047Y-55300571D01*
X162417047Y-55395809D01*
X162893238Y-55491047D01*
X161988476Y-55824380D02*
X161988476Y-54824380D01*
X161988476Y-55205333D02*
X161893238Y-55157714D01*
X161702761Y-55157714D01*
X161607523Y-55205333D01*
X161559904Y-55252952D01*
X161512285Y-55348190D01*
X161512285Y-55633904D01*
X161559904Y-55729142D01*
X161607523Y-55776761D01*
X161702761Y-55824380D01*
X161893238Y-55824380D01*
X161988476Y-55776761D01*
X160655142Y-55157714D02*
X160655142Y-55824380D01*
X161083714Y-55157714D02*
X161083714Y-55681523D01*
X161036095Y-55776761D01*
X160940857Y-55824380D01*
X160798000Y-55824380D01*
X160702761Y-55776761D01*
X160655142Y-55729142D01*
X159750380Y-55157714D02*
X159750380Y-55967238D01*
X159798000Y-56062476D01*
X159845619Y-56110095D01*
X159940857Y-56157714D01*
X160083714Y-56157714D01*
X160178952Y-56110095D01*
X159750380Y-55776761D02*
X159845619Y-55824380D01*
X160036095Y-55824380D01*
X160131333Y-55776761D01*
X160178952Y-55729142D01*
X160226571Y-55633904D01*
X160226571Y-55348190D01*
X160178952Y-55252952D01*
X160131333Y-55205333D01*
X160036095Y-55157714D01*
X159845619Y-55157714D01*
X159750380Y-55205333D01*
X170068285Y-38044380D02*
X170068285Y-37044380D01*
X169687333Y-37044380D01*
X169592095Y-37092000D01*
X169544476Y-37139619D01*
X169496857Y-37234857D01*
X169496857Y-37377714D01*
X169544476Y-37472952D01*
X169592095Y-37520571D01*
X169687333Y-37568190D01*
X170068285Y-37568190D01*
X169068285Y-38044380D02*
X169068285Y-37377714D01*
X169068285Y-37568190D02*
X169020666Y-37472952D01*
X168973047Y-37425333D01*
X168877809Y-37377714D01*
X168782571Y-37377714D01*
X168306380Y-38044380D02*
X168401619Y-37996761D01*
X168449238Y-37949142D01*
X168496857Y-37853904D01*
X168496857Y-37568190D01*
X168449238Y-37472952D01*
X168401619Y-37425333D01*
X168306380Y-37377714D01*
X168163523Y-37377714D01*
X168068285Y-37425333D01*
X168020666Y-37472952D01*
X167973047Y-37568190D01*
X167973047Y-37853904D01*
X168020666Y-37949142D01*
X168068285Y-37996761D01*
X168163523Y-38044380D01*
X168306380Y-38044380D01*
X167115904Y-37377714D02*
X167115904Y-38187238D01*
X167163523Y-38282476D01*
X167211142Y-38330095D01*
X167306380Y-38377714D01*
X167449238Y-38377714D01*
X167544476Y-38330095D01*
X167115904Y-37996761D02*
X167211142Y-38044380D01*
X167401619Y-38044380D01*
X167496857Y-37996761D01*
X167544476Y-37949142D01*
X167592095Y-37853904D01*
X167592095Y-37568190D01*
X167544476Y-37472952D01*
X167496857Y-37425333D01*
X167401619Y-37377714D01*
X167211142Y-37377714D01*
X167115904Y-37425333D01*
X166639714Y-38044380D02*
X166639714Y-37377714D01*
X166639714Y-37568190D02*
X166592095Y-37472952D01*
X166544476Y-37425333D01*
X166449238Y-37377714D01*
X166354000Y-37377714D01*
X165592095Y-38044380D02*
X165592095Y-37520571D01*
X165639714Y-37425333D01*
X165734952Y-37377714D01*
X165925428Y-37377714D01*
X166020666Y-37425333D01*
X165592095Y-37996761D02*
X165687333Y-38044380D01*
X165925428Y-38044380D01*
X166020666Y-37996761D01*
X166068285Y-37901523D01*
X166068285Y-37806285D01*
X166020666Y-37711047D01*
X165925428Y-37663428D01*
X165687333Y-37663428D01*
X165592095Y-37615809D01*
X165115904Y-38044380D02*
X165115904Y-37377714D01*
X165115904Y-37472952D02*
X165068285Y-37425333D01*
X164973047Y-37377714D01*
X164830190Y-37377714D01*
X164734952Y-37425333D01*
X164687333Y-37520571D01*
X164687333Y-38044380D01*
X164687333Y-37520571D02*
X164639714Y-37425333D01*
X164544476Y-37377714D01*
X164401619Y-37377714D01*
X164306380Y-37425333D01*
X164258761Y-37520571D01*
X164258761Y-38044380D01*
X163782571Y-38044380D02*
X163782571Y-37377714D01*
X163782571Y-37472952D02*
X163734952Y-37425333D01*
X163639714Y-37377714D01*
X163496857Y-37377714D01*
X163401619Y-37425333D01*
X163354000Y-37520571D01*
X163354000Y-38044380D01*
X163354000Y-37520571D02*
X163306380Y-37425333D01*
X163211142Y-37377714D01*
X163068285Y-37377714D01*
X162973047Y-37425333D01*
X162925428Y-37520571D01*
X162925428Y-38044380D01*
X162449238Y-38044380D02*
X162449238Y-37377714D01*
X162449238Y-37044380D02*
X162496857Y-37092000D01*
X162449238Y-37139619D01*
X162401619Y-37092000D01*
X162449238Y-37044380D01*
X162449238Y-37139619D01*
X161973047Y-37377714D02*
X161973047Y-38044380D01*
X161973047Y-37472952D02*
X161925428Y-37425333D01*
X161830190Y-37377714D01*
X161687333Y-37377714D01*
X161592095Y-37425333D01*
X161544476Y-37520571D01*
X161544476Y-38044380D01*
X160639714Y-37377714D02*
X160639714Y-38187238D01*
X160687333Y-38282476D01*
X160734952Y-38330095D01*
X160830190Y-38377714D01*
X160973047Y-38377714D01*
X161068285Y-38330095D01*
X160639714Y-37996761D02*
X160734952Y-38044380D01*
X160925428Y-38044380D01*
X161020666Y-37996761D01*
X161068285Y-37949142D01*
X161115904Y-37853904D01*
X161115904Y-37568190D01*
X161068285Y-37472952D01*
X161020666Y-37425333D01*
X160925428Y-37377714D01*
X160734952Y-37377714D01*
X160639714Y-37425333D01*
X203500666Y-31250000D02*
X203595904Y-31202380D01*
X203738761Y-31202380D01*
X203881619Y-31250000D01*
X203976857Y-31345238D01*
X204024476Y-31440476D01*
X204072095Y-31630952D01*
X204072095Y-31773809D01*
X204024476Y-31964285D01*
X203976857Y-32059523D01*
X203881619Y-32154761D01*
X203738761Y-32202380D01*
X203643523Y-32202380D01*
X203500666Y-32154761D01*
X203453047Y-32107142D01*
X203453047Y-31773809D01*
X203643523Y-31773809D01*
X202834000Y-31726190D02*
X202834000Y-32202380D01*
X203167333Y-31202380D02*
X202834000Y-31726190D01*
X202500666Y-31202380D01*
X202167333Y-31821428D02*
X201405428Y-31821428D01*
X200881619Y-32202380D02*
X200691142Y-32202380D01*
X200595904Y-32154761D01*
X200548285Y-32107142D01*
X200453047Y-31964285D01*
X200405428Y-31773809D01*
X200405428Y-31392857D01*
X200453047Y-31297619D01*
X200500666Y-31250000D01*
X200595904Y-31202380D01*
X200786380Y-31202380D01*
X200881619Y-31250000D01*
X200929238Y-31297619D01*
X200976857Y-31392857D01*
X200976857Y-31630952D01*
X200929238Y-31726190D01*
X200881619Y-31773809D01*
X200786380Y-31821428D01*
X200595904Y-31821428D01*
X200500666Y-31773809D01*
X200453047Y-31726190D01*
X200405428Y-31630952D01*
X199453047Y-32202380D02*
X200024476Y-32202380D01*
X199738761Y-32202380D02*
X199738761Y-31202380D01*
X199834000Y-31345238D01*
X199929238Y-31440476D01*
X200024476Y-31488095D01*
X198310190Y-32154761D02*
X198214952Y-32202380D01*
X198024476Y-32202380D01*
X197929238Y-32154761D01*
X197881619Y-32059523D01*
X197881619Y-32011904D01*
X197929238Y-31916666D01*
X198024476Y-31869047D01*
X198167333Y-31869047D01*
X198262571Y-31821428D01*
X198310190Y-31726190D01*
X198310190Y-31678571D01*
X198262571Y-31583333D01*
X198167333Y-31535714D01*
X198024476Y-31535714D01*
X197929238Y-31583333D01*
X197072095Y-32154761D02*
X197167333Y-32202380D01*
X197357809Y-32202380D01*
X197453047Y-32154761D01*
X197500666Y-32059523D01*
X197500666Y-31678571D01*
X197453047Y-31583333D01*
X197357809Y-31535714D01*
X197167333Y-31535714D01*
X197072095Y-31583333D01*
X197024476Y-31678571D01*
X197024476Y-31773809D01*
X197500666Y-31869047D01*
X196595904Y-31535714D02*
X196595904Y-32202380D01*
X196595904Y-31630952D02*
X196548285Y-31583333D01*
X196453047Y-31535714D01*
X196310190Y-31535714D01*
X196214952Y-31583333D01*
X196167333Y-31678571D01*
X196167333Y-32202380D01*
X195738761Y-32154761D02*
X195643523Y-32202380D01*
X195453047Y-32202380D01*
X195357809Y-32154761D01*
X195310190Y-32059523D01*
X195310190Y-32011904D01*
X195357809Y-31916666D01*
X195453047Y-31869047D01*
X195595904Y-31869047D01*
X195691142Y-31821428D01*
X195738761Y-31726190D01*
X195738761Y-31678571D01*
X195691142Y-31583333D01*
X195595904Y-31535714D01*
X195453047Y-31535714D01*
X195357809Y-31583333D01*
X194738761Y-32202380D02*
X194834000Y-32154761D01*
X194881619Y-32107142D01*
X194929238Y-32011904D01*
X194929238Y-31726190D01*
X194881619Y-31630952D01*
X194834000Y-31583333D01*
X194738761Y-31535714D01*
X194595904Y-31535714D01*
X194500666Y-31583333D01*
X194453047Y-31630952D01*
X194405428Y-31726190D01*
X194405428Y-32011904D01*
X194453047Y-32107142D01*
X194500666Y-32154761D01*
X194595904Y-32202380D01*
X194738761Y-32202380D01*
X193976857Y-32202380D02*
X193976857Y-31535714D01*
X193976857Y-31726190D02*
X193929238Y-31630952D01*
X193881619Y-31583333D01*
X193786380Y-31535714D01*
X193691142Y-31535714D01*
X192595904Y-32202380D02*
X192595904Y-31535714D01*
X192595904Y-31630952D02*
X192548285Y-31583333D01*
X192453047Y-31535714D01*
X192310190Y-31535714D01*
X192214952Y-31583333D01*
X192167333Y-31678571D01*
X192167333Y-32202380D01*
X192167333Y-31678571D02*
X192119714Y-31583333D01*
X192024476Y-31535714D01*
X191881619Y-31535714D01*
X191786380Y-31583333D01*
X191738761Y-31678571D01*
X191738761Y-32202380D01*
X191119714Y-32202380D02*
X191214952Y-32154761D01*
X191262571Y-32107142D01*
X191310190Y-32011904D01*
X191310190Y-31726190D01*
X191262571Y-31630952D01*
X191214952Y-31583333D01*
X191119714Y-31535714D01*
X190976857Y-31535714D01*
X190881619Y-31583333D01*
X190834000Y-31630952D01*
X190786380Y-31726190D01*
X190786380Y-32011904D01*
X190834000Y-32107142D01*
X190881619Y-32154761D01*
X190976857Y-32202380D01*
X191119714Y-32202380D01*
X189929238Y-32202380D02*
X189929238Y-31202380D01*
X189929238Y-32154761D02*
X190024476Y-32202380D01*
X190214952Y-32202380D01*
X190310190Y-32154761D01*
X190357809Y-32107142D01*
X190405428Y-32011904D01*
X190405428Y-31726190D01*
X190357809Y-31630952D01*
X190310190Y-31583333D01*
X190214952Y-31535714D01*
X190024476Y-31535714D01*
X189929238Y-31583333D01*
X189024476Y-31535714D02*
X189024476Y-32202380D01*
X189453047Y-31535714D02*
X189453047Y-32059523D01*
X189405428Y-32154761D01*
X189310190Y-32202380D01*
X189167333Y-32202380D01*
X189072095Y-32154761D01*
X189024476Y-32107142D01*
X188405428Y-32202380D02*
X188500666Y-32154761D01*
X188548285Y-32059523D01*
X188548285Y-31202380D01*
X187643523Y-32154761D02*
X187738761Y-32202380D01*
X187929238Y-32202380D01*
X188024476Y-32154761D01*
X188072095Y-32059523D01*
X188072095Y-31678571D01*
X188024476Y-31583333D01*
X187929238Y-31535714D01*
X187738761Y-31535714D01*
X187643523Y-31583333D01*
X187595904Y-31678571D01*
X187595904Y-31773809D01*
X188072095Y-31869047D01*
D11*
X185614000Y-34036000D02*
X185614000Y-35366000D01*
X185614000Y-35366000D02*
X186944000Y-35366000D01*
X188214000Y-35366000D02*
X206054000Y-35366000D01*
X206054000Y-32706000D02*
X206054000Y-35366000D01*
X188214000Y-32706000D02*
X206054000Y-32706000D01*
X188214000Y-32706000D02*
X188214000Y-35366000D01*
X185451500Y-66340000D02*
X181366500Y-66340000D01*
X185451500Y-64470000D02*
X185451500Y-66340000D01*
X181366500Y-64470000D02*
X185451500Y-64470000D01*
X162558000Y-62933733D02*
X162558000Y-63276267D01*
X163578000Y-62933733D02*
X163578000Y-63276267D01*
X209998000Y-31750000D02*
X212658000Y-31750000D01*
X209998000Y-31750000D02*
X209998000Y-26610000D01*
X209998000Y-26610000D02*
X212658000Y-26610000D01*
X212658000Y-31750000D02*
X212658000Y-26610000D01*
X212658000Y-34350000D02*
X212658000Y-33020000D01*
X211328000Y-34350000D02*
X212658000Y-34350000D01*
X166938000Y-40894000D02*
X164278000Y-40894000D01*
X166938000Y-40894000D02*
X166938000Y-51114000D01*
X166938000Y-51114000D02*
X164278000Y-51114000D01*
X164278000Y-40894000D02*
X164278000Y-51114000D01*
X164278000Y-38294000D02*
X164278000Y-39624000D01*
X165608000Y-38294000D02*
X164278000Y-38294000D01*
X166938000Y-55118000D02*
X164278000Y-55118000D01*
X166938000Y-55118000D02*
X166938000Y-67878000D01*
X166938000Y-67878000D02*
X164278000Y-67878000D01*
X164278000Y-55118000D02*
X164278000Y-67878000D01*
X164278000Y-52518000D02*
X164278000Y-53848000D01*
X165608000Y-52518000D02*
X164278000Y-52518000D01*
X190752000Y-39452733D02*
X190752000Y-39795267D01*
X191772000Y-39452733D02*
X191772000Y-39795267D01*
X204411733Y-50548000D02*
X204754267Y-50548000D01*
X204411733Y-49528000D02*
X204754267Y-49528000D01*
X168912000Y-44254267D02*
X168912000Y-43911733D01*
X167892000Y-44254267D02*
X167892000Y-43911733D01*
X163324000Y-45270267D02*
X163324000Y-44927733D01*
X162304000Y-45270267D02*
X162304000Y-44927733D01*
X185146000Y-45456000D02*
G75*
G03*
X185146000Y-45456000I-7600000J0D01*
G01*
X175318267Y-64768000D02*
X174975733Y-64768000D01*
X175318267Y-65788000D02*
X174975733Y-65788000D01*
X178531733Y-64768000D02*
X178874267Y-64768000D01*
X178531733Y-65788000D02*
X178874267Y-65788000D01*
X201363733Y-46226000D02*
X201706267Y-46226000D01*
X201363733Y-47246000D02*
X201706267Y-47246000D01*
X175204748Y-66870000D02*
X177977252Y-66870000D01*
X175204748Y-70290000D02*
X177977252Y-70290000D01*
X185734000Y-73974000D02*
X185734000Y-72644000D01*
X184404000Y-73974000D02*
X185734000Y-73974000D01*
X183134000Y-73974000D02*
X183134000Y-71314000D01*
X183134000Y-71314000D02*
X180534000Y-71314000D01*
X183134000Y-73974000D02*
X180534000Y-73974000D01*
X180534000Y-73974000D02*
X180534000Y-71314000D01*
X174184000Y-71314000D02*
X174184000Y-72644000D01*
X175514000Y-71314000D02*
X174184000Y-71314000D01*
X176784000Y-71314000D02*
X176784000Y-73974000D01*
X176784000Y-73974000D02*
X179384000Y-73974000D01*
X176784000Y-71314000D02*
X179384000Y-71314000D01*
X179384000Y-71314000D02*
X179384000Y-73974000D01*
X200883733Y-49528000D02*
X201226267Y-49528000D01*
X200883733Y-50548000D02*
X201226267Y-50548000D01*
X198964733Y-38352000D02*
X199307267Y-38352000D01*
X198964733Y-39372000D02*
X199307267Y-39372000D01*
X202379733Y-40134000D02*
X202722267Y-40134000D01*
X202379733Y-39114000D02*
X202722267Y-39114000D01*
X165271267Y-34542000D02*
X164928733Y-34542000D01*
X165271267Y-35562000D02*
X164928733Y-35562000D01*
X165271267Y-31244000D02*
X164928733Y-31244000D01*
X165271267Y-30224000D02*
X164928733Y-30224000D01*
X165271267Y-28700000D02*
X164928733Y-28700000D01*
X165271267Y-29720000D02*
X164928733Y-29720000D01*
X175258000Y-83916733D02*
X175258000Y-84259267D01*
X176278000Y-83916733D02*
X176278000Y-84259267D01*
X173639267Y-81917000D02*
X173296733Y-81917000D01*
X173639267Y-80897000D02*
X173296733Y-80897000D01*
X179834000Y-92552733D02*
X179834000Y-92895267D01*
X178814000Y-92552733D02*
X178814000Y-92895267D01*
X173258267Y-85981000D02*
X172915733Y-85981000D01*
X173258267Y-84961000D02*
X172915733Y-84961000D01*
X180535733Y-81786000D02*
X180878267Y-81786000D01*
X180535733Y-82806000D02*
X180878267Y-82806000D01*
X180535733Y-84330000D02*
X180878267Y-84330000D01*
X180535733Y-83310000D02*
X180878267Y-83310000D01*
X204658000Y-52070000D02*
G75*
G03*
X204658000Y-52070000I-950000J0D01*
G01*
X200340000Y-41656000D02*
G75*
G03*
X200340000Y-41656000I-950000J0D01*
G01*
X163596000Y-65986000D02*
X163596000Y-68436000D01*
X160376000Y-67786000D02*
X160376000Y-65986000D01*
X180702000Y-63942000D02*
X180702000Y-57932000D01*
X173882000Y-61692000D02*
X173882000Y-57932000D01*
X180702000Y-57932000D02*
X179442000Y-57932000D01*
X173882000Y-57932000D02*
X175142000Y-57932000D01*
X202722267Y-40638000D02*
X202379733Y-40638000D01*
X202722267Y-41658000D02*
X202379733Y-41658000D01*
X202661733Y-48004000D02*
X203004267Y-48004000D01*
X202661733Y-49024000D02*
X203004267Y-49024000D01*
X175708000Y-80959000D02*
X175708000Y-78299000D01*
X180848000Y-80959000D02*
X175708000Y-80959000D01*
X180848000Y-78299000D02*
X175708000Y-78299000D01*
X180848000Y-80959000D02*
X180848000Y-78299000D01*
X182118000Y-80959000D02*
X183448000Y-80959000D01*
X183448000Y-80959000D02*
X183448000Y-79629000D01*
X173154000Y-68469000D02*
X167714000Y-68469000D01*
X173154000Y-68229000D02*
X167714000Y-68229000D01*
X173154000Y-68349000D02*
X167714000Y-68349000D01*
X170434000Y-59244000D02*
X170434000Y-60154000D01*
X170434000Y-70804000D02*
X170434000Y-69894000D01*
X173154000Y-60154000D02*
X173154000Y-69894000D01*
X167714000Y-60154000D02*
X173154000Y-60154000D01*
X167714000Y-69894000D02*
X167714000Y-60154000D01*
X173154000Y-69894000D02*
X167714000Y-69894000D01*
D10*
X183626380Y-33702666D02*
X184340666Y-33702666D01*
X184483523Y-33655047D01*
X184578761Y-33559809D01*
X184626380Y-33416952D01*
X184626380Y-33321714D01*
X183626380Y-34083619D02*
X183626380Y-34750285D01*
X184626380Y-34321714D01*
X186856666Y-65889142D02*
X186904285Y-65936761D01*
X187047142Y-65984380D01*
X187142380Y-65984380D01*
X187285238Y-65936761D01*
X187380476Y-65841523D01*
X187428095Y-65746285D01*
X187475714Y-65555809D01*
X187475714Y-65412952D01*
X187428095Y-65222476D01*
X187380476Y-65127238D01*
X187285238Y-65032000D01*
X187142380Y-64984380D01*
X187047142Y-64984380D01*
X186904285Y-65032000D01*
X186856666Y-65079619D01*
X185951904Y-64984380D02*
X186428095Y-64984380D01*
X186475714Y-65460571D01*
X186428095Y-65412952D01*
X186332857Y-65365333D01*
X186094761Y-65365333D01*
X185999523Y-65412952D01*
X185951904Y-65460571D01*
X185904285Y-65555809D01*
X185904285Y-65793904D01*
X185951904Y-65889142D01*
X185999523Y-65936761D01*
X186094761Y-65984380D01*
X186332857Y-65984380D01*
X186428095Y-65936761D01*
X186475714Y-65889142D01*
X163520380Y-59301142D02*
X163044190Y-58967809D01*
X163520380Y-58729714D02*
X162520380Y-58729714D01*
X162520380Y-59110666D01*
X162568000Y-59205904D01*
X162615619Y-59253523D01*
X162710857Y-59301142D01*
X162853714Y-59301142D01*
X162948952Y-59253523D01*
X162996571Y-59205904D01*
X163044190Y-59110666D01*
X163044190Y-58729714D01*
X163520380Y-60253523D02*
X163520380Y-59682095D01*
X163520380Y-59967809D02*
X162520380Y-59967809D01*
X162663238Y-59872571D01*
X162758476Y-59777333D01*
X162806095Y-59682095D01*
X162520380Y-60872571D02*
X162520380Y-60967809D01*
X162568000Y-61063047D01*
X162615619Y-61110666D01*
X162710857Y-61158285D01*
X162901333Y-61205904D01*
X163139428Y-61205904D01*
X163329904Y-61158285D01*
X163425142Y-61110666D01*
X163472761Y-61063047D01*
X163520380Y-60967809D01*
X163520380Y-60872571D01*
X163472761Y-60777333D01*
X163425142Y-60729714D01*
X163329904Y-60682095D01*
X163139428Y-60634476D01*
X162901333Y-60634476D01*
X162710857Y-60682095D01*
X162615619Y-60729714D01*
X162568000Y-60777333D01*
X162520380Y-60872571D01*
X209121333Y-32472380D02*
X209121333Y-33186666D01*
X209168952Y-33329523D01*
X209264190Y-33424761D01*
X209407047Y-33472380D01*
X209502285Y-33472380D01*
X208216571Y-32805714D02*
X208216571Y-33472380D01*
X208454666Y-32424761D02*
X208692761Y-33139047D01*
X208073714Y-33139047D01*
X168227333Y-39076380D02*
X168227333Y-39790666D01*
X168274952Y-39933523D01*
X168370190Y-40028761D01*
X168513047Y-40076380D01*
X168608285Y-40076380D01*
X167846380Y-39076380D02*
X167227333Y-39076380D01*
X167560666Y-39457333D01*
X167417809Y-39457333D01*
X167322571Y-39504952D01*
X167274952Y-39552571D01*
X167227333Y-39647809D01*
X167227333Y-39885904D01*
X167274952Y-39981142D01*
X167322571Y-40028761D01*
X167417809Y-40076380D01*
X167703523Y-40076380D01*
X167798761Y-40028761D01*
X167846380Y-39981142D01*
X163401333Y-53300380D02*
X163401333Y-54014666D01*
X163448952Y-54157523D01*
X163544190Y-54252761D01*
X163687047Y-54300380D01*
X163782285Y-54300380D01*
X162972761Y-53395619D02*
X162925142Y-53348000D01*
X162829904Y-53300380D01*
X162591809Y-53300380D01*
X162496571Y-53348000D01*
X162448952Y-53395619D01*
X162401333Y-53490857D01*
X162401333Y-53586095D01*
X162448952Y-53728952D01*
X163020380Y-54300380D01*
X162401333Y-54300380D01*
X194190857Y-40076380D02*
X194524190Y-39600190D01*
X194762285Y-40076380D02*
X194762285Y-39076380D01*
X194381333Y-39076380D01*
X194286095Y-39124000D01*
X194238476Y-39171619D01*
X194190857Y-39266857D01*
X194190857Y-39409714D01*
X194238476Y-39504952D01*
X194286095Y-39552571D01*
X194381333Y-39600190D01*
X194762285Y-39600190D01*
X193857523Y-39076380D02*
X193238476Y-39076380D01*
X193571809Y-39457333D01*
X193428952Y-39457333D01*
X193333714Y-39504952D01*
X193286095Y-39552571D01*
X193238476Y-39647809D01*
X193238476Y-39885904D01*
X193286095Y-39981142D01*
X193333714Y-40028761D01*
X193428952Y-40076380D01*
X193714666Y-40076380D01*
X193809904Y-40028761D01*
X193857523Y-39981142D01*
X192905142Y-39076380D02*
X192286095Y-39076380D01*
X192619428Y-39457333D01*
X192476571Y-39457333D01*
X192381333Y-39504952D01*
X192333714Y-39552571D01*
X192286095Y-39647809D01*
X192286095Y-39885904D01*
X192333714Y-39981142D01*
X192381333Y-40028761D01*
X192476571Y-40076380D01*
X192762285Y-40076380D01*
X192857523Y-40028761D01*
X192905142Y-39981142D01*
X205652666Y-52014380D02*
X205986000Y-51538190D01*
X206224095Y-52014380D02*
X206224095Y-51014380D01*
X205843142Y-51014380D01*
X205747904Y-51062000D01*
X205700285Y-51109619D01*
X205652666Y-51204857D01*
X205652666Y-51347714D01*
X205700285Y-51442952D01*
X205747904Y-51490571D01*
X205843142Y-51538190D01*
X206224095Y-51538190D01*
X205319333Y-51014380D02*
X204652666Y-51014380D01*
X205081238Y-52014380D01*
X169584666Y-42108380D02*
X169918000Y-41632190D01*
X170156095Y-42108380D02*
X170156095Y-41108380D01*
X169775142Y-41108380D01*
X169679904Y-41156000D01*
X169632285Y-41203619D01*
X169584666Y-41298857D01*
X169584666Y-41441714D01*
X169632285Y-41536952D01*
X169679904Y-41584571D01*
X169775142Y-41632190D01*
X170156095Y-41632190D01*
X169203714Y-41203619D02*
X169156095Y-41156000D01*
X169060857Y-41108380D01*
X168822761Y-41108380D01*
X168727523Y-41156000D01*
X168679904Y-41203619D01*
X168632285Y-41298857D01*
X168632285Y-41394095D01*
X168679904Y-41536952D01*
X169251333Y-42108380D01*
X168632285Y-42108380D01*
X161202666Y-45410380D02*
X161536000Y-44934190D01*
X161774095Y-45410380D02*
X161774095Y-44410380D01*
X161393142Y-44410380D01*
X161297904Y-44458000D01*
X161250285Y-44505619D01*
X161202666Y-44600857D01*
X161202666Y-44743714D01*
X161250285Y-44838952D01*
X161297904Y-44886571D01*
X161393142Y-44934190D01*
X161774095Y-44934190D01*
X160345523Y-44743714D02*
X160345523Y-45410380D01*
X160583619Y-44362761D02*
X160821714Y-45077047D01*
X160202666Y-45077047D01*
X178172952Y-36758571D02*
X178030095Y-36806190D01*
X177982476Y-36853809D01*
X177934857Y-36949047D01*
X177934857Y-37091904D01*
X177982476Y-37187142D01*
X178030095Y-37234761D01*
X178125333Y-37282380D01*
X178506285Y-37282380D01*
X178506285Y-36282380D01*
X178172952Y-36282380D01*
X178077714Y-36330000D01*
X178030095Y-36377619D01*
X177982476Y-36472857D01*
X177982476Y-36568095D01*
X178030095Y-36663333D01*
X178077714Y-36710952D01*
X178172952Y-36758571D01*
X178506285Y-36758571D01*
X177601523Y-36282380D02*
X176934857Y-36282380D01*
X177601523Y-37282380D01*
X176934857Y-37282380D01*
X176030095Y-37282380D02*
X176601523Y-37282380D01*
X176315809Y-37282380D02*
X176315809Y-36282380D01*
X176411047Y-36425238D01*
X176506285Y-36520476D01*
X176601523Y-36568095D01*
X180157428Y-48885047D02*
X180157428Y-49646952D01*
X180538380Y-49266000D02*
X179776476Y-49266000D01*
X173140666Y-59793142D02*
X173188285Y-59840761D01*
X173331142Y-59888380D01*
X173426380Y-59888380D01*
X173569238Y-59840761D01*
X173664476Y-59745523D01*
X173712095Y-59650285D01*
X173759714Y-59459809D01*
X173759714Y-59316952D01*
X173712095Y-59126476D01*
X173664476Y-59031238D01*
X173569238Y-58936000D01*
X173426380Y-58888380D01*
X173331142Y-58888380D01*
X173188285Y-58936000D01*
X173140666Y-58983619D01*
X172807333Y-58888380D02*
X172188285Y-58888380D01*
X172521619Y-59269333D01*
X172378761Y-59269333D01*
X172283523Y-59316952D01*
X172235904Y-59364571D01*
X172188285Y-59459809D01*
X172188285Y-59697904D01*
X172235904Y-59793142D01*
X172283523Y-59840761D01*
X172378761Y-59888380D01*
X172664476Y-59888380D01*
X172759714Y-59840761D01*
X172807333Y-59793142D01*
X180760666Y-67413142D02*
X180808285Y-67460761D01*
X180951142Y-67508380D01*
X181046380Y-67508380D01*
X181189238Y-67460761D01*
X181284476Y-67365523D01*
X181332095Y-67270285D01*
X181379714Y-67079809D01*
X181379714Y-66936952D01*
X181332095Y-66746476D01*
X181284476Y-66651238D01*
X181189238Y-66556000D01*
X181046380Y-66508380D01*
X180951142Y-66508380D01*
X180808285Y-66556000D01*
X180760666Y-66603619D01*
X179903523Y-66841714D02*
X179903523Y-67508380D01*
X180141619Y-66460761D02*
X180379714Y-67175047D01*
X179760666Y-67175047D01*
X199016857Y-47093142D02*
X199064476Y-47140761D01*
X199207333Y-47188380D01*
X199302571Y-47188380D01*
X199445428Y-47140761D01*
X199540666Y-47045523D01*
X199588285Y-46950285D01*
X199635904Y-46759809D01*
X199635904Y-46616952D01*
X199588285Y-46426476D01*
X199540666Y-46331238D01*
X199445428Y-46236000D01*
X199302571Y-46188380D01*
X199207333Y-46188380D01*
X199064476Y-46236000D01*
X199016857Y-46283619D01*
X198064476Y-47188380D02*
X198635904Y-47188380D01*
X198350190Y-47188380D02*
X198350190Y-46188380D01*
X198445428Y-46331238D01*
X198540666Y-46426476D01*
X198635904Y-46474095D01*
X197445428Y-46188380D02*
X197350190Y-46188380D01*
X197254952Y-46236000D01*
X197207333Y-46283619D01*
X197159714Y-46378857D01*
X197112095Y-46569333D01*
X197112095Y-46807428D01*
X197159714Y-46997904D01*
X197207333Y-47093142D01*
X197254952Y-47140761D01*
X197350190Y-47188380D01*
X197445428Y-47188380D01*
X197540666Y-47140761D01*
X197588285Y-47093142D01*
X197635904Y-46997904D01*
X197683523Y-46807428D01*
X197683523Y-46569333D01*
X197635904Y-46378857D01*
X197588285Y-46283619D01*
X197540666Y-46236000D01*
X197445428Y-46188380D01*
X180673333Y-70286571D02*
X181006666Y-70286571D01*
X181006666Y-70810380D02*
X181006666Y-69810380D01*
X180530476Y-69810380D01*
X179625714Y-70810380D02*
X180197142Y-70810380D01*
X179911428Y-70810380D02*
X179911428Y-69810380D01*
X180006666Y-69953238D01*
X180101904Y-70048476D01*
X180197142Y-70096095D01*
X187067333Y-72096380D02*
X187067333Y-72810666D01*
X187114952Y-72953523D01*
X187210190Y-73048761D01*
X187353047Y-73096380D01*
X187448285Y-73096380D01*
X186067333Y-73096380D02*
X186638761Y-73096380D01*
X186353047Y-73096380D02*
X186353047Y-72096380D01*
X186448285Y-72239238D01*
X186543523Y-72334476D01*
X186638761Y-72382095D01*
X175847333Y-74128380D02*
X175847333Y-74842666D01*
X175894952Y-74985523D01*
X175990190Y-75080761D01*
X176133047Y-75128380D01*
X176228285Y-75128380D01*
X174942571Y-74128380D02*
X175133047Y-74128380D01*
X175228285Y-74176000D01*
X175275904Y-74223619D01*
X175371142Y-74366476D01*
X175418761Y-74556952D01*
X175418761Y-74937904D01*
X175371142Y-75033142D01*
X175323523Y-75080761D01*
X175228285Y-75128380D01*
X175037809Y-75128380D01*
X174942571Y-75080761D01*
X174894952Y-75033142D01*
X174847333Y-74937904D01*
X174847333Y-74699809D01*
X174894952Y-74604571D01*
X174942571Y-74556952D01*
X175037809Y-74509333D01*
X175228285Y-74509333D01*
X175323523Y-74556952D01*
X175371142Y-74604571D01*
X175418761Y-74699809D01*
X201221666Y-51920380D02*
X201555000Y-51444190D01*
X201793095Y-51920380D02*
X201793095Y-50920380D01*
X201412142Y-50920380D01*
X201316904Y-50968000D01*
X201269285Y-51015619D01*
X201221666Y-51110857D01*
X201221666Y-51253714D01*
X201269285Y-51348952D01*
X201316904Y-51396571D01*
X201412142Y-51444190D01*
X201793095Y-51444190D01*
X200364523Y-50920380D02*
X200555000Y-50920380D01*
X200650238Y-50968000D01*
X200697857Y-51015619D01*
X200793095Y-51158476D01*
X200840714Y-51348952D01*
X200840714Y-51729904D01*
X200793095Y-51825142D01*
X200745476Y-51872761D01*
X200650238Y-51920380D01*
X200459761Y-51920380D01*
X200364523Y-51872761D01*
X200316904Y-51825142D01*
X200269285Y-51729904D01*
X200269285Y-51491809D01*
X200316904Y-51396571D01*
X200364523Y-51348952D01*
X200459761Y-51301333D01*
X200650238Y-51301333D01*
X200745476Y-51348952D01*
X200793095Y-51396571D01*
X200840714Y-51491809D01*
X199302666Y-37790380D02*
X199636000Y-37314190D01*
X199874095Y-37790380D02*
X199874095Y-36790380D01*
X199493142Y-36790380D01*
X199397904Y-36838000D01*
X199350285Y-36885619D01*
X199302666Y-36980857D01*
X199302666Y-37123714D01*
X199350285Y-37218952D01*
X199397904Y-37266571D01*
X199493142Y-37314190D01*
X199874095Y-37314190D01*
X198731238Y-37218952D02*
X198826476Y-37171333D01*
X198874095Y-37123714D01*
X198921714Y-37028476D01*
X198921714Y-36980857D01*
X198874095Y-36885619D01*
X198826476Y-36838000D01*
X198731238Y-36790380D01*
X198540761Y-36790380D01*
X198445523Y-36838000D01*
X198397904Y-36885619D01*
X198350285Y-36980857D01*
X198350285Y-37028476D01*
X198397904Y-37123714D01*
X198445523Y-37171333D01*
X198540761Y-37218952D01*
X198731238Y-37218952D01*
X198826476Y-37266571D01*
X198874095Y-37314190D01*
X198921714Y-37409428D01*
X198921714Y-37599904D01*
X198874095Y-37695142D01*
X198826476Y-37742761D01*
X198731238Y-37790380D01*
X198540761Y-37790380D01*
X198445523Y-37742761D01*
X198397904Y-37695142D01*
X198350285Y-37599904D01*
X198350285Y-37409428D01*
X198397904Y-37314190D01*
X198445523Y-37266571D01*
X198540761Y-37218952D01*
X202604666Y-43124380D02*
X202938000Y-42648190D01*
X203176095Y-43124380D02*
X203176095Y-42124380D01*
X202795142Y-42124380D01*
X202699904Y-42172000D01*
X202652285Y-42219619D01*
X202604666Y-42314857D01*
X202604666Y-42457714D01*
X202652285Y-42552952D01*
X202699904Y-42600571D01*
X202795142Y-42648190D01*
X203176095Y-42648190D01*
X202128476Y-43124380D02*
X201938000Y-43124380D01*
X201842761Y-43076761D01*
X201795142Y-43029142D01*
X201699904Y-42886285D01*
X201652285Y-42695809D01*
X201652285Y-42314857D01*
X201699904Y-42219619D01*
X201747523Y-42172000D01*
X201842761Y-42124380D01*
X202033238Y-42124380D01*
X202128476Y-42172000D01*
X202176095Y-42219619D01*
X202223714Y-42314857D01*
X202223714Y-42552952D01*
X202176095Y-42648190D01*
X202128476Y-42695809D01*
X202033238Y-42743428D01*
X201842761Y-42743428D01*
X201747523Y-42695809D01*
X201699904Y-42648190D01*
X201652285Y-42552952D01*
X165742857Y-34074380D02*
X166076190Y-33598190D01*
X166314285Y-34074380D02*
X166314285Y-33074380D01*
X165933333Y-33074380D01*
X165838095Y-33122000D01*
X165790476Y-33169619D01*
X165742857Y-33264857D01*
X165742857Y-33407714D01*
X165790476Y-33502952D01*
X165838095Y-33550571D01*
X165933333Y-33598190D01*
X166314285Y-33598190D01*
X165361904Y-33169619D02*
X165314285Y-33122000D01*
X165219047Y-33074380D01*
X164980952Y-33074380D01*
X164885714Y-33122000D01*
X164838095Y-33169619D01*
X164790476Y-33264857D01*
X164790476Y-33360095D01*
X164838095Y-33502952D01*
X165409523Y-34074380D01*
X164790476Y-34074380D01*
X164409523Y-33169619D02*
X164361904Y-33122000D01*
X164266666Y-33074380D01*
X164028571Y-33074380D01*
X163933333Y-33122000D01*
X163885714Y-33169619D01*
X163838095Y-33264857D01*
X163838095Y-33360095D01*
X163885714Y-33502952D01*
X164457142Y-34074380D01*
X163838095Y-34074380D01*
X168790857Y-31186380D02*
X169124190Y-30710190D01*
X169362285Y-31186380D02*
X169362285Y-30186380D01*
X168981333Y-30186380D01*
X168886095Y-30234000D01*
X168838476Y-30281619D01*
X168790857Y-30376857D01*
X168790857Y-30519714D01*
X168838476Y-30614952D01*
X168886095Y-30662571D01*
X168981333Y-30710190D01*
X169362285Y-30710190D01*
X168409904Y-30281619D02*
X168362285Y-30234000D01*
X168267047Y-30186380D01*
X168028952Y-30186380D01*
X167933714Y-30234000D01*
X167886095Y-30281619D01*
X167838476Y-30376857D01*
X167838476Y-30472095D01*
X167886095Y-30614952D01*
X168457523Y-31186380D01*
X167838476Y-31186380D01*
X167505142Y-30186380D02*
X166886095Y-30186380D01*
X167219428Y-30567333D01*
X167076571Y-30567333D01*
X166981333Y-30614952D01*
X166933714Y-30662571D01*
X166886095Y-30757809D01*
X166886095Y-30995904D01*
X166933714Y-31091142D01*
X166981333Y-31138761D01*
X167076571Y-31186380D01*
X167362285Y-31186380D01*
X167457523Y-31138761D01*
X167505142Y-31091142D01*
X168790857Y-29662380D02*
X169124190Y-29186190D01*
X169362285Y-29662380D02*
X169362285Y-28662380D01*
X168981333Y-28662380D01*
X168886095Y-28710000D01*
X168838476Y-28757619D01*
X168790857Y-28852857D01*
X168790857Y-28995714D01*
X168838476Y-29090952D01*
X168886095Y-29138571D01*
X168981333Y-29186190D01*
X169362285Y-29186190D01*
X168409904Y-28757619D02*
X168362285Y-28710000D01*
X168267047Y-28662380D01*
X168028952Y-28662380D01*
X167933714Y-28710000D01*
X167886095Y-28757619D01*
X167838476Y-28852857D01*
X167838476Y-28948095D01*
X167886095Y-29090952D01*
X168457523Y-29662380D01*
X167838476Y-29662380D01*
X166981333Y-28995714D02*
X166981333Y-29662380D01*
X167219428Y-28614761D02*
X167457523Y-29329047D01*
X166838476Y-29329047D01*
X177744380Y-83431142D02*
X177268190Y-83097809D01*
X177744380Y-82859714D02*
X176744380Y-82859714D01*
X176744380Y-83240666D01*
X176792000Y-83335904D01*
X176839619Y-83383523D01*
X176934857Y-83431142D01*
X177077714Y-83431142D01*
X177172952Y-83383523D01*
X177220571Y-83335904D01*
X177268190Y-83240666D01*
X177268190Y-82859714D01*
X176839619Y-83812095D02*
X176792000Y-83859714D01*
X176744380Y-83954952D01*
X176744380Y-84193047D01*
X176792000Y-84288285D01*
X176839619Y-84335904D01*
X176934857Y-84383523D01*
X177030095Y-84383523D01*
X177172952Y-84335904D01*
X177744380Y-83764476D01*
X177744380Y-84383523D01*
X176744380Y-85288285D02*
X176744380Y-84812095D01*
X177220571Y-84764476D01*
X177172952Y-84812095D01*
X177125333Y-84907333D01*
X177125333Y-85145428D01*
X177172952Y-85240666D01*
X177220571Y-85288285D01*
X177315809Y-85335904D01*
X177553904Y-85335904D01*
X177649142Y-85288285D01*
X177696761Y-85240666D01*
X177744380Y-85145428D01*
X177744380Y-84907333D01*
X177696761Y-84812095D01*
X177649142Y-84764476D01*
X171902380Y-79367142D02*
X171426190Y-79033809D01*
X171902380Y-78795714D02*
X170902380Y-78795714D01*
X170902380Y-79176666D01*
X170950000Y-79271904D01*
X170997619Y-79319523D01*
X171092857Y-79367142D01*
X171235714Y-79367142D01*
X171330952Y-79319523D01*
X171378571Y-79271904D01*
X171426190Y-79176666D01*
X171426190Y-78795714D01*
X170997619Y-79748095D02*
X170950000Y-79795714D01*
X170902380Y-79890952D01*
X170902380Y-80129047D01*
X170950000Y-80224285D01*
X170997619Y-80271904D01*
X171092857Y-80319523D01*
X171188095Y-80319523D01*
X171330952Y-80271904D01*
X171902380Y-79700476D01*
X171902380Y-80319523D01*
X170902380Y-80652857D02*
X170902380Y-81319523D01*
X171902380Y-80890952D01*
X179712857Y-95448380D02*
X180046190Y-94972190D01*
X180284285Y-95448380D02*
X180284285Y-94448380D01*
X179903333Y-94448380D01*
X179808095Y-94496000D01*
X179760476Y-94543619D01*
X179712857Y-94638857D01*
X179712857Y-94781714D01*
X179760476Y-94876952D01*
X179808095Y-94924571D01*
X179903333Y-94972190D01*
X180284285Y-94972190D01*
X179331904Y-94543619D02*
X179284285Y-94496000D01*
X179189047Y-94448380D01*
X178950952Y-94448380D01*
X178855714Y-94496000D01*
X178808095Y-94543619D01*
X178760476Y-94638857D01*
X178760476Y-94734095D01*
X178808095Y-94876952D01*
X179379523Y-95448380D01*
X178760476Y-95448380D01*
X178189047Y-94876952D02*
X178284285Y-94829333D01*
X178331904Y-94781714D01*
X178379523Y-94686476D01*
X178379523Y-94638857D01*
X178331904Y-94543619D01*
X178284285Y-94496000D01*
X178189047Y-94448380D01*
X177998571Y-94448380D01*
X177903333Y-94496000D01*
X177855714Y-94543619D01*
X177808095Y-94638857D01*
X177808095Y-94686476D01*
X177855714Y-94781714D01*
X177903333Y-94829333D01*
X177998571Y-94876952D01*
X178189047Y-94876952D01*
X178284285Y-94924571D01*
X178331904Y-94972190D01*
X178379523Y-95067428D01*
X178379523Y-95257904D01*
X178331904Y-95353142D01*
X178284285Y-95400761D01*
X178189047Y-95448380D01*
X177998571Y-95448380D01*
X177903333Y-95400761D01*
X177855714Y-95353142D01*
X177808095Y-95257904D01*
X177808095Y-95067428D01*
X177855714Y-94972190D01*
X177903333Y-94924571D01*
X177998571Y-94876952D01*
X170822857Y-86050380D02*
X171156190Y-85574190D01*
X171394285Y-86050380D02*
X171394285Y-85050380D01*
X171013333Y-85050380D01*
X170918095Y-85098000D01*
X170870476Y-85145619D01*
X170822857Y-85240857D01*
X170822857Y-85383714D01*
X170870476Y-85478952D01*
X170918095Y-85526571D01*
X171013333Y-85574190D01*
X171394285Y-85574190D01*
X170489523Y-85050380D02*
X169870476Y-85050380D01*
X170203809Y-85431333D01*
X170060952Y-85431333D01*
X169965714Y-85478952D01*
X169918095Y-85526571D01*
X169870476Y-85621809D01*
X169870476Y-85859904D01*
X169918095Y-85955142D01*
X169965714Y-86002761D01*
X170060952Y-86050380D01*
X170346666Y-86050380D01*
X170441904Y-86002761D01*
X170489523Y-85955142D01*
X169251428Y-85050380D02*
X169156190Y-85050380D01*
X169060952Y-85098000D01*
X169013333Y-85145619D01*
X168965714Y-85240857D01*
X168918095Y-85431333D01*
X168918095Y-85669428D01*
X168965714Y-85859904D01*
X169013333Y-85955142D01*
X169060952Y-86002761D01*
X169156190Y-86050380D01*
X169251428Y-86050380D01*
X169346666Y-86002761D01*
X169394285Y-85955142D01*
X169441904Y-85859904D01*
X169489523Y-85669428D01*
X169489523Y-85431333D01*
X169441904Y-85240857D01*
X169394285Y-85145619D01*
X169346666Y-85098000D01*
X169251428Y-85050380D01*
X183332380Y-82288142D02*
X182856190Y-81954809D01*
X183332380Y-81716714D02*
X182332380Y-81716714D01*
X182332380Y-82097666D01*
X182380000Y-82192904D01*
X182427619Y-82240523D01*
X182522857Y-82288142D01*
X182665714Y-82288142D01*
X182760952Y-82240523D01*
X182808571Y-82192904D01*
X182856190Y-82097666D01*
X182856190Y-81716714D01*
X182332380Y-82621476D02*
X182332380Y-83240523D01*
X182713333Y-82907190D01*
X182713333Y-83050047D01*
X182760952Y-83145285D01*
X182808571Y-83192904D01*
X182903809Y-83240523D01*
X183141904Y-83240523D01*
X183237142Y-83192904D01*
X183284761Y-83145285D01*
X183332380Y-83050047D01*
X183332380Y-82764333D01*
X183284761Y-82669095D01*
X183237142Y-82621476D01*
X183332380Y-84192904D02*
X183332380Y-83621476D01*
X183332380Y-83907190D02*
X182332380Y-83907190D01*
X182475238Y-83811952D01*
X182570476Y-83716714D01*
X182618095Y-83621476D01*
X181236857Y-85923380D02*
X181570190Y-85447190D01*
X181808285Y-85923380D02*
X181808285Y-84923380D01*
X181427333Y-84923380D01*
X181332095Y-84971000D01*
X181284476Y-85018619D01*
X181236857Y-85113857D01*
X181236857Y-85256714D01*
X181284476Y-85351952D01*
X181332095Y-85399571D01*
X181427333Y-85447190D01*
X181808285Y-85447190D01*
X180903523Y-84923380D02*
X180284476Y-84923380D01*
X180617809Y-85304333D01*
X180474952Y-85304333D01*
X180379714Y-85351952D01*
X180332095Y-85399571D01*
X180284476Y-85494809D01*
X180284476Y-85732904D01*
X180332095Y-85828142D01*
X180379714Y-85875761D01*
X180474952Y-85923380D01*
X180760666Y-85923380D01*
X180855904Y-85875761D01*
X180903523Y-85828142D01*
X179903523Y-85018619D02*
X179855904Y-84971000D01*
X179760666Y-84923380D01*
X179522571Y-84923380D01*
X179427333Y-84971000D01*
X179379714Y-85018619D01*
X179332095Y-85113857D01*
X179332095Y-85209095D01*
X179379714Y-85351952D01*
X179951142Y-85923380D01*
X179332095Y-85923380D01*
X204969904Y-53170380D02*
X204398476Y-53170380D01*
X204684190Y-54170380D02*
X204684190Y-53170380D01*
X204065142Y-54170380D02*
X204065142Y-53170380D01*
X203684190Y-53170380D01*
X203588952Y-53218000D01*
X203541333Y-53265619D01*
X203493714Y-53360857D01*
X203493714Y-53503714D01*
X203541333Y-53598952D01*
X203588952Y-53646571D01*
X203684190Y-53694190D01*
X204065142Y-53694190D01*
X202541333Y-54170380D02*
X203112761Y-54170380D01*
X202827047Y-54170380D02*
X202827047Y-53170380D01*
X202922285Y-53313238D01*
X203017523Y-53408476D01*
X203112761Y-53456095D01*
X198873904Y-42886380D02*
X198302476Y-42886380D01*
X198588190Y-43886380D02*
X198588190Y-42886380D01*
X197969142Y-43886380D02*
X197969142Y-42886380D01*
X197588190Y-42886380D01*
X197492952Y-42934000D01*
X197445333Y-42981619D01*
X197397714Y-43076857D01*
X197397714Y-43219714D01*
X197445333Y-43314952D01*
X197492952Y-43362571D01*
X197588190Y-43410190D01*
X197969142Y-43410190D01*
X197016761Y-42981619D02*
X196969142Y-42934000D01*
X196873904Y-42886380D01*
X196635809Y-42886380D01*
X196540571Y-42934000D01*
X196492952Y-42981619D01*
X196445333Y-43076857D01*
X196445333Y-43172095D01*
X196492952Y-43314952D01*
X197064380Y-43886380D01*
X196445333Y-43886380D01*
X162935904Y-69048380D02*
X162935904Y-69857904D01*
X162888285Y-69953142D01*
X162840666Y-70000761D01*
X162745428Y-70048380D01*
X162554952Y-70048380D01*
X162459714Y-70000761D01*
X162412095Y-69953142D01*
X162364476Y-69857904D01*
X162364476Y-69048380D01*
X161364476Y-70048380D02*
X161935904Y-70048380D01*
X161650190Y-70048380D02*
X161650190Y-69048380D01*
X161745428Y-69191238D01*
X161840666Y-69286476D01*
X161935904Y-69334095D01*
X181369904Y-56602380D02*
X181369904Y-57411904D01*
X181322285Y-57507142D01*
X181274666Y-57554761D01*
X181179428Y-57602380D01*
X180988952Y-57602380D01*
X180893714Y-57554761D01*
X180846095Y-57507142D01*
X180798476Y-57411904D01*
X180798476Y-56602380D01*
X180369904Y-56697619D02*
X180322285Y-56650000D01*
X180227047Y-56602380D01*
X179988952Y-56602380D01*
X179893714Y-56650000D01*
X179846095Y-56697619D01*
X179798476Y-56792857D01*
X179798476Y-56888095D01*
X179846095Y-57030952D01*
X180417523Y-57602380D01*
X179798476Y-57602380D01*
X203080857Y-38457142D02*
X203128476Y-38504761D01*
X203271333Y-38552380D01*
X203366571Y-38552380D01*
X203509428Y-38504761D01*
X203604666Y-38409523D01*
X203652285Y-38314285D01*
X203699904Y-38123809D01*
X203699904Y-37980952D01*
X203652285Y-37790476D01*
X203604666Y-37695238D01*
X203509428Y-37600000D01*
X203366571Y-37552380D01*
X203271333Y-37552380D01*
X203128476Y-37600000D01*
X203080857Y-37647619D01*
X202128476Y-38552380D02*
X202699904Y-38552380D01*
X202414190Y-38552380D02*
X202414190Y-37552380D01*
X202509428Y-37695238D01*
X202604666Y-37790476D01*
X202699904Y-37838095D01*
X201176095Y-38552380D02*
X201747523Y-38552380D01*
X201461809Y-38552380D02*
X201461809Y-37552380D01*
X201557047Y-37695238D01*
X201652285Y-37790476D01*
X201747523Y-37838095D01*
X200286857Y-48871142D02*
X200334476Y-48918761D01*
X200477333Y-48966380D01*
X200572571Y-48966380D01*
X200715428Y-48918761D01*
X200810666Y-48823523D01*
X200858285Y-48728285D01*
X200905904Y-48537809D01*
X200905904Y-48394952D01*
X200858285Y-48204476D01*
X200810666Y-48109238D01*
X200715428Y-48014000D01*
X200572571Y-47966380D01*
X200477333Y-47966380D01*
X200334476Y-48014000D01*
X200286857Y-48061619D01*
X199334476Y-48966380D02*
X199905904Y-48966380D01*
X199620190Y-48966380D02*
X199620190Y-47966380D01*
X199715428Y-48109238D01*
X199810666Y-48204476D01*
X199905904Y-48252095D01*
X198953523Y-48061619D02*
X198905904Y-48014000D01*
X198810666Y-47966380D01*
X198572571Y-47966380D01*
X198477333Y-48014000D01*
X198429714Y-48061619D01*
X198382095Y-48156857D01*
X198382095Y-48252095D01*
X198429714Y-48394952D01*
X199001142Y-48966380D01*
X198382095Y-48966380D01*
X174458380Y-78692476D02*
X175172666Y-78692476D01*
X175315523Y-78644857D01*
X175410761Y-78549619D01*
X175458380Y-78406761D01*
X175458380Y-78311523D01*
X175458380Y-79692476D02*
X175458380Y-79121047D01*
X175458380Y-79406761D02*
X174458380Y-79406761D01*
X174601238Y-79311523D01*
X174696476Y-79216285D01*
X174744095Y-79121047D01*
X174553619Y-80073428D02*
X174506000Y-80121047D01*
X174458380Y-80216285D01*
X174458380Y-80454380D01*
X174506000Y-80549619D01*
X174553619Y-80597238D01*
X174648857Y-80644857D01*
X174744095Y-80644857D01*
X174886952Y-80597238D01*
X175458380Y-80025809D01*
X175458380Y-80644857D01*
X169394095Y-59888380D02*
X169394095Y-58888380D01*
X169156000Y-58888380D01*
X169013142Y-58936000D01*
X168917904Y-59031238D01*
X168870285Y-59126476D01*
X168822666Y-59316952D01*
X168822666Y-59459809D01*
X168870285Y-59650285D01*
X168917904Y-59745523D01*
X169013142Y-59840761D01*
X169156000Y-59888380D01*
X169394095Y-59888380D01*
X167917904Y-58888380D02*
X168394095Y-58888380D01*
X168441714Y-59364571D01*
X168394095Y-59316952D01*
X168298857Y-59269333D01*
X168060761Y-59269333D01*
X167965523Y-59316952D01*
X167917904Y-59364571D01*
X167870285Y-59459809D01*
X167870285Y-59697904D01*
X167917904Y-59793142D01*
X167965523Y-59840761D01*
X168060761Y-59888380D01*
X168298857Y-59888380D01*
X168394095Y-59840761D01*
X168441714Y-59793142D01*
X168409904Y-73096380D02*
X168409904Y-72096380D01*
X167838476Y-73096380D02*
X168267047Y-72524952D01*
X167838476Y-72096380D02*
X168409904Y-72667809D01*
M02*
