EESchema Schematic File Version 2
LIBS:power
LIBS:device
LIBS:switches
LIBS:relays
LIBS:motors
LIBS:transistors
LIBS:conn
LIBS:linear
LIBS:regul
LIBS:74xx
LIBS:cmos4000
LIBS:adc-dac
LIBS:memory
LIBS:xilinx
LIBS:microcontrollers
LIBS:dsp
LIBS:microchip
LIBS:analog_switches
LIBS:motorola
LIBS:texas
LIBS:intel
LIBS:audio
LIBS:interface
LIBS:digital-audio
LIBS:philips
LIBS:display
LIBS:cypress
LIBS:siliconi
LIBS:opto
LIBS:atmel
LIBS:contrib
LIBS:valves
LIBS:SimBell-cache
EELAYER 25 0
EELAYER END
$Descr A4 11693 8268
encoding utf-8
Sheet 1 1
Title ""
Date ""
Rev ""
Comp ""
Comment1 ""
Comment2 ""
Comment3 ""
Comment4 ""
$EndDescr
$Comp
L ATTINY13A-PU U1
U 1 1 5A8739F6
P 7000 4300
F 0 "U1" H 6200 4700 50  0000 C CNN
F 1 "ATTINY13A-PU" H 7650 3900 50  0000 C CNN
F 2 "Housings_DIP:DIP-8_W7.62mm_LongPads" H 7650 4300 50  0001 C CIN
F 3 "" H 6200 4650 50  0001 C CNN
	1    7000 4300
	1    0    0    -1  
$EndComp
$Comp
L GND #PWR01
U 1 1 5A873CFE
P 8050 4600
F 0 "#PWR01" H 8050 4350 50  0001 C CNN
F 1 "GND" H 8050 4450 50  0000 C CNN
F 2 "" H 8050 4600 50  0001 C CNN
F 3 "" H 8050 4600 50  0001 C CNN
	1    8050 4600
	1    0    0    -1  
$EndComp
Wire Wire Line
	8000 4550 8400 4550
Wire Wire Line
	8050 4450 8050 4600
$Comp
L +5V #PWR02
U 1 1 5A873D1D
P 8050 4000
F 0 "#PWR02" H 8050 3850 50  0001 C CNN
F 1 "+5V" H 8050 4140 50  0000 C CNN
F 2 "" H 8050 4000 50  0001 C CNN
F 3 "" H 8050 4000 50  0001 C CNN
	1    8050 4000
	1    0    0    -1  
$EndComp
Wire Wire Line
	8050 4000 8050 4150
Wire Wire Line
	8000 4050 8400 4050
$Comp
L C C1
U 1 1 5A873D41
P 8050 4300
F 0 "C1" H 8075 4400 50  0000 L CNN
F 1 "100n" H 8075 4200 50  0000 L CNN
F 2 "Capacitors_SMD:C_0603_HandSoldering" H 8088 4150 50  0001 C CNN
F 3 "" H 8050 4300 50  0001 C CNN
	1    8050 4300
	1    0    0    -1  
$EndComp
Connection ~ 8050 4050
Connection ~ 8050 4550
$Comp
L R R1
U 1 1 5A873E1E
P 4350 4250
F 0 "R1" V 4300 4100 50  0000 C CNN
F 1 "330R" V 4350 4250 50  0000 C CNN
F 2 "Resistors_SMD:R_0603_HandSoldering" V 4280 4250 50  0001 C CNN
F 3 "" H 4350 4250 50  0001 C CNN
	1    4350 4250
	0    1    1    0   
$EndComp
$Comp
L R R2
U 1 1 5A873F7F
P 4350 4350
F 0 "R2" V 4400 4200 50  0000 C CNN
F 1 "330R" V 4350 4350 50  0000 C CNN
F 2 "Resistors_SMD:R_0603_HandSoldering" V 4280 4350 50  0001 C CNN
F 3 "" H 4350 4350 50  0001 C CNN
	1    4350 4350
	0    1    1    0   
$EndComp
Wire Wire Line
	5200 4250 6000 4250
$Comp
L LED D1
U 1 1 5A8740B0
P 4100 4050
F 0 "D1" H 4100 4150 50  0000 C CNN
F 1 "LED" H 4100 3950 50  0000 C CNN
F 2 "LED_THT:LED_Rectangular_W7.62mm_H4.55mm_P5.08mm_R3" H 4100 4050 50  0001 C CNN
F 3 "" H 4100 4050 50  0001 C CNN
	1    4100 4050
	0    1    1    0   
$EndComp
Wire Wire Line
	4100 4200 4100 4250
Wire Wire Line
	3800 4250 4200 4250
Wire Wire Line
	4300 4150 4800 4150
Wire Wire Line
	4300 3850 4300 4150
Wire Wire Line
	4100 3900 4100 3850
Wire Wire Line
	3800 3850 4300 3850
Wire Wire Line
	5200 4350 6000 4350
$Comp
L LED D2
U 1 1 5A87432F
P 4100 4550
F 0 "D2" H 4100 4650 50  0000 C CNN
F 1 "LED" H 4100 4450 50  0000 C CNN
F 2 "LED_THT:LED_Rectangular_W7.62mm_H4.55mm_P5.08mm_R3" H 4100 4550 50  0001 C CNN
F 3 "" H 4100 4550 50  0001 C CNN
	1    4100 4550
	0    -1   -1   0   
$EndComp
Wire Wire Line
	4100 4400 4100 4350
Wire Wire Line
	3800 4350 4200 4350
Wire Wire Line
	4300 4450 4800 4450
Wire Wire Line
	4300 4750 4300 4450
Wire Wire Line
	3800 4750 4300 4750
Wire Wire Line
	4100 4750 4100 4700
$Comp
L R R3
U 1 1 5A8744C5
P 6150 4900
F 0 "R3" V 6230 4900 50  0000 C CNN
F 1 "10k" V 6150 4900 50  0000 C CNN
F 2 "Resistors_SMD:R_0603_HandSoldering" V 6080 4900 50  0001 C CNN
F 3 "" H 6150 4900 50  0001 C CNN
	1    6150 4900
	0    1    1    0   
$EndComp
$Comp
L +5V #PWR03
U 1 1 5A874532
P 6350 4850
F 0 "#PWR03" H 6350 4700 50  0001 C CNN
F 1 "+5V" H 6350 4990 50  0000 C CNN
F 2 "" H 6350 4850 50  0001 C CNN
F 3 "" H 6350 4850 50  0001 C CNN
	1    6350 4850
	1    0    0    -1  
$EndComp
Wire Wire Line
	6350 4900 6350 4850
Wire Wire Line
	6000 4550 5950 4550
Wire Wire Line
	5950 4550 5950 4950
Wire Wire Line
	5950 4900 6000 4900
Wire Wire Line
	6300 4900 6350 4900
$Comp
L R R5
U 1 1 5A874684
P 5850 4650
F 0 "R5" V 5930 4650 50  0000 C CNN
F 1 "100k" V 5850 4650 50  0000 C CNN
F 2 "Resistors_SMD:R_0603_HandSoldering" V 5780 4650 50  0001 C CNN
F 3 "" H 5850 4650 50  0001 C CNN
	1    5850 4650
	-1   0    0    1   
$EndComp
$Comp
L R R4
U 1 1 5A8746DF
P 5850 3950
F 0 "R4" V 5930 3950 50  0000 C CNN
F 1 "100k" V 5850 3950 50  0000 C CNN
F 2 "Resistors_SMD:R_0603_HandSoldering" V 5780 3950 50  0001 C CNN
F 3 "" H 5850 3950 50  0001 C CNN
	1    5850 3950
	-1   0    0    1   
$EndComp
Wire Wire Line
	5850 4100 5850 4250
Connection ~ 5850 4250
Wire Wire Line
	5850 4350 5850 4500
Connection ~ 5850 4350
$Comp
L GND #PWR04
U 1 1 5A8747DB
P 5850 4800
F 0 "#PWR04" H 5850 4550 50  0001 C CNN
F 1 "GND" H 5850 4650 50  0000 C CNN
F 2 "" H 5850 4800 50  0001 C CNN
F 3 "" H 5850 4800 50  0001 C CNN
	1    5850 4800
	1    0    0    -1  
$EndComp
$Comp
L GND #PWR05
U 1 1 5A874801
P 5850 3800
F 0 "#PWR05" H 5850 3550 50  0001 C CNN
F 1 "GND" H 5850 3650 50  0000 C CNN
F 2 "" H 5850 3800 50  0001 C CNN
F 3 "" H 5850 3800 50  0001 C CNN
	1    5850 3800
	-1   0    0    1   
$EndComp
$Comp
L R R7
U 1 1 5A874912
P 6200 3700
F 0 "R7" V 6280 3700 50  0000 C CNN
F 1 "2k2" V 6200 3700 50  0000 C CNN
F 2 "Resistors_SMD:R_0603_HandSoldering" V 6130 3700 50  0001 C CNN
F 3 "" H 6200 3700 50  0001 C CNN
	1    6200 3700
	0    -1   -1   0   
$EndComp
$Comp
L LED D3
U 1 1 5A87496E
P 6550 3700
F 0 "D3" H 6550 3800 50  0000 C CNN
F 1 "LED" H 6550 3600 50  0000 C CNN
F 2 "LED_THT:LED_Rectangular_W7.62mm_H4.55mm_P5.08mm_R3" H 6550 3700 50  0001 C CNN
F 3 "" H 6550 3700 50  0001 C CNN
	1    6550 3700
	-1   0    0    1   
$EndComp
$Comp
L GND #PWR06
U 1 1 5A8749F3
P 6750 3750
F 0 "#PWR06" H 6750 3500 50  0001 C CNN
F 1 "GND" H 6750 3600 50  0000 C CNN
F 2 "" H 6750 3750 50  0001 C CNN
F 3 "" H 6750 3750 50  0001 C CNN
	1    6750 3750
	1    0    0    -1  
$EndComp
Wire Wire Line
	6000 3700 6000 4050
Wire Wire Line
	6350 3700 6400 3700
Wire Wire Line
	6700 3700 6750 3700
Wire Wire Line
	6750 3700 6750 3750
$Comp
L SW_Push SW1
U 1 1 5A874BC8
P 3800 4050
F 0 "SW1" H 3850 4150 50  0000 L CNN
F 1 "SW_Push" H 3800 3990 50  0000 C CNN
F 2 "Buttons_Switches_THT:SW_PUSH_6mm_h4.3mm" H 3800 4250 50  0001 C CNN
F 3 "" H 3800 4250 50  0001 C CNN
	1    3800 4050
	0    -1   -1   0   
$EndComp
$Comp
L SW_Push SW2
U 1 1 5A874C81
P 3800 4550
F 0 "SW2" H 3850 4650 50  0000 L CNN
F 1 "SW_Push" H 3800 4490 50  0000 C CNN
F 2 "Buttons_Switches_THT:SW_PUSH_6mm_h4.3mm" H 3800 4750 50  0001 C CNN
F 3 "" H 3800 4750 50  0001 C CNN
	1    3800 4550
	0    -1   -1   0   
$EndComp
Connection ~ 4100 3850
Connection ~ 4100 4250
Connection ~ 4100 4350
Connection ~ 4100 4750
$Comp
L Conn_01x02_Male J1
U 1 1 5A874FC2
P 5000 4250
F 0 "J1" H 5200 4200 50  0000 C CNN
F 1 "Conn_01x02_Male" H 5350 4050 50  0000 C CNN
F 2 "Pin_Headers:Pin_Header_Straight_1x02_Pitch2.54mm" H 5000 4250 50  0001 C CNN
F 3 "" H 5000 4250 50  0001 C CNN
	1    5000 4250
	-1   0    0    1   
$EndComp
$Comp
L Conn_01x02_Male J2
U 1 1 5A87535F
P 5000 4450
F 0 "J2" H 5200 4400 50  0000 C CNN
F 1 "Conn_01x02_Male" H 5350 4500 50  0000 C CNN
F 2 "Pin_Headers:Pin_Header_Straight_1x02_Pitch2.54mm" H 5000 4450 50  0001 C CNN
F 3 "" H 5000 4450 50  0001 C CNN
	1    5000 4450
	-1   0    0    1   
$EndComp
Wire Wire Line
	4500 4250 4800 4250
Wire Wire Line
	4500 4350 4800 4350
$Comp
L Conn_01x02_Female J3
U 1 1 5A875597
P 5000 4250
F 0 "J3" H 4800 4200 50  0000 C CNN
F 1 "Conn_01x02_Female" H 4600 4050 50  0000 C CNN
F 2 "Socket_Strips:Socket_Strip_Straight_1x02_Pitch2.54mm" H 5000 4250 50  0001 C CNN
F 3 "" H 5000 4250 50  0001 C CNN
	1    5000 4250
	-1   0    0    1   
$EndComp
$Comp
L Conn_01x02_Female J4
U 1 1 5A87566E
P 5000 4450
F 0 "J4" H 4800 4400 50  0000 C CNN
F 1 "Conn_01x02_Female" H 4600 4500 50  0000 C CNN
F 2 "Socket_Strips:Socket_Strip_Straight_1x02_Pitch2.54mm" H 5000 4450 50  0001 C CNN
F 3 "" H 5000 4450 50  0001 C CNN
	1    5000 4450
	-1   0    0    1   
$EndComp
Wire Wire Line
	5200 4150 6000 4150
Wire Wire Line
	5200 4450 6000 4450
$Comp
L USB_OTG J5
U 1 1 5A8759BC
P 5200 2950
F 0 "J5" H 5000 3400 50  0000 L CNN
F 1 "USB_OTG" H 5000 3300 50  0000 L CNN
F 2 "Connector_USB:USB_Micro-B_Molex_47346-0001" H 5350 2900 50  0001 C CNN
F 3 "" H 5350 2900 50  0001 C CNN
	1    5200 2950
	1    0    0    -1  
$EndComp
$Comp
L GND #PWR07
U 1 1 5A875AD1
P 5200 3450
F 0 "#PWR07" H 5200 3200 50  0001 C CNN
F 1 "GND" H 5200 3300 50  0000 C CNN
F 2 "" H 5200 3450 50  0001 C CNN
F 3 "" H 5200 3450 50  0001 C CNN
	1    5200 3450
	1    0    0    -1  
$EndComp
Wire Wire Line
	5200 3350 5200 3450
$Comp
L R R6
U 1 1 5A875B4F
P 4900 3400
F 0 "R6" V 4980 3400 50  0000 C CNN
F 1 "1M" V 4900 3400 50  0000 C CNN
F 2 "Resistors_SMD:R_0603_HandSoldering" V 4830 3400 50  0001 C CNN
F 3 "" H 4900 3400 50  0001 C CNN
	1    4900 3400
	0    -1   -1   0   
$EndComp
$Comp
L C C2
U 1 1 5A875C28
P 4900 3600
F 0 "C2" H 4925 3700 50  0000 L CNN
F 1 "10n" H 4925 3500 50  0000 L CNN
F 2 "Capacitors_SMD:C_0603_HandSoldering" H 4938 3450 50  0001 C CNN
F 3 "" H 4900 3600 50  0001 C CNN
	1    4900 3600
	0    1    1    0   
$EndComp
Wire Wire Line
	5100 3350 5100 3600
Wire Wire Line
	5100 3600 5050 3600
Wire Wire Line
	5050 3400 5100 3400
Connection ~ 5100 3400
$Comp
L GND #PWR08
U 1 1 5A875DDE
P 4700 3650
F 0 "#PWR08" H 4700 3400 50  0001 C CNN
F 1 "GND" H 4700 3500 50  0000 C CNN
F 2 "" H 4700 3650 50  0001 C CNN
F 3 "" H 4700 3650 50  0001 C CNN
	1    4700 3650
	1    0    0    -1  
$EndComp
Wire Wire Line
	4750 3400 4700 3400
Wire Wire Line
	4700 3400 4700 3650
Wire Wire Line
	4750 3600 4700 3600
Connection ~ 4700 3600
Wire Wire Line
	6000 3700 6050 3700
$Comp
L +5V #PWR09
U 1 1 5A876028
P 5550 2700
F 0 "#PWR09" H 5550 2550 50  0001 C CNN
F 1 "+5V" H 5550 2840 50  0000 C CNN
F 2 "" H 5550 2700 50  0001 C CNN
F 3 "" H 5550 2700 50  0001 C CNN
	1    5550 2700
	1    0    0    -1  
$EndComp
Wire Wire Line
	5550 2700 5550 2750
Wire Wire Line
	5550 2750 5500 2750
$Comp
L CP C3
U 1 1 5A8760A7
P 8400 4300
F 0 "C3" H 8425 4400 50  0000 L CNN
F 1 "4.7u" H 8425 4200 50  0000 L CNN
F 2 "Capacitors_Tantalum_SMD:CP_Tantalum_Case-A_EIA-3216-18_Hand" H 8438 4150 50  0001 C CNN
F 3 "" H 8400 4300 50  0001 C CNN
	1    8400 4300
	1    0    0    -1  
$EndComp
Wire Wire Line
	8400 4050 8400 4150
Wire Wire Line
	8400 4550 8400 4450
$Comp
L +5V #PWR010
U 1 1 5A8C7D09
P 5950 2700
F 0 "#PWR010" H 5950 2550 50  0001 C CNN
F 1 "+5V" H 5950 2840 50  0000 C CNN
F 2 "" H 5950 2700 50  0001 C CNN
F 3 "" H 5950 2700 50  0001 C CNN
	1    5950 2700
	1    0    0    -1  
$EndComp
$Comp
L PWR_FLAG #FLG011
U 1 1 5A8C7D6C
P 5950 2700
F 0 "#FLG011" H 5950 2775 50  0001 C CNN
F 1 "PWR_FLAG" H 5950 2850 50  0000 C CNN
F 2 "" H 5950 2700 50  0001 C CNN
F 3 "" H 5950 2700 50  0001 C CNN
	1    5950 2700
	-1   0    0    1   
$EndComp
$Comp
L PWR_FLAG #FLG012
U 1 1 5A8C7DD4
P 6350 2700
F 0 "#FLG012" H 6350 2775 50  0001 C CNN
F 1 "PWR_FLAG" H 6350 2850 50  0000 C CNN
F 2 "" H 6350 2700 50  0001 C CNN
F 3 "" H 6350 2700 50  0001 C CNN
	1    6350 2700
	1    0    0    -1  
$EndComp
$Comp
L GND #PWR013
U 1 1 5A8C7E4F
P 6350 2700
F 0 "#PWR013" H 6350 2450 50  0001 C CNN
F 1 "GND" H 6350 2550 50  0000 C CNN
F 2 "" H 6350 2700 50  0001 C CNN
F 3 "" H 6350 2700 50  0001 C CNN
	1    6350 2700
	1    0    0    -1  
$EndComp
$Comp
L C C4
U 1 1 5A8F2004
P 5950 5100
F 0 "C4" H 5975 5200 50  0000 L CNN
F 1 "10n" H 5975 5000 50  0000 L CNN
F 2 "Capacitors_SMD:C_0603_HandSoldering" H 5988 4950 50  0001 C CNN
F 3 "" H 5950 5100 50  0001 C CNN
	1    5950 5100
	-1   0    0    1   
$EndComp
Connection ~ 5950 4900
$Comp
L GND #PWR014
U 1 1 5A8F217F
P 5950 5300
F 0 "#PWR014" H 5950 5050 50  0001 C CNN
F 1 "GND" H 5950 5150 50  0000 C CNN
F 2 "" H 5950 5300 50  0001 C CNN
F 3 "" H 5950 5300 50  0001 C CNN
	1    5950 5300
	1    0    0    -1  
$EndComp
Wire Wire Line
	5950 5250 5950 5300
$EndSCHEMATC
