%YAML 1.1
%TAG !u! tag:unity3d.com,2011:
--- !u!1045 &1
EditorBuildSettings:
  m_ObjectHideFlags: 0
  serializedVersion: 2
  m_Scenes:
  - enabled: 1
    path: Assets/Scenes/GameScene.unity
    guid: 2cda990e2423bbf4892e6590ba056729
  - enabled: 1
    path: Assets/Scenes/GameOverScene.unity
    guid: 2a45e54cb0d6c3c4c9068f5c82439094
  - enabled: 1
    path: Assets/Scenes/PauseMenu.unity
    guid: 7dfb3a0031986c14da20efc9471a7354
  m_configObjects: {}
