module gitlab.com/gitlab-org/gitlab-runner

go 1.13

require (
	cloud.google.com/go/storage v1.9.0
	github.com/Azure/azure-storage-blob-go v0.10.0
	github.com/Azure/go-ansiterm v0.0.0-20170929234023-d6e3b3328b78 // indirect
	github.com/BurntSushi/toml v0.3.1
	github.com/Microsoft/go-winio v0.4.12 // indirect
	github.com/Nvveen/Gotty v0.0.0-20120604004816-cd527374f1e5 // indirect
	github.com/ayufan/golang-kardianos-service v0.0.0-20160429143213-0c8eb6d8fff2
	github.com/bmatcuk/doublestar v1.3.0
	github.com/containerd/continuity v0.0.0-20181203112020-004b46473808 // indirect
	github.com/docker/cli v0.0.0-20181219132003-336b2a5cac7f
	github.com/docker/distribution v2.7.0+incompatible
	github.com/docker/docker v1.4.2-0.20190822180741-9552f2b2fdde
	github.com/docker/docker-credential-helpers v0.4.1 // indirect
	github.com/docker/go-connections v0.3.0
	github.com/docker/go-metrics v0.0.0-20181218153428-b84716841b82 // indirect
	github.com/docker/go-units v0.3.2-0.20160802145505-eb879ae3e2b8
	github.com/docker/libtrust v0.0.0-20160708172513-aabc10ec26b7 // indirect
	github.com/docker/machine v0.7.1-0.20170120224952-7b7a141da844
	github.com/docker/spdystream v0.0.0-20160310174837-449fdfce4d96 // indirect
	github.com/elazarl/goproxy v0.0.0-20191011121108-aa519ddbe484 // indirect
	github.com/fullsailor/pkcs7 v0.0.0-20190404230743-d7302db945fa
	github.com/getsentry/raven-go v0.0.0-20160518204710-dffeb57df75d
	github.com/golang/mock v1.4.3
	github.com/googleapis/gnostic v0.1.0 // indirect
	github.com/gophercloud/gophercloud v0.0.0-20180425001159-e25975f29734 // indirect
	github.com/gorhill/cronexpr v0.0.0-20160318121724-f0984319b442
	github.com/gorilla/context v1.1.1 // indirect
	github.com/gorilla/mux v1.3.1-0.20170228224354-599cba5e7b61
	github.com/gorilla/websocket v1.4.0
	github.com/hashicorp/go-version v1.2.0
	github.com/hashicorp/vault/api v1.0.4
	github.com/imdario/mergo v0.3.7
	github.com/jpillora/backoff v0.0.0-20170222002228-06c7a16c845d
	github.com/kardianos/osext v0.0.0-20160811001526-c2c54e542fb7
	github.com/klauspost/pgzip v1.2.5
	github.com/konsorten/go-windows-terminal-sequences v1.0.2 // indirect
	github.com/kr/pty v1.1.1
	github.com/markelog/trie v0.0.0-20171230083431-098fa99650c0
	github.com/minio/minio-go/v6 v6.0.49
	github.com/mitchellh/gox v1.0.1
	github.com/onsi/ginkgo v1.10.3 // indirect
	github.com/onsi/gomega v1.7.1 // indirect
	github.com/opencontainers/go-digest v1.0.0-rc1 // indirect
	github.com/opencontainers/image-spec v1.0.1 // indirect
	github.com/opencontainers/runc v1.0.0-rc6.0.20190115182101-c1e454b2a1bf // indirect
	github.com/pkg/errors v0.9.1
	github.com/prometheus/client_golang v1.1.0
	github.com/prometheus/client_model v0.0.0-20190812154241-14fe0d1b01d4
	github.com/prometheus/common v0.6.0
	github.com/prometheus/procfs v0.0.5 // indirect
	github.com/sanity-io/litter v1.2.0 // indirect
	github.com/saracen/fastzip v0.1.3
	github.com/sirupsen/logrus v1.4.2
	github.com/smartystreets/goconvey v1.6.4 // indirect
	github.com/spf13/pflag v1.0.1-0.20171106142849-4c012f6dcd95 // indirect
	github.com/stretchr/objx v0.3.0 // indirect
	github.com/stretchr/testify v1.6.1
	github.com/tevino/abool v0.0.0-20160628101133-3c25f2fe7cd0
	github.com/urfave/cli v1.20.0
	gitlab.com/ayufan/golang-cli-helpers v0.0.0-20171103152739-a7cf72d604cd
	gitlab.com/gitlab-org/gitlab-terminal v0.0.0-20180924111848-5af59b871b1b
	gocloud.dev v0.20.0
	golang.org/x/crypto v0.0.0-20200221231518-2aa609cf4a9d
	golang.org/x/net v0.0.0-20200602114024-627f9648deb9
	golang.org/x/sync v0.0.0-20201020160332-67f06af15bc9
	golang.org/x/sys v0.0.0-20201101102859-da207088b7d1
	gopkg.in/inf.v0 v0.9.0 // indirect
	gopkg.in/ini.v1 v1.52.0 // indirect
	gopkg.in/yaml.v2 v2.2.8
	gopkg.in/yaml.v3 v3.0.0-20200615113413-eeeca48fe776 // indirect
	gotest.tools v2.2.0+incompatible // indirect
	k8s.io/api v0.0.0-20191004102349-159aefb8556b
	k8s.io/apimachinery v0.0.0-20191004074956-c5d2f014d689
	k8s.io/client-go v11.0.1-0.20191004102930-01520b8320fc+incompatible
	k8s.io/klog v1.0.0 // indirect
	k8s.io/utils v0.0.0-20190923111123-69764acb6e8e // indirect
	sigs.k8s.io/yaml v1.1.0 // indirect
)

replace golang.org/x/sys => golang.org/x/sys v0.0.0-20200826173525-f9321e4c35a6

replace github.com/docker/docker v1.4.2-0.20190822180741-9552f2b2fdde => github.com/docker/engine v1.4.2-0.20190822180741-9552f2b2fdde

replace github.com/minio/go-homedir v0.0.0-20190425115525-017018655514 => gitlab.com/steveazz/go-homedir v0.0.0-20190425115525-017018655514
