130 06/05/2019 09:31:21
170 06/05/2019 09:34:40
160 06/05/2019 09:34:44
140 06/05/2019 09:34:49
135 06/05/2019 09:34:52
175€ 06/05/2019 09:35:32
170€ 06/05/2019 09:35:35
160€ 06/05/2019 09:35:37
140€ 06/05/2019 09:35:39
