<svg width="20" height="17" viewBox="0 0 20 17" fill="none" xmlns="http://www.w3.org/2000/svg">
<g clip-path="url(#clip0)">
<path d="M1.73171 6.39645C2.77058 5.94492 4.52323 5.77184 5.42783 4.64302C5.71758 4.28179 6.16281 4.10871 6.60097 4.14634C8.04267 4.28179 8.79885 4.20654 9.68931 2.78423C9.84479 2.53589 10.0709 2.34023 10.3324 2.23487C15.6964 0.0148591 14.9473 -2.10732 16.919 4.02593C16.9755 4.19901 17.0603 4.36457 17.1734 4.50756C18.5656 6.20079 19.3218 4.65054 18.9685 7.90907C18.9402 8.17246 19.0603 8.42832 19.1946 8.64656C21.9225 13.0189 16.8342 12.6576 17.0462 14.1778C17.1451 14.8776 16.7423 15.5549 16.1063 15.7656C15.4349 15.9839 14.7211 16.1043 13.9508 15.9162C13.3784 15.7807 12.7776 16.0441 12.4879 16.5859C12.4172 16.7214 12.2971 16.8418 12.0851 16.9246C11.8165 17.0299 11.5268 17.0224 11.2582 16.9396C8.84125 16.1795 6.87659 16.9246 4.29708 16.9772C3.66104 16.9923 3.0886 16.5408 2.94726 15.8785C2.51617 13.8241 5.12394 11.574 3.27235 10.1366C3.22288 10.099 3.18048 10.0613 3.13807 10.0162C1.75292 8.68419 -2.04214 9.45178 1.42076 6.58458C1.51263 6.50933 1.61864 6.4416 1.73171 6.39645Z" fill="#878787"/>
<path d="M9.04229 12.4214L9.0422 12.4213L9.03709 12.4302C8.99304 12.5064 8.93485 12.5325 8.90927 12.5367C8.86431 12.5394 8.74172 12.52 8.53684 12.2378C8.33497 11.9597 8.14036 11.5396 7.94999 11.0288C7.77988 10.5725 7.6249 10.0772 7.47376 9.59411C7.45773 9.54287 7.44174 9.49177 7.42578 9.44087C7.26332 8.92267 7.0998 8.41094 6.93046 8.02979L6.93046 8.02979L6.92964 8.02796C6.88365 7.92556 6.89448 7.81315 6.94614 7.72453C6.99712 7.63707 7.07087 7.59744 7.14475 7.59642L7.14476 7.59658L7.15754 7.59608C7.2918 7.59078 7.4509 7.61216 7.63651 7.64257C8.12852 7.72317 8.56682 7.48698 8.82847 7.1271L8.82848 7.1271L8.82979 7.12528C8.93866 6.97412 9.18396 6.78033 9.56405 6.60239C9.93271 6.42981 10.3824 6.29378 10.8454 6.22853C11.8115 6.09237 12.6397 6.28154 13.0364 6.80421L13.0469 6.81814L13.0585 6.8313C13.3862 7.20563 13.6871 7.4992 13.9285 7.73475C13.9848 7.78967 14.0379 7.84143 14.0873 7.89033C14.3662 8.16635 14.4946 8.32092 14.5528 8.45859C14.5947 8.55785 14.6179 8.69102 14.524 8.97033C14.4235 9.26943 14.2061 9.68268 13.8121 10.3038C13.7488 10.4018 13.6884 10.4661 13.6379 10.5025C13.5935 10.5345 13.5643 10.5404 13.54 10.54C12.8848 10.5194 11.9839 10.6558 11.1537 10.9448C10.3395 11.2282 9.4806 11.6975 9.04229 12.4214Z" fill="#878787" stroke="white"/>
</g>
<defs>
<clipPath id="clip0">
<rect width="20" height="17" fill="white"/>
</clipPath>
</defs>
</svg>
