<?xml version="1.0" encoding="UTF-8" standalone="no"?>
<svg
   xmlns:sketch="http://www.bohemiancoding.com/sketch/ns"
   xmlns:dc="http://purl.org/dc/elements/1.1/"
   xmlns:cc="http://creativecommons.org/ns#"
   xmlns:rdf="http://www.w3.org/1999/02/22-rdf-syntax-ns#"
   xmlns:svg="http://www.w3.org/2000/svg"
   xmlns="http://www.w3.org/2000/svg"
   xmlns:sodipodi="http://sodipodi.sourceforge.net/DTD/sodipodi-0.dtd"
   xmlns:inkscape="http://www.inkscape.org/namespaces/inkscape"
   inkscape:export-ydpi="58.514286"
   inkscape:export-xdpi="58.514286"
   inkscape:export-filename="/Users/fgraf/Entwicklung/gitlab-wizard/src/icons/icon_128.png"
   inkscape:version="1.0beta2 (2b71d25, 2019-12-03)"
   sodipodi:docname="GitLab-Wizard-Logo-Inkscape.svg"
   id="svg147"
   version="1.1"
   viewBox="0 0 210 210"
   height="210"
   width="210">
  <metadata
     id="metadata151">
    <rdf:RDF>
      <cc:Work
         rdf:about="">
        <dc:format>image/svg+xml</dc:format>
        <dc:type
           rdf:resource="http://purl.org/dc/dcmitype/StillImage" />
        <dc:title>Group</dc:title>
      </cc:Work>
    </rdf:RDF>
  </metadata>
  <sodipodi:namedview
     inkscape:current-layer="svg147"
     inkscape:window-maximized="0"
     inkscape:window-y="23"
     inkscape:window-x="0"
     inkscape:cy="47.236683"
     inkscape:cx="149.14392"
     inkscape:zoom="1.369482"
     showguides="true"
     showgrid="false"
     id="namedview149"
     inkscape:window-height="768"
     inkscape:window-width="1440"
     inkscape:pageshadow="2"
     inkscape:pageopacity="0"
     guidetolerance="10"
     gridtolerance="10"
     objecttolerance="10"
     borderopacity="1"
     inkscape:document-rotation="0"
     bordercolor="#666666"
     pagecolor="#ffffff" />
  <!-- Generator: Sketch 3.3.2 (12043) - http://www.bohemiancoding.com/sketch -->
  <title
     id="title127">Group</title>
  <desc
     id="desc129">Created with Sketch.</desc>
  <defs
     id="defs131" />
  <g
     transform="translate(-0.06145,16.3449)"
     sketch:type="MSPage"
     fill-rule="evenodd"
     fill="none"
     stroke-width="1"
     stroke="none"
     id="Page-1">
    <g
       sketch:type="MSLayerGroup"
       id="Fill-1-+-Group-24">
      <g
         sketch:type="MSShapeGroup"
         id="Group-24">
        <g
           id="Group">
          <path
             inkscape:connector-curvature="0"
             fill="#E24329"
             id="Fill-4"
             d="m 105.0614,193.655 v 0 l 38.64,-118.921 h -77.28 z" />
          <path
             inkscape:connector-curvature="0"
             fill="#FC6D26"
             id="Fill-6" />
          <path
             inkscape:connector-curvature="0"
             fill="#FC6D26"
             id="Fill-8"
             d="M 105.0614,193.6548 66.4214,74.7338 H 12.2684 Z" />
          <path
             inkscape:connector-curvature="0"
             fill="#FC6D26"
             id="Fill-10" />
          <path
             inkscape:connector-curvature="0"
             fill="#FCA326"
             id="Fill-12"
             d="m 12.2685,74.7341 v 0 l -11.742,36.139 c -1.071,3.296 0.102,6.907 2.906,8.944 l 101.629,73.838 z" />
          <path
             inkscape:connector-curvature="0"
             fill="#FC6D26"
             id="Fill-14" />
          <path
             inkscape:connector-curvature="0"
             fill="#E24329"
             id="Fill-16"
             d="m 12.2685,74.7342 h 54.153 L 43.1485,3.1092 c -1.197,-3.686 -6.411,-3.685 -7.608,0 z" />
          <path
             inkscape:connector-curvature="0"
             fill="#FC6D26"
             id="Fill-18"
             d="m 105.0614,193.6548 38.64,-118.921 h 54.153 z" />
          <path
             inkscape:connector-curvature="0"
             fill="#FCA326"
             id="Fill-20"
             d="m 197.8544,74.7341 v 0 l 11.742,36.139 c 1.071,3.296 -0.102,6.907 -2.906,8.944 l -101.629,73.838 z" />
          <path
             inkscape:connector-curvature="0"
             fill="#E24329"
             id="Fill-22"
             d="m 197.8544,74.7342 h -54.153 l 23.273,-71.625 c 1.197,-3.686 6.411,-3.685 7.608,0 z" />
        </g>
      </g>
    </g>
  </g>
  <g
     transform="matrix(0.27839443,0.0639075,-0.0639075,0.27839443,57.514237,-27.245539)"
     id="g237">
    <path
       inkscape:connector-curvature="0"
       d="M 402.235,430.976 H 109.765 L 248.653,56.115 c 2.527,-6.821 12.167,-6.821 14.694,0 z"
       fill="#ba68c8"
       id="path203" />
    <path
       inkscape:connector-curvature="0"
       d="m 263.347,56.115 c -2.527,-6.82 -12.167,-6.82 -14.694,0 L 241,76.771 372.235,430.976 h 30 z"
       fill="#ab47bc"
       id="path205" />
    <path
       inkscape:connector-curvature="0"
       d="m 474.946,405.919 -2.034,2.206 c -13.415,14.549 -32.492,22.852 -52.505,22.852 H 91.968 c -20.515,0 -40.021,-8.723 -53.46,-23.908 l -0.814,-0.919 c -2.92,-3.3 -7.159,-5.196 -11.618,-5.196 H 17.18 c -6.959,0 -11.64,6.985 -8.872,13.241 C 20.883,442.61 49.48,461 81.095,461 H 431.27 c 31.178,0 59.466,-17.891 72.3,-45.728 3.095,-6.714 -1.917,-14.32 -9.437,-14.32 h -7.777 c -4.349,10e-4 -8.495,1.805 -11.41,4.967 z"
       fill="#9c27b0"
       id="path207" />
    <path
       inkscape:connector-curvature="0"
       d="M 385,367.959 H 127 c -4.418,0 -8,-3.582 -8,-8 v -30 c 0,-4.418 3.582,-8 8,-8 h 258 c 4.418,0 8,3.582 8,8 v 30 c 0,4.418 -3.582,8 -8,8 z"
       fill="#cc814a"
       id="path209" />
    <path
       inkscape:connector-curvature="0"
       d="m 385,321.959 h -30 c 4.418,0 8,3.582 8,8 v 30 c 0,4.418 -3.582,8 -8,8 h 30 c 4.418,0 8,-3.582 8,-8 v -30 c 0,-4.419 -3.582,-8 -8,-8 z"
       fill="#b5672d"
       id="path211" />
    <path
       inkscape:connector-curvature="0"
       d="m 296.465,301.959 h -80.727 c -5.322,0 -9.637,4.314 -9.637,9.637 v 66.727 c 0,5.322 4.314,9.637 9.637,9.637 h 80.727 c 5.322,0 9.637,-4.314 9.637,-9.637 v -66.727 c 0,-5.323 -4.315,-9.637 -9.637,-9.637 z m -20.363,56 h -40 v -26 h 40 z"
       fill="#ffd740"
       id="path213" />
    <path
       inkscape:connector-curvature="0"
       d="m 296.465,301.959 h -30 c 5.322,0 9.637,4.314 9.637,9.637 v 20.363 26 20.363 c 0,5.322 -4.314,9.637 -9.637,9.637 h 30 c 5.322,0 9.637,-4.314 9.637,-9.637 v -66.727 c 0,-5.322 -4.315,-9.636 -9.637,-9.636 z"
       fill="#ffc400"
       id="path215" />
    <path
       inkscape:connector-curvature="0"
       d="m 494.127,393.453 h -7.777 c -6.429,0 -12.598,2.69 -16.923,7.382 -0.934,0.679 -17.364,22.642 -49.024,22.642 h -12.948 l -18.029,-48.66 c 6.396,-1.91 11.071,-7.847 11.071,-14.855 v -30 c 0,-8.547 -6.953,-15.5 -15.5,-15.5 h -17.93 L 301.049,136.283 c -1.439,-3.885 -5.752,-5.865 -9.638,-4.428 -3.884,1.439 -5.866,5.755 -4.427,9.639 l 64.087,172.968 H 313.6 v -2.864 c 0,-9.449 -7.687,-17.137 -17.136,-17.137 h -80.725 c -9.448,0 -17.136,7.688 -17.136,17.137 v 2.864 H 160.929 L 255.682,58.729 c 0.065,-0.175 0.084,-0.228 0.317,-0.228 0.233,0 0.252,0.053 0.317,0.228 l 19.551,52.769 c 1.439,3.884 5.751,5.867 9.638,4.428 3.884,-1.439 5.866,-5.755 4.427,-9.639 L 270.381,53.518 C 268.128,47.432 262.483,43.5 256,43.5 c -6.483,0 -12.128,3.932 -14.382,10.017 l -96.684,260.944 h -17.93 c -8.547,0 -15.5,6.953 -15.5,15.5 v 30 c 0,7.009 4.676,12.946 11.071,14.855 l -18.029,48.66 H 91.972 c -31.322,0 -48.236,-21.99 -48.656,-22.299 -4.345,-4.909 -10.626,-7.725 -17.233,-7.725 h -8.897 c -12.389,0 -20.685,12.576 -15.73,23.775 C 15.238,448.375 46.5,468.5 81.1,468.5 h 302.82 c 4.142,0 7.5,-3.357 7.5,-7.5 0,-4.143 -3.358,-7.5 -7.5,-7.5 H 81.1 c -28.667,0 -54.545,-16.62 -65.927,-42.342 -0.576,-1.302 0.482,-2.705 2.014,-2.705 h 8.897 c 2.314,0 4.502,0.972 5.999,2.664 0.603,0.443 20.977,27.359 59.89,27.359 13.261,0 290.373,0.004 310.264,0.004 0.08,0 0.159,-0.001 0.239,-0.004 h 17.927 c 22.065,0 43.211,-9.21 58.017,-25.268 l 2.034,-2.206 c 1.495,-1.62 3.643,-2.55 5.896,-2.55 h 7.777 c 2.028,0 3.439,1.917 2.626,3.68 -11.585,25.13 -37.291,41.367 -65.487,41.367 h -15.039 c -4.142,0 -7.5,3.357 -7.5,7.5 0,4.143 3.358,7.5 7.5,7.5 h 15.039 c 34.029,0 65.082,-19.66 79.109,-50.088 5.377,-11.664 -3.241,-24.958 -16.248,-24.958 z M 384.996,329.461 c 0.276,0 0.5,0.225 0.5,0.5 v 30 c 0,0.275 -0.224,0.5 -0.5,0.5 h -5.94 c -0.11,-0.002 -0.22,-0.002 -0.331,0 H 313.6 v -31 z M 213.603,311.597 c 0,-1.178 0.958,-2.137 2.136,-2.137 h 80.725 c 1.178,0 2.137,0.959 2.137,2.137 0,11.287 -10e-4,61.352 0,66.727 0,1.178 -0.958,2.136 -2.137,2.136 h -80.725 c -1.178,0 -2.136,-0.958 -2.136,-2.136 z m -75.271,63.864 h 21.439 c 4.142,0 7.5,-3.357 7.5,-7.5 0,-4.143 -3.358,-7.5 -7.5,-7.5 h -26.445 c -0.138,-0.004 -0.276,-0.004 -0.413,0 h -5.91 c -0.276,0 -0.5,-0.225 -0.5,-0.5 v -30 c 0,-0.275 0.224,-0.5 0.5,-0.5 6.167,10e-4 64.531,0 71.6,0 v 31 h -6.525 c -4.142,0 -7.5,3.357 -7.5,7.5 0,4.143 3.358,7.5 7.5,7.5 h 6.525 v 2.862 c 0,9.448 7.687,17.136 17.136,17.136 h 80.725 c 9.449,0 17.136,-7.688 17.136,-17.136 v -2.862 h 60.067 l 17.79,48.016 H 120.542 Z"
       id="path217" />
    <path
       inkscape:connector-curvature="0"
       d="m 236.102,365.46 h 39.999 c 4.142,0 7.5,-3.357 7.5,-7.5 v -26 c 0,-4.143 -3.358,-7.5 -7.5,-7.5 h -39.999 c -4.142,0 -7.5,3.357 -7.5,7.5 v 26 c 0.001,4.143 3.358,7.5 7.5,7.5 z m 7.5,-26 h 24.999 v 11 h -24.999 z"
       id="path219" />
  </g>
</svg>
