21

5
c82fc4fb-844d-40f4-90bc-a316742be6d6
499516a4-abc9-4423-9601-3523f42bbd53
a4736418-bf4f-4230-8c1b-ab328a9bd2cd
83cc6ffc-b68e-4b9c-a9a8-225e721c2eb2
0ec32e27-ab5c-4f21-8987-37882b2b9b50
2 3 5 4 1
1 4 2 5 3
1 4 3 5 2
3 5 2 1 4
5 4 3 2 1
3 1 5 2 4

4
41332ce8-3d4a-41ce-8f94-15b6298ea009
c3620949-e199-492b-a4d4-dc4dd6d2f247
a70ec3d3-d628-48a3-a6fe-a29b346a6254
05e572bb-3758-4a91-b4b4-3d62917705c4
1 4 2 3
2 1 3 4
2 1 3 4

7
c2089ffe-bd63-43e8-9aca-478e92df7d67
f0e493e3-82bb-4c4d-9e03-193bca6944cd
8864e45a-3158-47c8-bef0-ddfefe7b92fa
abf42c50-6485-4ae0-96a7-0237cb0686a9
a32079da-06e5-451b-bfa3-456ac17b8380
a08ec7a9-be27-4fbd-91ff-e685137607a3
9ed6dc75-e66f-4857-be05-190505303958
5 4 2 7 1 3 6
1 2 5 7 4 3 6
5 3 6 4 2 1 7

5
c0539635-fd4b-4761-b13e-6b2b9db676d4
30b25d33-ddf5-483f-82dd-0a549f1e0124
112cb078-f389-4adf-a472-0666696a6910
d986ad08-5df6-4749-9ec9-a1a0fd512f00
ea8ce1eb-fc92-4a11-b4f1-d90070d24792
4 2 3 1 5
2 3 4 5 1
1 3 2 5 4
1 4 3 5 2
5 1 3 2 4
2 1 5 4 3
4 3 1 2 5

4
34c73d35-32d1-46fc-99a4-c20f8fecab51
f6143364-1de8-43b0-a07b-588e62cc0a04
bdab3e6b-6193-4c70-be74-409a1f8a3876
0e887f26-461c-42bf-bd7d-199faecd3595
1 3 2 4
2 1 3 4
4 2 3 1
1 2 3 4
2 3 1 4
3 2 1 4
2 1 4 3
1 2 3 4
1 2 3 4
3 4 2 1

5
62e5c422-e07d-495d-a7b2-724ccd509add
34049f24-d50f-43d3-85f8-008bb4e868d6
509f7d53-1984-46cc-91c2-8d2e8b5d3741
d840e8f0-c79a-48a1-99a6-40ffbec277be
97027037-f440-44b7-b189-1a034123db5a
1 3 4 2 5
4 3 2 1 5
5 1 4 3 2
4 2 5 1 3
2 5 3 4 1

7
1a759128-1c90-4158-8579-fe1c1d62b22e
1199cd4b-3ecd-4502-b35f-19123ff1b2c1
501b9a43-47c8-4782-bdad-136f4679596d
e93ce5ed-9c3f-419c-9faa-c251bbe101d2
be1c9c9c-6d18-46fb-bcd5-a21e485806d7
5de2468d-e2ae-4c03-8282-63c2016528f9
ae5e5191-e198-471b-9ed3-5d88655b537d
6 4 7 1 5 3 2
5 1 3 7 2 4 6
2 6 4 1 3 5 7
3 1 5 6 2 7 4
3 1 7 2 4 5 6
6 1 5 7 4 2 3
7 2 5 6 4 3 1
7 4 5 6 1 3 2
5 1 4 6 2 7 3

3
93bf3129-3d5c-4e1e-9d30-b9e6790feab5
53bca9ca-5187-4b00-9213-b42c2411603a
946b690e-e9a3-434c-814a-8cc95de28380
3 2 1
2 3 1
3 2 1
1 3 2
3 2 1

7
4581c0d1-83da-4e91-91f3-9becc03543bb
e765f1a0-d482-47a3-b610-8a8754e1de10
2bca7bb6-03ba-43ac-8680-a2266a28fda0
e7243e8a-b50c-426b-9e74-c731ff8d27e5
33ee4e53-d23c-4572-bfee-5574fb8233b0
2c310dd1-ae6c-4d14-9843-d3c8e7a0a39d
b49b4b00-b706-4d6f-bc8b-ce9b610d22cc
1 2 7 3 4 5 6
1 2 5 4 6 7 3
2 3 1 7 5 4 6
3 7 2 4 6 1 5

7
ca4a1c16-88f7-4e55-81dd-3d748b15793e
163d3277-6dbe-4b4a-8973-ca5d35f8e6d6
7f6b51ab-a253-4afb-b400-70f22acae711
7cef8713-ac66-4933-a458-85bf9fb6440e
c3061e19-f2a3-4e14-bda0-e42ceb818c23
636b1787-85a8-452b-b0e3-530812f96d05
9e801317-b5f1-4367-9bb0-de701d6278c2
5 4 2 3 6 7 1
6 4 7 1 3 2 5
4 3 1 5 2 7 6

5
f4480692-ac92-48fc-be42-497551b960eb
a2d6a426-820f-4f09-8850-407136359f22
6e6f46e1-e572-4fd8-98d0-19bf8f56a8a3
fb8b3964-7c9d-4a93-838b-f5cfed8ac035
5451eb37-25a4-48eb-9072-e8be7165b73c
1 3 2 5 4
3 2 4 1 5
5 3 1 2 4
4 1 3 2 5
1 3 4 5 2
2 1 5 4 3
4 1 2 5 3
3 2 1 5 4

6
edba3183-6bb7-4a1a-8a2c-f38830c1838f
e6428f93-fc9c-4df0-8dcf-9d4660dc0cdc
bd95367b-5fe0-492c-8153-38943f77011a
1cc3c7b0-3abc-49f1-b62a-8f7523b5f15a
9abd5598-bf15-4dbc-9c55-16efe5fe8c5f
ab90d998-f9f6-4c71-aea1-a2dced019c2e
1 2 3 4 5 6
1 2 3 4 5 6
1 2 3 4 5 6
1 2 3 4 5 6
2 3 1 4 5 6
2 3 1 4 5 6
2 3 1 4 5 6
2 3 1 4 5 6
3 1 2 4 5 6
3 1 2 4 5 6
3 1 2 4 5 6
3 1 2 4 5 6
3 5 6 1 2 4
4 5 6 1 2 3
4 5 6 1 2 3
4 5 6 1 2 3
5 6 1 2 3 4
6 5 1 3 2 4

4
bdfc4525-4bb4-413e-b318-19156429f28d
5c13aa38-deda-47aa-90e4-9cc3ca19b8d3
48b97330-3625-411c-bd3b-6511cdd49f4c
f705cb0c-ca0c-4c3f-b7fe-9c82480176fd
4 3 1 2
3 1 2 4
4 2 3 1
1 4 2 3
1 2 4 3
4 3 2 1

7
9b375da3-30e2-4e86-9fea-1f989cdd66b7
eb394087-0e5c-4394-b708-b8a6019f7a46
6649f486-3297-481a-9d72-de42a52429c8
622a33fe-a1a5-4fb4-b917-7b87fd864c0e
aa8b8814-83d9-478f-9284-b7cb7cc34a80
4e78b636-2204-44f7-8abb-2b9d8dd2ba39
2c208fa2-3787-472e-adc0-9b3b55d06de3
4 7 6 3 5 2 1
6 1 5 4 2 7 3
4 1 3 6 5 2 7
7 3 4 2 6 5 1
4 2 1 5 7 3 6
3 4 1 6 5 2 7
5 7 3 4 2 1 6
1 7 5 6 4 2 3
4 6 3 5 7 1 2
7 6 3 5 4 2 1

7
64ce84d9-c95f-4849-afc9-3552597ebc50
c64871d1-3b6f-42ba-af95-25b17eb516aa
257109fd-dc52-4823-aef1-7298ac7cf744
fefb46f8-ff33-4511-bdb1-f04eee726b74
a8f28dea-3706-4aa0-a5c2-bdf66f4c80ab
bbc3053c-dc16-4ad7-b291-fb95465970ab
4749cfdd-add8-41bd-aa57-76c59af5428d
2 7 4 1 5 3 6
1 6 3 7 4 2 5
6 4 7 3 1 2 5
3 1 5 2 4 6 7
7 6 2 1 4 5 3
2 3 7 6 5 4 1
1 6 2 5 7 3 4
3 5 6 7 4 1 2
1 6 7 5 3 4 2
6 7 5 3 4 1 2

4
5767922a-14c8-4885-9702-764d44fe2b46
408a9138-24e8-4295-b030-063edafb046f
d539bc4b-5d4e-4a9f-bbff-0e55bfe451b4
e941ae38-09eb-444b-8218-8f54b999c067
1 4 3 2
3 1 4 2
4 3 1 2
1 3 4 2
3 2 4 1
2 3 4 1
1 3 4 2
2 4 3 1

6
3acbe28c-929a-488a-8306-01ed456385d9
066773fd-4eed-4fe7-8b21-ff30953d42b0
edd05f7b-e05b-44c3-84d5-59584aaaa149
1f1560cd-ee00-4f56-93b3-19a5b295718b
a7351928-efdc-44a5-90e0-392e69f35582
da2c3645-d599-439d-be2e-de85cd335cfd
4 3 5 2 1 6
1 6 4 5 2 3
1 3 4 2 6 5
5 4 2 3 1 6
6 5 2 1 4 3
2 5 3 1 6 4

3
a19e101f-e0c1-422e-a453-0f65d9cc6ed1
7cd39e2f-94f1-4f83-9c65-72f3cae376f3
f9fb96c2-594b-482e-b953-2a7cac7b5d22
2 1 3
1 3 2
1 2 3
3 1 2
2 1 3
3 1 2
1 2 3

7
5a98af08-2aaf-48a1-baf8-4412f21789a2
ce57038a-64d3-4bf8-a276-dcd1a475d6f3
5a380ed1-de24-400f-9f74-f9612bd5a902
c506267c-c295-46b1-95d6-0a589cda5e4a
12cf7b3e-9bf2-4bda-b6d4-f2de676fb44f
12dbc366-99dd-49bb-9b27-fd24621292b5
afe50129-030a-4041-96ef-4b4e715d653a
4 1 5 3 7 6 2
2 3 7 5 6 1 4
7 1 3 6 5 4 2
5 3 1 2 4 7 6
2 4 5 6 7 1 3
1 2 6 3 7 4 5
6 4 2 3 5 1 7

5
bde7c5e7-5547-4ed9-8e29-53b29d2108fa
29d37fa2-c544-488e-850e-5a99185b0281
c90c2e8e-b9cd-451e-a04b-cbae18feddc9
e86f1e2d-f332-4fd8-8634-2f308e2644ad
04b9b968-5273-4c13-bde9-fb9f057bad9e
3 4 2 1 5
5 1 3 2 4
5 2 4 1 3
4 1 5 3 2
5 4 1 3 2

4
db4b6039-83a1-4695-98b0-be88ad6379cc
8204f1fd-9059-4d16-afff-0dea9b5afbd0
607d6dc2-ce04-4c43-9713-af2dbfd13e52
2b304076-be9c-46eb-9e8b-be79020f4de4
1 2 4 3
2 4 1 3
3 2 4 1
