24

13 27
6
f 7 2 w
h 5 16 n
r 8 14 s
h 0 19 e
h 12 10 n
f 5 23 e
43 5

29 8
1
f 14 0 w
96 3

15 13
1
t 13 11 e
95 4

3 3
10
f 0 0 s
f 0 1 n
t 2 0 s
h 2 2 n
t 2 1 e
r 1 0 w
t 1 2 n
h 1 0 n
f 0 2 s
h 0 0 n
22 5

28 30
9
r 18 17 s
f 13 13 w
r 1 16 w
t 5 1 n
f 9 5 w
r 24 5 w
h 5 24 w
r 19 16 e
f 14 1 e
41 4

22 19
7
t 11 1 n
r 0 15 s
h 3 1 s
h 8 15 n
t 15 7 w
t 13 18 w
t 21 18 e
36 5

14 19
1
h 2 17 e
26 3

28 29
5
t 14 20 w
f 14 26 n
h 11 25 w
f 25 18 n
t 20 27 w
19 1

13 22
8
t 1 13 w
t 6 12 e
t 0 16 w
h 4 17 e
f 8 18 w
f 11 12 s
f 4 0 n
h 4 4 s
95 4

12 23
8
f 7 13 n
t 8 5 n
t 5 11 e
r 7 12 e
t 3 17 e
h 6 6 w
t 5 17 n
t 5 10 w
39 4

21 19
8
r 19 14 w
t 2 11 s
f 16 2 s
f 16 2 e
r 15 18 w
f 7 18 w
h 11 14 w
h 9 13 w
22 5

12 3
1
f 4 0 s
62 2

23 28
2
f 13 18 w
h 13 14 n
73 2

30 11
10
r 18 2 s
r 27 4 s
t 4 10 s
r 21 3 w
h 28 0 w
h 8 0 n
h 21 9 n
r 10 9 n
r 12 0 n
t 4 4 n
78 20

24 13
1
r 7 9 s
60 20

15 13
9
f 10 10 w
r 7 7 w
r 3 9 s
f 13 4 w
t 9 1 e
f 8 12 s
t 1 3 n
r 12 2 w
h 2 4 w
39 13

19 19
6
r 12 7 n
t 3 9 n
f 12 5 s
f 1 14 w
h 10 6 s
f 0 10 e
79 3

1 12
7
h 0 4 n
r 0 3 n
f 0 6 n
f 0 11 s
r 0 9 e
t 0 7 n
t 0 5 n
42 21

26 28
6
f 21 1 w
h 6 22 e
f 22 9 e
t 25 19 e
r 1 16 w
f 2 5 e
47 10

29 28
4
t 19 4 n
r 19 27 n
r 27 27 s
f 7 10 w
40 10

22 4
9
t 15 1 s
f 4 3 n
f 19 0 s
h 7 3 e
f 10 0 e
f 8 3 s
h 21 1 s
h 17 1 w
f 2 3 n
12 4

27 19
1
t 15 8 w
34 3

14 3
1
r 7 1 w
8 3

24 30
7
t 4 0 w
t 16 20 w
t 6 6 w
f 11 18 w
t 11 29 e
t 21 0 w
f 2 8 e
48 12
