22

9 4
1
h 3 2 w
11 5

36 7
8
f 16 6 s
h 35 1 w
r 20 2 s
t 17 3 s
f 35 3 w
t 28 5 s
t 12 4 e
r 29 5 n
33 9

16 30
4
h 0 1 e
t 1 10 e
r 11 16 s
t 3 4 w
12 9

14 5
6
r 13 0 n
r 3 4 w
h 12 3 s
t 0 4 s
h 11 1 n
r 6 0 e
17 4

1 10
1
r 0 2 w
17 7

22 17
13
f 5 9 w
f 18 2 s
t 5 5 n
r 13 15 w
r 15 9 e
r 10 5 n
f 8 7 s
t 16 3 s
r 0 6 n
f 19 9 w
h 7 16 s
h 18 14 w
h 18 9 e
42 8

15 15
10
r 4 5 s
f 1 10 e
r 0 13 e
h 14 3 e
f 9 4 e
t 8 8 n
t 10 7 s
h 11 8 e
t 6 2 w
h 10 13 w
50 4

41 25
2
h 22 23 n
r 7 11 e
29 3

9 8
13
r 7 0 s
t 3 3 s
t 3 0 w
h 8 1 s
f 8 2 s
h 5 6 e
t 0 5 s
t 8 3 w
h 2 2 w
h 5 2 e
h 5 6 e
f 6 4 e
f 0 0 e
44 10

4 29
1
f 1 27 w
46 10

21 14
6
t 6 7 n
r 5 13 w
h 10 1 s
t 18 0 n
h 10 7 s
t 20 8 n
2 3

31 38
6
h 28 23 s
r 9 22 w
r 18 15 w
t 26 32 n
t 17 11 n
r 6 11 e
17 2

34 6
15
t 8 5 n
r 24 1 s
h 26 2 e
t 13 4 n
r 21 3 w
r 12 1 n
h 3 1 e
f 23 4 e
f 2 0 n
f 12 0 n
h 24 1 n
t 22 0 w
r 10 0 s
f 28 3 s
t 4 1 s
11 5

20 9
13
f 4 1 e
f 17 3 w
h 7 1 e
f 14 4 s
f 7 2 w
r 19 8 e
t 7 8 w
h 8 2 w
t 12 6 n
h 7 4 w
f 2 1 e
f 14 3 e
t 13 4 w
39 1

25 11
20
r 8 9 e
h 2 0 n
r 4 7 w
f 0 6 w
t 9 3 w
h 4 2 w
t 7 1 n
f 20 9 n
t 4 8 e
t 20 6 s
f 5 1 w
r 15 8 n
f 10 3 e
r 24 9 n
f 13 10 w
f 9 7 w
t 14 5 s
t 12 4 e
h 15 6 s
h 4 1 s
70 7

44 27
13
f 39 0 s
r 2 1 s
f 34 24 e
r 37 25 s
t 35 22 w
f 37 20 n
h 42 24 n
t 27 9 w
r 4 22 s
f 31 14 w
f 37 21 s
f 27 8 n
f 29 8 s
18 5

49 7
2
t 45 6 w
f 45 1 w
18 8

30 2
5
f 13 0 w
f 16 0 e
h 15 1 w
t 26 1 e
h 24 1 s
42 7

47 1
15
f 32 0 w
t 27 0 e
h 46 0 s
t 21 0 e
f 35 0 n
h 39 0 n
t 3 0 w
f 40 0 w
h 3 0 w
h 20 0 n
h 38 0 n
f 21 0 n
f 46 0 w
h 37 0 e
h 21 0 s
63 3

42 30
9
h 2 6 n
h 17 13 n
f 2 17 w
r 33 22 s
r 7 9 e
h 8 12 n
f 30 24 w
t 36 17 n
f 10 7 s
76 7

22 24
1
f 18 15 e
2 5

45 11
14
t 16 0 e
h 18 3 e
t 20 8 w
r 38 10 s
h 2 1 s
f 10 5 w
f 9 7 w
r 30 7 e
h 7 7 e
t 7 2 w
h 18 8 e
t 4 0 w
h 1 0 n
t 14 6 e
56 10
