*** Darwin 15x16 ***
Turn = 0.
  0123456789012345
0 ................
1 ................
2 ..............h.
3 ................
4 ................
5 ..........h.....
6 ................
7 ................
8 ................
9 r...............
0 ................
1 ..........t.....
2 ................
3 ...............h
4 ................

*** Darwin 12x4 ***
Turn = 0.
  0123
0 .h..
1 .r..
2 ....
3 ....
4 tr..
5 r.t.
6 ....
7 ....
8 ....
9 .r..
0 ....
1 ....

Turn = 5.
  0123
0 ...h
1 ....
2 r...
3 .r..
4 tt..
5 ..t.
6 r...
7 ....
8 ....
9 ....
0 ....
1 ....

Turn = 10.
  0123
0 ...h
1 ...r
2 ....
3 t...
4 ttr.
5 .r..
6 ....
7 ....
8 ....
9 ....
0 ....
1 ....

*** Darwin 19x20 ***
Turn = 0.
  01234567890123456789
0 ..................t.
1 ....................
2 ................f...
3 .................h..
4 ....................
5 ....................
6 ....................
7 ....................
8 ....................
9 ....................
0 .....t..............
1 ....................
2 ....................
3 ....................
4 ....................
5 ....................
6 ....................
7 ....................
8 ....................

Turn = 6.
  01234567890123456789
0 .................tt.
1 ....................
2 ................f...
3 ....................
4 ....................
5 ....................
6 ....................
7 ....................
8 ....................
9 ....................
0 .....t..............
1 ....................
2 ....................
3 ....................
4 ....................
5 ....................
6 ....................
7 ....................
8 ....................

Turn = 12.
  01234567890123456789
0 .................tt.
1 ....................
2 ................f...
3 ....................
4 ....................
5 ....................
6 ....................
7 ....................
8 ....................
9 ....................
0 .....t..............
1 ....................
2 ....................
3 ....................
4 ....................
5 ....................
6 ....................
7 ....................
8 ....................

*** Darwin 15x17 ***
Turn = 0.
  01234567890123456
0 .................
1 .................
2 .................
3 .................
4 .................
5 .................
6 .................
7 .................
8 .................
9 .................
0 .................
1 .h.fr............
2 .................
3 .................
4 .................

Turn = 2.
  01234567890123456
0 .................
1 .................
2 .................
3 .................
4 .................
5 .................
6 .................
7 .................
8 .................
9 .h...............
0 .................
1 ...f..r..........
2 .................
3 .................
4 .................

Turn = 4.
  01234567890123456
0 .................
1 .................
2 .................
3 .................
4 .................
5 .................
6 .................
7 .h...............
8 .................
9 .................
0 .................
1 ...f....r........
2 .................
3 .................
4 .................

Turn = 6.
  01234567890123456
0 .................
1 .................
2 .................
3 .................
4 .................
5 .h...............
6 .................
7 .................
8 .................
9 .................
0 .................
1 ...f......r......
2 .................
3 .................
4 .................

Turn = 8.
  01234567890123456
0 .................
1 .................
2 .................
3 .h...............
4 .................
5 .................
6 .................
7 .................
8 .................
9 .................
0 .................
1 ...f........r....
2 .................
3 .................
4 .................

Turn = 10.
  01234567890123456
0 .................
1 .h...............
2 .................
3 .................
4 .................
5 .................
6 .................
7 .................
8 .................
9 .................
0 .................
1 ...f..........r..
2 .................
3 .................
4 .................

Turn = 12.
  01234567890123456
0 .h...............
1 .................
2 .................
3 .................
4 .................
5 .................
6 .................
7 .................
8 .................
9 .................
0 .................
1 ...f............r
2 .................
3 .................
4 .................

Turn = 14.
  01234567890123456
0 .h...............
1 .................
2 .................
3 .................
4 .................
5 .................
6 .................
7 .................
8 .................
9 .................
0 .................
1 ...f.............
2 ................r
3 .................
4 .................

Turn = 16.
  01234567890123456
0 .h...............
1 .................
2 .................
3 .................
4 .................
5 .................
6 .................
7 .................
8 .................
9 .................
0 .................
1 ...f.............
2 .................
3 .................
4 ................r

Turn = 18.
  01234567890123456
0 .h...............
1 .................
2 .................
3 .................
4 .................
5 .................
6 .................
7 .................
8 .................
9 .................
0 .................
1 ...f.............
2 .................
3 .................
4 ................r

*** Darwin 9x11 ***
Turn = 0.
  01234567890
0 r........t.
1 .........t.
2 ..f......r.
3 ...........
4 ...h.......
5 .......r...
6 ...........
7 ...........
8 ...........

Turn = 2.
  01234567890
0 r........t.
1 .........t.
2 ..f....r...
3 ...........
4 .....h.....
5 .....r.....
6 ...........
7 ...........
8 ...........

Turn = 4.
  01234567890
0 r........t.
1 .........t.
2 ..f..r.....
3 ...........
4 .......h...
5 ...r.......
6 ...........
7 ...........
8 ...........

Turn = 6.
  01234567890
0 ..r......t.
1 .........t.
2 ..fr.......
3 ...........
4 .........h.
5 .r.........
6 ...........
7 ...........
8 ...........

Turn = 8.
  01234567890
0 ....r....t.
1 .........t.
2 .rr........
3 ...........
4 ..........h
5 r..........
6 ...........
7 ...........
8 ...........

*** Darwin 5x14 ***
Turn = 0.
  01234567890123
0 ..............
1 ..............
2 ..............
3 ......h......f
4 ..............

Turn = 3.
  01234567890123
0 ..............
1 ..............
2 ..............
3 .........h...f
4 ..............

Turn = 6.
  01234567890123
0 ..............
1 ..............
2 ..............
3 ............hf
4 ..............

Turn = 9.
  01234567890123
0 ..............
1 ..............
2 ..............
3 ............hf
4 ..............

Turn = 12.
  01234567890123
0 ..............
1 ..............
2 ..............
3 ............hf
4 ..............

*** Darwin 8x17 ***
Turn = 0.
  01234567890123456
0 .......r.........
1 .................
2 .................
3 .................
4 .h.........r..f..
5 .................
6 ....h............
7 .................

Turn = 4.
  01234567890123456
0 ..........rr.....
1 .................
2 .................
3 .................
4 h.............f..
5 .................
6 ........h........
7 .................

Turn = 8.
  01234567890123456
0 ............r.r..
1 .................
2 .................
3 .................
4 h.............f..
5 .................
6 ............h....
7 .................

Turn = 12.
  01234567890123456
0 ...............r.
1 ................r
2 .................
3 .................
4 h.............f..
5 .................
6 ................h
7 .................

Turn = 16.
  01234567890123456
0 .................
1 .................
2 .................
3 .................
4 h.............fr.
5 ................r
6 ................h
7 .................

*** Darwin 3x2 ***
Turn = 0.
  01
0 hh
1 fh
2 tr

*** Darwin 10x6 ***
Turn = 0.
  012345
0 ......
1 ......
2 ......
3 ......
4 ......
5 ..f.r.
6 .tt...
7 ...f..
8 .....h
9 fr....

Turn = 3.
  012345
0 ......
1 ......
2 ....r.
3 ......
4 ......
5 ..f...
6 .tt...
7 ...f..
8 .....h
9 rr....

*** Darwin 20x15 ***
Turn = 0.
  012345678901234
0 ...............
1 ...........r...
2 ...............
3 ...............
4 .....h.........
5 ...............
6 ...............
7 ...............
8 ...............
9 ...............
0 ...............
1 .....h.........
2 ...............
3 ...............
4 ...............
5 ...............
6 ...............
7 ...............
8 ...............
9 ...............

Turn = 1.
  012345678901234
0 ...............
1 ...............
2 ...........r...
3 ...............
4 ....h..........
5 ...............
6 ...............
7 ...............
8 ...............
9 ...............
0 .....h.........
1 ...............
2 ...............
3 ...............
4 ...............
5 ...............
6 ...............
7 ...............
8 ...............
9 ...............

Turn = 2.
  012345678901234
0 ...............
1 ...............
2 ...............
3 ...........r...
4 ...h...........
5 ...............
6 ...............
7 ...............
8 ...............
9 .....h.........
0 ...............
1 ...............
2 ...............
3 ...............
4 ...............
5 ...............
6 ...............
7 ...............
8 ...............
9 ...............

Turn = 3.
  012345678901234
0 ...............
1 ...............
2 ...............
3 ...............
4 ..h........r...
5 ...............
6 ...............
7 ...............
8 .....h.........
9 ...............
0 ...............
1 ...............
2 ...............
3 ...............
4 ...............
5 ...............
6 ...............
7 ...............
8 ...............
9 ...............

Turn = 4.
  012345678901234
0 ...............
1 ...............
2 ...............
3 ...............
4 .h.............
5 ...........r...
6 ...............
7 .....h.........
8 ...............
9 ...............
0 ...............
1 ...............
2 ...............
3 ...............
4 ...............
5 ...............
6 ...............
7 ...............
8 ...............
9 ...............

Turn = 5.
  012345678901234
0 ...............
1 ...............
2 ...............
3 ...............
4 h..............
5 ...............
6 .....h.....r...
7 ...............
8 ...............
9 ...............
0 ...............
1 ...............
2 ...............
3 ...............
4 ...............
5 ...............
6 ...............
7 ...............
8 ...............
9 ...............

Turn = 6.
  012345678901234
0 ...............
1 ...............
2 ...............
3 ...............
4 h..............
5 .....h.........
6 ...............
7 ...........r...
8 ...............
9 ...............
0 ...............
1 ...............
2 ...............
3 ...............
4 ...............
5 ...............
6 ...............
7 ...............
8 ...............
9 ...............

Turn = 7.
  012345678901234
0 ...............
1 ...............
2 ...............
3 ...............
4 h....h.........
5 ...............
6 ...............
7 ...............
8 ...........r...
9 ...............
0 ...............
1 ...............
2 ...............
3 ...............
4 ...............
5 ...............
6 ...............
7 ...............
8 ...............
9 ...............

Turn = 8.
  012345678901234
0 ...............
1 ...............
2 ...............
3 .....h.........
4 h..............
5 ...............
6 ...............
7 ...............
8 ...............
9 ...........r...
0 ...............
1 ...............
2 ...............
3 ...............
4 ...............
5 ...............
6 ...............
7 ...............
8 ...............
9 ...............

Turn = 9.
  012345678901234
0 ...............
1 ...............
2 .....h.........
3 ...............
4 h..............
5 ...............
6 ...............
7 ...............
8 ...............
9 ...............
0 ...........r...
1 ...............
2 ...............
3 ...............
4 ...............
5 ...............
6 ...............
7 ...............
8 ...............
9 ...............

Turn = 10.
  012345678901234
0 ...............
1 .....h.........
2 ...............
3 ...............
4 h..............
5 ...............
6 ...............
7 ...............
8 ...............
9 ...............
0 ...............
1 ...........r...
2 ...............
3 ...............
4 ...............
5 ...............
6 ...............
7 ...............
8 ...............
9 ...............

Turn = 11.
  012345678901234
0 .....h.........
1 ...............
2 ...............
3 ...............
4 h..............
5 ...............
6 ...............
7 ...............
8 ...............
9 ...............
0 ...............
1 ...............
2 ...........r...
3 ...............
4 ...............
5 ...............
6 ...............
7 ...............
8 ...............
9 ...............

Turn = 12.
  012345678901234
0 .....h.........
1 ...............
2 ...............
3 ...............
4 h..............
5 ...............
6 ...............
7 ...............
8 ...............
9 ...............
0 ...............
1 ...............
2 ...............
3 ...........r...
4 ...............
5 ...............
6 ...............
7 ...............
8 ...............
9 ...............

Turn = 13.
  012345678901234
0 .....h.........
1 ...............
2 ...............
3 ...............
4 h..............
5 ...............
6 ...............
7 ...............
8 ...............
9 ...............
0 ...............
1 ...............
2 ...............
3 ...............
4 ...........r...
5 ...............
6 ...............
7 ...............
8 ...............
9 ...............

Turn = 14.
  012345678901234
0 .....h.........
1 ...............
2 ...............
3 ...............
4 h..............
5 ...............
6 ...............
7 ...............
8 ...............
9 ...............
0 ...............
1 ...............
2 ...............
3 ...............
4 ...............
5 ...........r...
6 ...............
7 ...............
8 ...............
9 ...............

Turn = 15.
  012345678901234
0 .....h.........
1 ...............
2 ...............
3 ...............
4 h..............
5 ...............
6 ...............
7 ...............
8 ...............
9 ...............
0 ...............
1 ...............
2 ...............
3 ...............
4 ...............
5 ...............
6 ...........r...
7 ...............
8 ...............
9 ...............

Turn = 16.
  012345678901234
0 .....h.........
1 ...............
2 ...............
3 ...............
4 h..............
5 ...............
6 ...............
7 ...............
8 ...............
9 ...............
0 ...............
1 ...............
2 ...............
3 ...............
4 ...............
5 ...............
6 ...............
7 ...........r...
8 ...............
9 ...............

Turn = 17.
  012345678901234
0 .....h.........
1 ...............
2 ...............
3 ...............
4 h..............
5 ...............
6 ...............
7 ...............
8 ...............
9 ...............
0 ...............
1 ...............
2 ...............
3 ...............
4 ...............
5 ...............
6 ...............
7 ...............
8 ...........r...
9 ...............

Turn = 18.
  012345678901234
0 .....h.........
1 ...............
2 ...............
3 ...............
4 h..............
5 ...............
6 ...............
7 ...............
8 ...............
9 ...............
0 ...............
1 ...............
2 ...............
3 ...............
4 ...............
5 ...............
6 ...............
7 ...............
8 ...............
9 ...........r...

Turn = 19.
  012345678901234
0 .....h.........
1 ...............
2 ...............
3 ...............
4 h..............
5 ...............
6 ...............
7 ...............
8 ...............
9 ...............
0 ...............
1 ...............
2 ...............
3 ...............
4 ...............
5 ...............
6 ...............
7 ...............
8 ...............
9 ...........r...

*** Darwin 17x18 ***
Turn = 0.
  012345678901234567
0 ..................
1 ..................
2 ..................
3 ..................
4 ..................
5 ..................
6 ....f.............
7 .......t..........
8 ......f......h....
9 ..................
0 ..................
1 ..................
2 ............f.....
3 ..................
4 ..................
5 ..................
6 ..................

Turn = 4.
  012345678901234567
0 ..................
1 ..................
2 ..................
3 ..................
4 ..................
5 ..................
6 ....f.............
7 .......t..........
8 ......f..h........
9 ..................
0 ..................
1 ..................
2 ............f.....
3 ..................
4 ..................
5 ..................
6 ..................

Turn = 8.
  012345678901234567
0 ..................
1 ..................
2 ..................
3 ..................
4 ..................
5 ..................
6 ....f.............
7 .......t..........
8 ......tt..........
9 ..................
0 ..................
1 ..................
2 ............f.....
3 ..................
4 ..................
5 ..................
6 ..................

Turn = 12.
  012345678901234567
0 ..................
1 ..................
2 ..................
3 ..................
4 ..................
5 ..................
6 ....f.............
7 .......t..........
8 ......tt..........
9 ..................
0 ..................
1 ..................
2 ............f.....
3 ..................
4 ..................
5 ..................
6 ..................

Turn = 16.
  012345678901234567
0 ..................
1 ..................
2 ..................
3 ..................
4 ..................
5 ..................
6 ....f.............
7 .......t..........
8 ......tt..........
9 ..................
0 ..................
1 ..................
2 ............f.....
3 ..................
4 ..................
5 ..................
6 ..................

*** Darwin 6x12 ***
Turn = 0.
  012345678901
0 .....f......
1 ............
2 .......f....
3 ............
4 t.h..f......
5 .....t......

Turn = 9.
  012345678901
0 .....f......
1 ............
2 .......f....
3 ............
4 t....t......
5 ..h..t......

*** Darwin 12x1 ***
Turn = 0.
  0
0 t
1 .
2 .
3 r
4 .
5 f
6 .
7 f
8 f
9 .
0 t
1 .

Turn = 1.
  0
0 t
1 .
2 .
3 r
4 .
5 f
6 .
7 f
8 f
9 .
0 t
1 .

Turn = 2.
  0
0 t
1 .
2 .
3 r
4 .
5 f
6 .
7 f
8 f
9 .
0 t
1 .

Turn = 3.
  0
0 t
1 .
2 .
3 r
4 .
5 f
6 .
7 f
8 f
9 .
0 t
1 .

Turn = 4.
  0
0 t
1 .
2 .
3 r
4 .
5 f
6 .
7 f
8 f
9 .
0 t
1 .

Turn = 5.
  0
0 t
1 .
2 .
3 r
4 .
5 f
6 .
7 f
8 f
9 .
0 t
1 .

Turn = 6.
  0
0 t
1 .
2 .
3 r
4 .
5 f
6 .
7 f
8 f
9 .
0 t
1 .

Turn = 7.
  0
0 t
1 .
2 .
3 r
4 .
5 f
6 .
7 f
8 f
9 .
0 t
1 .

Turn = 8.
  0
0 t
1 .
2 .
3 r
4 .
5 f
6 .
7 f
8 f
9 .
0 t
1 .

Turn = 9.
  0
0 t
1 .
2 .
3 r
4 .
5 f
6 .
7 f
8 f
9 .
0 t
1 .

Turn = 10.
  0
0 t
1 .
2 .
3 r
4 .
5 f
6 .
7 f
8 f
9 .
0 t
1 .

Turn = 11.
  0
0 t
1 .
2 .
3 r
4 .
5 f
6 .
7 f
8 f
9 .
0 t
1 .

Turn = 12.
  0
0 t
1 .
2 .
3 r
4 .
5 f
6 .
7 f
8 f
9 .
0 t
1 .

Turn = 13.
  0
0 t
1 .
2 .
3 r
4 .
5 f
6 .
7 f
8 f
9 .
0 t
1 .

Turn = 14.
  0
0 t
1 .
2 .
3 r
4 .
5 f
6 .
7 f
8 f
9 .
0 t
1 .

Turn = 15.
  0
0 t
1 .
2 .
3 r
4 .
5 f
6 .
7 f
8 f
9 .
0 t
1 .

Turn = 16.
  0
0 t
1 .
2 .
3 r
4 .
5 f
6 .
7 f
8 f
9 .
0 t
1 .

Turn = 17.
  0
0 t
1 .
2 .
3 r
4 .
5 f
6 .
7 f
8 f
9 .
0 t
1 .

Turn = 18.
  0
0 t
1 .
2 .
3 r
4 .
5 f
6 .
7 f
8 f
9 .
0 t
1 .

Turn = 19.
  0
0 t
1 .
2 .
3 r
4 .
5 f
6 .
7 f
8 f
9 .
0 t
1 .

*** Darwin 17x14 ***
Turn = 0.
  01234567890123
0 ..............
1 ..............
2 ....t.........
3 ..............
4 ..............
5 ..............
6 .f............
7 ..............
8 ..............
9 ..............
0 ..............
1 ..............
2 ..............
3 ..............
4 ..............
5 ..t.....f.....
6 ..............

Turn = 5.
  01234567890123
0 ..............
1 ..............
2 ....t.........
3 ..............
4 ..............
5 ..............
6 .f............
7 ..............
8 ..............
9 ..............
0 ..............
1 ..............
2 ..............
3 ..............
4 ..............
5 ..t.....f.....
6 ..............

*** Darwin 19x16 ***
Turn = 0.
  0123456789012345
0 ................
1 t...............
2 ................
3 ................
4 ................
5 ............t...
6 ................
7 ................
8 ................
9 ................
0 ................
1 ................
2 ................
3 ................
4 ................
5 ................
6 ................
7 ................
8 ................

Turn = 5.
  0123456789012345
0 ................
1 t...............
2 ................
3 ................
4 ................
5 ............t...
6 ................
7 ................
8 ................
9 ................
0 ................
1 ................
2 ................
3 ................
4 ................
5 ................
6 ................
7 ................
8 ................

Turn = 10.
  0123456789012345
0 ................
1 t...............
2 ................
3 ................
4 ................
5 ............t...
6 ................
7 ................
8 ................
9 ................
0 ................
1 ................
2 ................
3 ................
4 ................
5 ................
6 ................
7 ................
8 ................

*** Darwin 6x9 ***
Turn = 0.
  012345678
0 .f......r
1 ...h.....
2 .........
3 h.r...h..
4 .....t...
5 .........

Turn = 2.
  012345678
0 .f......r
1 hh.......
2 .........
3 r........
4 .....t...
5 ......h..

Turn = 4.
  012345678
0 hf......r
1 h........
2 r........
3 .........
4 .....t...
5 ......h..

Turn = 6.
  012345678
0 hf.......
1 r........
2 r.......r
3 .........
4 .....t...
5 ......h..

Turn = 8.
  012345678
0 rf.......
1 r........
2 .........
3 r........
4 .....t..r
5 ......h..

Turn = 10.
  012345678
0 .r.r.....
1 ..r......
2 .........
3 .........
4 .....t...
5 r.....h.r

Turn = 12.
  012345678
0 ...r.r...
1 ....r....
2 .........
3 .........
4 .....t..r
5 r.....h..

*** Darwin 18x2 ***
Turn = 0.
  01
0 ..
1 ..
2 t.
3 ..
4 ..
5 ..
6 ..
7 tr
8 ..
9 ..
0 ..
1 ..
2 ..
3 ..
4 ..
5 ..
6 ..
7 ..

Turn = 5.
  01
0 ..
1 ..
2 t.
3 ..
4 ..
5 ..
6 ..
7 tt
8 ..
9 ..
0 ..
1 ..
2 ..
3 ..
4 ..
5 ..
6 ..
7 ..

Turn = 10.
  01
0 ..
1 ..
2 t.
3 ..
4 ..
5 ..
6 ..
7 tt
8 ..
9 ..
0 ..
1 ..
2 ..
3 ..
4 ..
5 ..
6 ..
7 ..

*** Darwin 4x19 ***
Turn = 0.
  0123456789012345678
0 ....t.hh...........
1 ..........hr.......
2 .......f...r.......
3 .....t...r.........

Turn = 4.
  0123456789012345678
0 ....t.hh.r.........
1 ......h.r..........
2 .......rr..........
3 .....t.............

Turn = 8.
  0123456789012345678
0 ....t.hrr..........
1 ....rr.............
2 ....r..............
3 .....rr............

Turn = 12.
  0123456789012345678
0 ..r.rrr............
1 .......r...........
2 r.....r............
3 ...r...r...........

Turn = 16.
  0123456789012345678
0 rrr..r...r.........
1 r..................
2 ...................
3 r..r..r............

*** Darwin 5x6 ***
Turn = 0.
  012345
0 ....f.
1 ...t..
2 ......
3 f.f...
4 ..rf..

Turn = 7.
  012345
0 ....f.
1 r.rt..
2 ......
3 ..r...
4 ...f..

Turn = 14.
  012345
0 ...r.r
1 ...tt.
2 ......
3 ......
4 ...f.r

*** Darwin 10x12 ***
Turn = 0.
  012345678901
0 .........t..
1 ............
2 ....h.......
3 ...t........
4 ............
5 ...h.....r..
6 ............
7 ............
8 ........f...
9 ......ft....

Turn = 3.
  012345678901
0 ....h....t..
1 ............
2 ............
3 ...t........
4 ............
5 h.....r.....
6 ............
7 ............
8 ........f...
9 ......tt....

Turn = 6.
  012345678901
0 ....h....t..
1 ............
2 ............
3 ...t........
4 ............
5 h..r........
6 ............
7 ............
8 ........f...
9 ......tt....

Turn = 9.
  012345678901
0 ....h....t..
1 ............
2 ............
3 ...t........
4 ............
5 rr..........
6 ............
7 ............
8 ........f...
9 ......tt....

Turn = 12.
  012345678901
0 ....h....t..
1 ............
2 ............
3 r..t........
4 ............
5 ............
6 ............
7 .r..........
8 ........f...
9 ......tt....

Turn = 15.
  012345678901
0 r...h....t..
1 ............
2 ............
3 ...t........
4 ............
5 ............
6 ............
7 ............
8 ........f...
9 .r....tt....

*** Darwin 18x2 ***
Turn = 0.
  01
0 f.
1 ..
2 .t
3 r.
4 ..
5 .f
6 .r
7 ..
8 ..
9 ..
0 .f
1 ..
2 ..
3 h.
4 ..
5 ..
6 ..
7 ..

Turn = 6.
  01
0 f.
1 ..
2 r.
3 ..
4 .r
5 .f
6 ..
7 ..
8 ..
9 .r
0 .r
1 ..
2 ..
3 ..
4 ..
5 ..
6 ..
7 h.

Turn = 12.
  01
0 f.
1 ..
2 ..
3 ..
4 ..
5 ..
6 ..
7 ..
8 r.
9 .r
0 ..
1 .r
2 ..
3 ..
4 .r
5 ..
6 .r
7 h.

*** Darwin 6x1 ***
Turn = 0.
  0
0 r
1 .
2 .
3 .
4 .
5 .

Turn = 4.
  0
0 r
1 .
2 .
3 .
4 .
5 .

Turn = 8.
  0
0 .
1 .
2 .
3 .
4 r
5 .

Turn = 12.
  0
0 .
1 .
2 .
3 .
4 r
5 .

Turn = 16.
  0
0 r
1 .
2 .
3 .
4 .
5 .

Turn = 20.
  0
0 .
1 .
2 r
3 .
4 .
5 .

*** Darwin 19x18 ***
Turn = 0.
  012345678901234567
0 ..............h...
1 ..................
2 ..................
3 ..................
4 ..................
5 ..................
6 ..................
7 ..................
8 ..................
9 ..................
0 ..................
1 ..................
2 ..................
3 ..................
4 ..................
5 ..................
6 ..................
7 ..................
8 ..................

Turn = 5.
  012345678901234567
0 ..................
1 ..................
2 ..................
3 ..................
4 ..................
5 ..............h...
6 ..................
7 ..................
8 ..................
9 ..................
0 ..................
1 ..................
2 ..................
3 ..................
4 ..................
5 ..................
6 ..................
7 ..................
8 ..................

Turn = 10.
  012345678901234567
0 ..................
1 ..................
2 ..................
3 ..................
4 ..................
5 ..................
6 ..................
7 ..................
8 ..................
9 ..................
0 ..............h...
1 ..................
2 ..................
3 ..................
4 ..................
5 ..................
6 ..................
7 ..................
8 ..................

Turn = 15.
  012345678901234567
0 ..................
1 ..................
2 ..................
3 ..................
4 ..................
5 ..................
6 ..................
7 ..................
8 ..................
9 ..................
0 ..................
1 ..................
2 ..................
3 ..................
4 ..................
5 ..............h...
6 ..................
7 ..................
8 ..................

Turn = 20.
  012345678901234567
0 ..................
1 ..................
2 ..................
3 ..................
4 ..................
5 ..................
6 ..................
7 ..................
8 ..................
9 ..................
0 ..................
1 ..................
2 ..................
3 ..................
4 ..................
5 ..................
6 ..................
7 ..................
8 ..............h...

*** Darwin 16x9 ***
Turn = 0.
  012345678
0 .........
1 .........
2 .........
3 ......f.r
4 h........
5 .........
6 .........
7 .......h.
8 .........
9 .........
0 .h.......
1 .........
2 .......h.
3 f........
4 ..h....h.
5 .........

Turn = 10.
  012345678
0 .........
1 .........
2 .......h.
3 ......f..
4 .........
5 .........
6 ....r....
7 .........
8 .........
9 h........
0 h.......r
1 .........
2 .........
3 f........
4 ........h
5 ..h......

*** Darwin 8x7 ***
Turn = 0.
  0123456
0 .......
1 .......
2 .......
3 .......
4 ......f
5 .......
6 .......
7 .......

*** Darwin 12x13 ***
Turn = 0.
  0123456789012
0 h............
1 ...f.........
2 .............
3 ........t....
4 .............
5 .h...........
6 .............
7 .............
8 .....h.......
9 ....r........
0 r............
1 .............

Turn = 10.
  0123456789012
0 hh..rh.......
1 ...f.........
2 .............
3 ........t....
4 .............
5 .............
6 r............
7 .............
8 .............
9 .............
0 .............
1 .............

*** Darwin 10x20 ***
Turn = 0.
  01234567890123456789
0 ....................
1 ....................
2 ....................
3 ...............t....
4 ....................
5 ....................
6 ....................
7 r...h...............
8 .................t..
9 ...................h

Turn = 3.
  01234567890123456789
0 ....................
1 ....................
2 ....................
3 ...............t....
4 ....................
5 ....................
6 ....................
7 ..rr................
8 .................t..
9 .................t..

Turn = 6.
  01234567890123456789
0 ....................
1 ....................
2 ....................
3 ...............t....
4 ...r................
5 ..r.................
6 ....................
7 ....................
8 .................t..
9 .................t..

Turn = 9.
  01234567890123456789
0 ....................
1 ...r................
2 ..r.................
3 ...............t....
4 ....................
5 ....................
6 ....................
7 ....................
8 .................t..
9 .................t..

Turn = 12.
  01234567890123456789
0 ..r.r...............
1 ....................
2 ....................
3 ...............t....
4 ....................
5 ....................
6 ....................
7 ....................
8 .................t..
9 .................t..

*** Darwin 10x12 ***
Turn = 0.
  012345678901
0 .......h....
1 ............
2 ............
3 ............
4 ............
5 ......t.....
6 .f.r..f..h..
7 ............
8 ............
9 ...........h

Turn = 9.
  012345678901
0 .....r.h....
1 ............
2 ............
3 ............
4 ............
5 ......t.....
6 .f....t.....
7 ............
8 ............
9 .........h.h

*** Darwin 10x9 ***
Turn = 0.
  012345678
0 t.f......
1 r..r.....
2 .........
3 .........
4 .........
5 f........
6 .........
7 ......h..
8 .....h...
9 ...h.....
