{
  "project_info": {
    "project_number": "899521862284",
    "project_id": "dp-boilerplate",
    "storage_bucket": "dp-boilerplate.appspot.com"
  },
  "client": [
    {
      "client_info": {
        "mobilesdk_app_id": "1:899521862284:android:09fc5a1728c9c3ade839a9",
        "android_client_info": {
          "package_name": "com.example.flutter_boilerplate.dev"
        }
      },
      "oauth_client": [
        {
          "client_id": "899521862284-f4knrv2s6un3qn13ogjq6lkurcttehio.apps.googleusercontent.com",
          "client_type": 3
        }
      ],
      "api_key": [
        {
          "current_key": "AIzaSyAS4YIDrr9uP5QfLyrNl9wrdc1qoGiNNO0"
        }
      ],
      "services": {
        "appinvite_service": {
          "other_platform_oauth_client": [
            {
              "client_id": "899521862284-f4knrv2s6un3qn13ogjq6lkurcttehio.apps.googleusercontent.com",
              "client_type": 3
            }
          ]
        }
      }
    }
  ],
  "configuration_version": "1"
}