
{
    "introduction": "Quest Assignements",
    "extra": "Sidequests",
    "conclusion": "Go forth!",
    "rounds": [
        {
            "sentences": [
                "The honorable {0}",
                "Introducing {0}",
                "The valiant {0}"
            ],
            "participants": [
                "Lancelot",
                "Gawain",
                "Geraint",
                "Percival",
                "Bors the Younger",
                "Lamorak"
            ]
        },
        {
            "sentences": [
                "The honorable {0}",
                "Introducing {0}",
                "The valiant {0}"
            ],
            "participants": [
                "Gareth",
                "Bedivere",
                "Gaheris",
                "Galahad",
                "Tristan",
                "Palamedes"
            ]
        }
    ]
}