<?xml version="1.0" standalone="no"?>
<!DOCTYPE svg PUBLIC "-//W3C//DTD SVG 20010904//EN"
 "http://www.w3.org/TR/2001/REC-SVG-20010904/DTD/svg10.dtd">
<svg version="1.0" xmlns="http://www.w3.org/2000/svg"
 width="244.000000pt" height="206.000000pt" viewBox="0 0 244.000000 206.000000"
 preserveAspectRatio="xMidYMid meet">
<metadata>
Created by potrace 1.10, written by Peter Selinger 2001-2011
</metadata>
<g transform="translate(0.000000,206.000000) scale(0.100000,-0.100000)"
fill="#000000" stroke="none">
<path d="M72 2049 c-20 -6 -40 -22 -52 -42 -19 -31 -20 -56 -20 -975 0 -793 2
-947 14 -970 31 -60 -35 -57 1210 -57 1086 0 1142 1 1168 18 14 10 31 32 37
49 15 43 15 1873 0 1916 -6 17 -23 39 -37 49 -26 17 -83 18 -1157 20 -695 1
-1143 -2 -1163 -8z m2246 -111 c9 -9 12 -68 12 -205 l0 -193 -1110 0 -1110 0
0 193 c0 137 3 196 12 205 17 17 2179 17 2196 0z m-1486 -851 l195 -202 -169
-180 c-93 -99 -182 -193 -198 -210 l-30 -29 -49 48 -50 49 155 160 156 160
-156 156 -156 156 47 48 c26 26 50 47 54 47 3 0 93 -91 201 -203z m1038 -537
l0 -70 -395 0 -395 0 0 63 c0 35 3 67 7 70 3 4 181 7 395 7 l388 0 0 -70z"/>
<path d="M313 1840 c-22 -13 -36 -32 -44 -61 -11 -37 -11 -46 7 -78 27 -50 82
-77 129 -61 44 15 85 63 85 101 0 93 -97 148 -177 99z"/>
<path d="M683 1827 c-30 -28 -36 -40 -36 -75 0 -52 24 -89 70 -108 51 -22 114
0 139 48 25 49 18 96 -20 134 -48 48 -101 48 -153 1z"/>
</g>
</svg>
