<?xml version="1.0" standalone="no"?>
<!DOCTYPE svg PUBLIC "-//W3C//DTD SVG 20010904//EN"
 "http://www.w3.org/TR/2001/REC-SVG-20010904/DTD/svg10.dtd">
<svg version="1.0" xmlns="http://www.w3.org/2000/svg"
 width="900.000000pt" height="270.000000pt" viewBox="0 0 900.000000 270.000000"
 preserveAspectRatio="xMidYMid meet">
<metadata>
Created by potrace 1.10, written by Peter Selinger 2001-2011
</metadata>
<g transform="translate(0.000000,270.000000) scale(0.100000,-0.100000)"
fill="#000000" stroke="none">
<path d="M5750 2688 c0 -7 -14 -26 -31 -43 -17 -16 -59 -66 -92 -110 -34 -44
-66 -84 -73 -90 -6 -5 -54 -65 -105 -133 -206 -271 -280 -367 -288 -372 -4 -3
-36 -43 -71 -90 -35 -47 -67 -87 -70 -90 -3 -3 -19 -23 -35 -45 -17 -22 -32
-42 -36 -45 -3 -3 -34 -43 -69 -90 -35 -47 -67 -87 -70 -90 -4 -3 -51 -63
-106 -135 -54 -71 -104 -134 -110 -140 -6 -5 -53 -66 -105 -135 -51 -69 -98
-129 -105 -135 -6 -5 -54 -65 -105 -133 -206 -271 -280 -367 -288 -372 -4 -3
-36 -43 -71 -90 -35 -47 -67 -87 -70 -90 -3 -3 -19 -23 -35 -45 -17 -22 -32
-42 -35 -45 -3 -3 -27 -32 -52 -65 -25 -34 -53 -67 -62 -74 -29 -24 -17 -31
52 -31 l68 0 45 61 c24 33 51 68 60 77 8 9 31 38 49 65 18 26 36 47 40 47 4 0
44 51 90 112 46 62 110 146 142 185 32 40 58 76 58 79 0 4 9 16 21 28 11 12
54 65 96 118 41 54 79 98 83 98 5 0 11 8 14 18 3 10 24 38 46 62 22 24 40 48
40 53 0 5 23 34 50 66 28 32 50 62 50 68 0 5 10 18 21 29 12 10 52 60 90 109
98 131 192 252 244 315 25 30 56 72 70 93 14 21 41 54 59 75 18 20 67 82 109
137 43 55 108 138 145 186 37 47 100 128 140 180 41 51 87 110 102 129 50 60
130 171 130 179 0 5 8 19 19 32 10 13 21 41 25 62 l7 37 -41 0 c-25 0 -40 -5
-40 -12z"/>
<path d="M3264 1918 c3 -62 7 -165 8 -228 3 -105 1 -115 -15 -118 -11 -2 -29
5 -40 16 -31 28 -58 34 -87 17 -14 -8 -34 -19 -45 -25 -11 -6 -33 -19 -50 -30
-16 -11 -39 -24 -50 -30 -11 -6 -42 -23 -70 -39 l-50 -28 -3 -173 c-2 -122 1
-177 9 -187 7 -8 35 -25 63 -39 28 -14 65 -34 81 -44 17 -11 39 -24 50 -30 38
-20 63 -36 79 -49 17 -14 24 -12 71 19 17 11 39 24 50 30 11 6 34 19 50 29 17
11 50 30 75 42 87 43 80 1 80 465 l0 412 -27 11 c-29 12 -40 18 -110 64 -74
47 -76 44 -69 -85z m84 -390 c12 -15 9 -87 -4 -111 -8 -14 -13 -13 -42 9 -39
31 -41 61 -5 91 30 26 37 28 51 11z m-128 -159 l51 -31 -3 -66 c-3 -61 -5 -67
-33 -84 -64 -38 -75 -40 -114 -17 -66 40 -71 48 -71 105 0 47 3 55 29 73 16
12 33 21 39 21 5 0 15 7 22 15 17 21 22 19 80 -16z"/>
<path d="M5350 1668 c-71 -20 -89 -30 -120 -69 -38 -48 -35 -60 29 -134 58
-66 70 -112 75 -272 l2 -112 38 -45 c41 -50 68 -62 122 -52 l35 7 -6 -45 c-13
-86 58 -152 151 -139 38 5 58 16 107 60 33 29 63 53 68 53 4 0 30 -22 57 -49
34 -34 61 -52 86 -56 33 -7 39 -4 78 37 61 63 138 120 155 113 8 -3 28 6 45
20 36 31 72 32 118 3 28 -17 51 -22 115 -22 44 -1 94 3 110 8 33 10 74 10 185
1 66 -6 83 -4 145 19 l69 27 56 -22 c30 -12 60 -26 67 -31 7 -5 14 -4 18 2 4
7 19 10 33 7 14 -3 49 1 76 8 28 7 66 12 84 12 21 0 45 10 71 31 22 18 43 32
47 32 3 0 26 -21 50 -47 63 -68 71 -79 78 -101 7 -21 80 -92 94 -92 16 0 94
73 103 97 5 13 21 28 36 35 16 6 42 16 58 23 17 7 54 21 82 31 53 19 53 19 95
-3 38 -20 65 -23 120 -14 3 1 20 13 37 27 38 32 39 58 6 124 -35 70 -34 138 5
210 17 30 30 61 30 68 0 17 -63 96 -110 139 -41 38 -64 40 -125 12 -49 -23
-61 -34 -45 -44 17 -10 11 -25 -10 -25 -10 0 -23 7 -28 16 -8 14 -14 15 -42 5
-18 -6 -75 -11 -126 -11 -83 0 -93 2 -87 17 5 12 2 15 -10 10 -12 -5 -17 -1
-17 13 0 26 -57 80 -85 80 -27 0 -95 -54 -95 -76 0 -26 -70 -46 -155 -43 -177
4 -188 3 -237 -24 -26 -14 -59 -35 -74 -46 -29 -22 -60 -27 -84 -11 -19 12 -2
43 25 48 25 5 64 53 65 79 0 38 -61 89 -115 96 -111 16 -127 12 -213 -54 -78
-58 -82 -60 -153 -64 -52 -3 -89 -13 -135 -34 -67 -32 -82 -30 -161 12 -33 17
-109 17 -303 0 -76 -7 -90 -12 -128 -42 -39 -32 -44 -33 -67 -21 -30 16 -40
42 -25 70 23 43 -56 127 -142 148 -56 14 -179 14 -228 0z m303 -87 c4 -1 7
-12 7 -26 0 -34 -31 -48 -93 -40 -29 3 -57 2 -62 -2 -7 -5 -8 -85 -4 -228 3
-134 2 -225 -4 -232 -11 -16 -63 -17 -72 -3 -5 9 -7 363 -2 440 2 25 1 25 -78
25 -76 0 -80 1 -83 23 -7 48 -5 48 194 46 104 -1 192 -2 197 -3z m1317 -10
c16 -30 12 -49 -11 -56 -13 -4 -27 -1 -38 9 -23 21 -94 21 -125 1 -39 -25 -51
-67 -31 -104 9 -18 27 -37 40 -43 14 -6 25 -15 25 -19 0 -4 12 -10 26 -13 14
-4 48 -29 74 -55 86 -86 78 -178 -21 -239 -73 -44 -208 -18 -209 40 0 31 15
44 34 29 18 -15 97 -25 139 -17 36 7 57 36 57 81 0 23 -44 85 -60 85 -5 0 -35
18 -68 40 -74 49 -102 91 -102 154 0 42 4 51 42 86 l41 40 88 0 c77 0 90 -2
99 -19z m645 -21 c0 -33 -2 -35 -36 -38 -32 -3 -37 0 -43 22 -10 42 2 57 43
54 34 -3 36 -5 36 -38z m502 -55 l-5 -54 51 -3 c45 -3 52 -6 55 -25 3 -21 0
-23 -47 -23 -27 0 -52 -3 -54 -7 -2 -5 -1 -69 2 -143 l6 -135 45 0 c39 0 45
-3 48 -23 5 -34 -15 -52 -57 -52 -43 0 -75 20 -97 61 -12 25 -14 53 -8 165 l7
134 -25 0 c-28 0 -53 23 -43 40 3 5 20 10 36 10 29 0 30 1 24 34 -10 53 1 76
37 76 l31 0 -6 -55z m-864 -48 c46 -17 59 -29 52 -49 -5 -12 -20 -14 -78 -11
-59 3 -76 0 -92 -14 -43 -38 -55 -70 -55 -140 1 -57 5 -73 25 -98 24 -29 27
-30 112 -30 101 0 117 -14 60 -52 -40 -28 -127 -32 -147 -8 -7 8 -18 15 -26
15 -24 0 -67 69 -81 130 -12 53 -12 67 2 114 25 84 80 130 185 155 3 0 22 -5
43 -12z m269 -20 c11 -18 -12 -37 -46 -37 -38 0 -69 -29 -81 -75 -5 -16 -9
-83 -10 -148 -1 -90 -5 -121 -15 -127 -35 -22 -41 6 -38 204 3 175 4 191 21
194 12 3 20 -4 24 -17 7 -26 15 -27 30 -2 19 31 97 36 115 8z m408 -6 c46 -32
68 -88 69 -173 1 -42 -3 -80 -9 -83 -5 -3 -10 -13 -10 -22 0 -8 -12 -29 -26
-47 -63 -74 -133 -86 -204 -35 l-43 31 5 -101 c5 -105 -3 -131 -37 -117 -13 5
-15 42 -13 283 3 268 4 278 23 278 12 0 21 -9 25 -23 l5 -23 24 22 c43 40 140
45 191 10z m-2266 -16 c5 -16 12 -39 16 -50 13 -34 37 -108 49 -152 6 -23 16
-45 22 -49 15 -9 29 14 29 47 0 14 4 29 9 35 4 5 20 47 35 94 31 96 40 110 72
110 43 0 42 -10 -12 -137 -8 -17 -14 -37 -14 -45 0 -8 -4 -18 -8 -23 -4 -6
-18 -37 -31 -70 -13 -33 -29 -74 -37 -92 -8 -17 -14 -36 -14 -41 0 -18 -49
-105 -71 -125 -41 -38 -139 -40 -139 -3 0 34 13 46 50 46 41 0 45 4 81 68 25
47 27 37 -27 145 -8 16 -14 33 -14 39 0 5 -6 24 -14 41 -8 18 -24 59 -37 92
-13 33 -28 66 -33 73 -13 18 11 33 49 30 23 -2 32 -9 39 -33z m350 29 c9 -3
16 -15 16 -26 0 -19 2 -19 34 6 29 21 45 26 95 26 53 0 65 -4 94 -30 38 -33
57 -85 57 -156 0 -129 -64 -214 -161 -214 -36 0 -84 21 -100 44 -18 24 -24
-11 -17 -96 4 -51 3 -97 -1 -101 -5 -5 -23 -7 -41 -5 l-33 3 2 270 c3 290 4
299 55 279z m608 -24 c38 -38 58 -88 58 -142 l0 -49 -131 2 c-71 0 -133 -1
-136 -4 -10 -10 8 -47 38 -77 26 -26 38 -30 84 -30 34 0 57 5 65 15 14 17 46
20 55 4 4 -5 4 -21 1 -35 -14 -53 -147 -73 -221 -31 -113 63 -114 283 -1 357
46 31 154 25 188 -10z m976 -150 c3 -203 0 -223 -31 -218 -22 3 -22 6 -25 168
-4 201 1 232 31 228 22 -3 22 -6 25 -178z m-370 -28 c3 -16 -1 -20 -12 -16
-19 7 -22 48 -3 42 6 -3 13 -14 15 -26z"/>
<path d="M7763 1371 c-48 -40 -68 -148 -38 -208 29 -58 75 -80 136 -63 57 17
74 51 74 152 0 78 -2 89 -24 112 -20 21 -33 26 -75 26 -34 -1 -58 -7 -73 -19z"/>
<path d="M6094 1366 c-40 -18 -64 -66 -64 -127 0 -85 38 -131 107 -131 56 0
93 44 100 118 11 122 -49 181 -143 140z"/>
<path d="M6480 1369 c-30 -12 -59 -47 -60 -71 0 -16 11 -18 89 -18 53 0 93 4
96 11 11 17 -17 70 -42 80 -30 11 -51 11 -83 -2z"/>
<path d="M1625 1609 c-16 -10 -39 -23 -50 -29 -11 -6 -33 -19 -50 -30 -16 -11
-53 -31 -81 -45 -29 -14 -57 -32 -63 -39 -17 -20 -19 -458 -3 -464 7 -2 25 4
40 14 36 25 64 42 82 50 8 4 28 16 44 27 l29 20 -7 106 c-5 88 -3 110 10 129
8 12 21 22 28 22 8 0 19 7 26 15 7 8 25 15 40 15 15 0 33 -7 40 -15 7 -8 18
-15 26 -15 7 0 20 -10 28 -22 13 -19 15 -41 10 -129 l-7 -106 29 -20 c16 -11
36 -23 44 -26 8 -4 29 -16 45 -27 52 -35 75 -44 83 -34 4 5 5 110 2 234 l-5
225 -40 22 c-22 12 -49 27 -60 33 -11 6 -33 19 -50 30 -16 11 -39 24 -50 30
-11 6 -33 19 -50 29 -16 11 -37 20 -45 20 -8 0 -28 -9 -45 -20z"/>
<path d="M3879 1612 c-15 -9 -53 -33 -85 -52 -33 -19 -68 -40 -79 -47 -11 -7
-27 -15 -35 -19 -8 -4 -26 -15 -40 -25 l-25 -17 1 -173 c1 -96 2 -177 3 -180
1 -4 30 -22 66 -40 71 -37 94 -50 140 -79 80 -51 82 -52 119 -33 75 39 122 61
139 66 21 8 24 57 2 57 -17 0 -243 117 -271 141 -9 7 -14 33 -14 68 0 44 4 60
20 74 11 9 24 17 29 17 4 0 20 9 34 21 l27 20 44 -26 c61 -36 69 -48 62 -92
-9 -56 2 -67 44 -43 19 10 44 23 55 29 99 54 100 55 103 119 l3 60 -43 22
c-54 27 -121 65 -173 99 -34 22 -94 53 -99 50 0 0 -13 -8 -27 -17z"/>
<path d="M2368 1601 c-13 -11 -42 -29 -63 -41 -22 -12 -53 -30 -70 -40 -16
-10 -49 -28 -72 -40 -23 -12 -43 -28 -45 -37 -2 -9 -1 -90 2 -182 l5 -166 40
-22 c22 -12 49 -27 60 -33 11 -6 34 -19 50 -30 17 -11 37 -23 45 -27 8 -3 29
-17 46 -30 17 -13 35 -23 41 -23 11 0 52 21 98 50 17 11 44 26 60 34 17 8 57
30 90 49 l60 35 3 178 2 179 -37 20 c-21 11 -75 42 -121 70 -118 71 -125 75
-148 75 -12 0 -32 -9 -46 -19z m69 -93 c15 -7 49 -29 74 -50 25 -21 51 -38 58
-38 23 0 71 -34 71 -50 0 -8 -9 -29 -19 -46 -14 -22 -19 -51 -20 -94 0 -68
-15 -99 -59 -127 -15 -9 -50 -31 -79 -50 -28 -18 -56 -33 -61 -33 -10 0 -62
55 -78 85 -7 11 -31 56 -54 100 -22 44 -45 87 -49 95 -5 8 -13 29 -18 46 -10
30 -8 34 33 68 23 20 45 36 47 36 3 0 31 16 63 35 67 41 56 38 91 23z"/>
<path d="M3888 1316 c-26 -19 -23 -62 6 -81 28 -19 49 -12 66 21 12 21 11 27
-10 49 -26 28 -37 30 -62 11z"/>
</g>
</svg>
