<?xml version="1.0" standalone="no"?>
<!DOCTYPE svg PUBLIC "-//W3C//DTD SVG 20010904//EN"
 "http://www.w3.org/TR/2001/REC-SVG-20010904/DTD/svg10.dtd">
<svg version="1.0" xmlns="http://www.w3.org/2000/svg"
 width="300.000000pt" height="300.000000pt" viewBox="0 0 300.000000 300.000000"
 preserveAspectRatio="xMidYMid meet">
<metadata>
Created by potrace 1.10, written by Peter Selinger 2001-2011
</metadata>
<g transform="translate(0.000000,300.000000) scale(0.100000,-0.100000)"
fill="#000000" stroke="none">
<path d="M1430 2251 c-106 -23 -107 -24 -772 -688 -350 -350 -642 -649 -649
-665 -23 -56 16 -134 79 -153 62 -18 61 -19 722 641 l636 634 54 0 54 0 636
-634 c661 -660 660 -659 722 -641 63 19 102 97 79 153 -7 16 -299 315 -649
665 -566 565 -643 639 -694 661 -62 27 -161 40 -218 27z"/>
</g>
</svg>
