<?xml version="1.0" standalone="no"?>
<!DOCTYPE svg PUBLIC "-//W3C//DTD SVG 20010904//EN"
 "http://www.w3.org/TR/2001/REC-SVG-20010904/DTD/svg10.dtd">
<svg version="1.0" xmlns="http://www.w3.org/2000/svg"
 width="300.000000pt" height="300.000000pt" viewBox="0 0 300.000000 300.000000"
 preserveAspectRatio="xMidYMid meet">
<metadata>
Created by potrace 1.10, written by Peter Selinger 2001-2011
</metadata>
<g transform="translate(0.000000,300.000000) scale(0.100000,-0.100000)"
fill="#3c3a5a" stroke="none">
<path d="M256 2987 c-26 -19 -24 -67 4 -89 29 -23 45 -23 70 2 53 53 -14 131
-74 87z"/>
<path d="M259 2721 c-23 -18 -24 -27 -27 -140 l-4 -121 -97 0 c-82 0 -101 -3
-114 -18 -21 -23 -22 -52 -3 -78 12 -16 29 -20 115 -22 l101 -4 0 -114 0 -114
-43 0 c-55 0 -87 -22 -87 -60 0 -38 32 -60 87 -60 l43 0 0 -115 0 -115 -43 0
c-54 0 -87 -22 -87 -59 0 -40 28 -61 83 -61 l47 0 0 -114 0 -114 -101 -4
c-108 -3 -129 -14 -129 -63 0 -43 29 -55 133 -55 l97 0 0 -120 0 -120 -49 0
c-55 0 -81 -17 -81 -55 0 -38 26 -55 81 -55 l49 0 0 -120 0 -120 -49 0 c-55 0
-81 -17 -81 -55 0 -38 26 -55 81 -55 l49 0 0 -120 0 -120 -98 0 c-83 0 -102
-3 -115 -18 -21 -23 -22 -52 -3 -78 12 -16 29 -20 114 -22 l100 -4 4 -100 c3
-107 14 -128 63 -128 43 0 55 29 55 133 l0 97 120 0 120 0 0 -49 c0 -55 17
-81 55 -81 38 0 55 26 55 81 l0 49 120 0 120 0 0 -49 c0 -71 37 -100 91 -71
15 9 19 22 19 65 l0 55 120 0 120 0 0 -98 c0 -83 3 -102 18 -115 23 -21 52
-22 78 -3 16 12 20 29 22 115 l4 101 114 0 114 0 0 -43 c0 -55 22 -87 60 -87
38 0 60 32 60 87 l0 43 115 0 115 0 0 -43 c0 -55 22 -87 60 -87 38 0 60 32 60
87 l0 43 114 0 114 0 4 -101 c3 -108 14 -129 63 -129 43 0 55 29 55 133 l0 96
256 3 c240 3 257 4 270 22 19 27 18 60 -4 79 -17 16 -123 17 -1325 17 l-1307
0 0 1173 c0 923 -3 1177 -12 1189 -21 27 -53 30 -79 9z"/>
<path d="M1644 2630 c-69 -16 -131 -70 -160 -139 -31 -73 -10 -199 40 -240 9
-8 16 -19 16 -25 0 -6 -51 -112 -112 -235 -106 -211 -115 -225 -146 -233 -43
-11 -60 -46 -42 -87 12 -29 7 -41 -90 -236 l-102 -205 -41 0 c-118 0 -208 -69
-238 -182 -10 -37 -10 -57 0 -104 11 -48 22 -66 65 -109 41 -41 63 -55 105
-65 153 -36 291 75 291 234 0 43 -38 134 -65 156 -12 10 5 51 103 246 97 194
120 234 138 234 42 0 72 68 43 97 -7 7 20 72 95 222 l106 211 50 0 50 0 105
-210 c102 -203 105 -211 89 -234 -24 -37 5 -85 51 -86 16 0 43 -45 136 -233
l117 -232 -29 -35 c-86 -103 -54 -271 65 -345 42 -26 59 -30 115 -30 137 1
234 96 235 230 0 74 -25 128 -86 179 -46 40 -91 56 -155 56 l-43 0 -104 208
c-94 187 -103 210 -90 227 8 10 14 27 14 37 0 25 -35 58 -63 58 -19 0 -38 31
-135 225 -61 124 -112 231 -112 239 0 7 7 20 17 27 29 24 53 91 53 150 0 106
-65 194 -166 225 -51 15 -72 16 -120 4z m128 -137 c56 -50 56 -142 -1 -182
-39 -28 -109 -28 -144 -1 -31 25 -51 80 -42 119 6 28 46 73 75 84 26 11 91 -1
112 -20z m-696 -1417 c29 -29 34 -41 34 -80 0 -119 -161 -160 -216 -54 -40 78
14 168 102 168 39 0 51 -5 80 -34z m1384 19 c79 -41 77 -160 -2 -201 -78 -40
-168 14 -168 102 0 39 5 51 34 80 39 39 86 45 136 19z"/>
<path d="M552 1744 c-27 -19 -29 -64 -4 -87 14 -13 38 -17 93 -17 88 0 119 16
119 60 0 44 -31 60 -115 60 -48 0 -78 -5 -93 -16z"/>
<path d="M900 1740 c-11 -11 -20 -31 -20 -44 0 -40 34 -56 121 -56 84 0 109
14 109 63 0 41 -33 57 -117 57 -60 0 -77 -4 -93 -20z"/>
<path d="M1600 1740 c-11 -11 -20 -29 -20 -40 0 -43 34 -60 118 -60 83 0 105
9 117 47 4 17 -1 29 -19 48 -22 22 -33 25 -101 25 -62 0 -79 -4 -95 -20z"/>
<path d="M2312 1744 c-27 -19 -29 -64 -4 -87 29 -26 165 -24 192 3 11 11 20
29 20 40 0 42 -34 60 -113 60 -49 0 -80 -5 -95 -16z"/>
<path d="M2662 1744 c-27 -19 -29 -64 -4 -87 25 -23 158 -24 190 -1 28 19 29
57 2 84 -16 16 -33 20 -93 20 -49 0 -80 -5 -95 -16z"/>
</g>
</svg>
