<?xml version="1.0" standalone="no"?>
<!DOCTYPE svg PUBLIC "-//W3C//DTD SVG 20010904//EN"
 "http://www.w3.org/TR/2001/REC-SVG-20010904/DTD/svg10.dtd">
<svg version="1.0" xmlns="http://www.w3.org/2000/svg"
 width="300.000000pt" height="300.000000pt" viewBox="0 0 300.000000 300.000000"
 preserveAspectRatio="xMidYMid meet">
<metadata>
Created by potrace 1.10, written by Peter Selinger 2001-2011
</metadata>
<g transform="translate(0.000000,300.000000) scale(0.100000,-0.100000)"
fill="#3c3a5a" stroke="none">
<path d="M1810 2985 c-200 -40 -322 -128 -435 -313 -1 -1 -28 4 -61 13 -73 19
-198 19 -289 0 -225 -47 -412 -234 -459 -459 -7 -37 -16 -69 -19 -72 -3 -3
-36 -12 -74 -20 -220 -45 -412 -237 -458 -459 -43 -204 15 -396 165 -545 79
-79 142 -119 244 -154 60 -20 78 -20 996 -24 1063 -3 1024 -6 1190 75 80 39
109 60 182 133 72 73 94 102 131 181 102 209 102 409 0 618 -60 125 -177 247
-298 309 l-81 41 4 68 c15 279 -195 550 -473 608 -84 18 -177 18 -265 0z"/>
<path d="M668 883 c-32 -37 -99 -184 -93 -204 8 -25 44 -40 68 -27 18 9 107
177 107 201 0 18 -32 47 -52 47 -8 0 -22 -8 -30 -17z"/>
<path d="M967 883 c-29 -33 -98 -189 -91 -207 9 -23 44 -36 67 -24 18 9 107
177 107 201 0 18 -32 47 -52 47 -8 0 -22 -8 -31 -17z"/>
<path d="M1273 892 c-22 -14 -104 -197 -97 -216 9 -23 44 -36 67 -24 18 9 107
177 107 201 0 31 -50 57 -77 39z"/>
<path d="M1568 883 c-32 -37 -99 -184 -93 -204 8 -25 44 -40 68 -27 18 9 107
177 107 201 0 18 -32 47 -52 47 -8 0 -22 -8 -30 -17z"/>
<path d="M1868 883 c-32 -37 -99 -184 -93 -204 8 -25 44 -40 68 -27 18 9 107
177 107 201 0 18 -32 47 -52 47 -8 0 -22 -8 -30 -17z"/>
<path d="M2168 883 c-32 -37 -99 -184 -93 -204 8 -25 44 -40 68 -27 18 9 107
177 107 201 0 18 -32 47 -52 47 -8 0 -22 -8 -30 -17z"/>
<path d="M2467 883 c-29 -33 -98 -189 -91 -207 9 -23 44 -36 67 -24 18 9 107
177 107 201 0 18 -32 47 -52 47 -8 0 -22 -8 -31 -17z"/>
<path d="M508 563 c-34 -39 -100 -185 -94 -209 8 -29 49 -42 72 -23 19 15 104
182 104 203 0 20 -28 46 -49 46 -10 0 -25 -8 -33 -17z"/>
<path d="M808 563 c-34 -39 -100 -185 -94 -209 8 -29 49 -42 72 -23 19 15 104
182 104 203 0 20 -28 46 -49 46 -10 0 -25 -8 -33 -17z"/>
<path d="M1108 563 c-34 -39 -100 -185 -94 -209 8 -29 49 -42 72 -23 19 15
104 182 104 203 0 20 -28 46 -49 46 -10 0 -25 -8 -33 -17z"/>
<path d="M1403 557 c-10 -13 -36 -61 -58 -106 -41 -85 -41 -100 -2 -125 28
-18 48 3 99 100 52 97 56 115 32 138 -22 23 -50 20 -71 -7z"/>
<path d="M1708 563 c-34 -39 -100 -185 -94 -209 8 -29 49 -42 72 -23 19 15
104 182 104 203 0 20 -28 46 -49 46 -10 0 -25 -8 -33 -17z"/>
<path d="M2008 563 c-34 -39 -100 -185 -94 -209 8 -29 49 -42 72 -23 19 15
104 182 104 203 0 20 -28 46 -49 46 -10 0 -25 -8 -33 -17z"/>
<path d="M2308 563 c-34 -39 -100 -185 -94 -209 8 -29 49 -42 72 -23 19 15
104 182 104 203 0 20 -28 46 -49 46 -10 0 -25 -8 -33 -17z"/>
<path d="M336 228 c-8 -13 -31 -58 -52 -101 -40 -81 -40 -96 -1 -121 28 -18
49 4 101 106 41 81 46 99 37 117 -16 29 -66 29 -85 -1z"/>
<path d="M636 228 c-8 -13 -31 -58 -52 -101 -40 -81 -40 -96 -1 -121 28 -18
48 3 101 103 41 80 47 97 37 117 -14 32 -65 33 -85 2z"/>
<path d="M936 228 c-8 -13 -31 -58 -52 -101 -40 -81 -40 -96 -1 -121 28 -18
49 4 101 106 41 81 46 99 37 117 -16 29 -66 29 -85 -1z"/>
<path d="M1236 228 c-8 -13 -31 -58 -52 -101 -40 -81 -40 -96 -1 -121 28 -18
48 3 101 103 41 80 47 97 37 117 -14 32 -65 33 -85 2z"/>
<path d="M1536 228 c-8 -13 -31 -58 -52 -101 -40 -81 -40 -96 -1 -121 28 -18
48 3 101 103 41 80 47 97 37 117 -14 32 -65 33 -85 2z"/>
<path d="M1836 228 c-8 -13 -31 -58 -52 -101 -40 -81 -40 -96 -1 -121 28 -18
49 4 101 106 41 81 46 99 37 117 -16 29 -66 29 -85 -1z"/>
<path d="M2136 228 c-8 -13 -31 -58 -52 -101 -40 -81 -40 -96 -1 -121 28 -18
48 3 101 103 41 80 47 97 37 117 -14 32 -65 33 -85 2z"/>
</g>
</svg>
