,x,y
0,24.0,41.54945196
1,50.0,67.46446305
2,15.0,37.218656339999995
3,38.0,56.58639803
4,87.0,107.28898389
5,36.0,52.46387493
6,12.0,30.78089683
7,81.0,100.76339859999999
8,25.0,44.61215147
9,5.0,26.963319071
10,16.0,31.23757338
11,16.0,33.53290206
12,24.0,44.60323899
13,39.0,59.40049976
14,54.0,68.43753838
15,60.0,81.69900319
16,26.0,46.928324180000004
17,73.0,90.40520550000002
18,29.0,49.34092408
19,31.0,45.30895192
20,68.0,89.02934339
21,87.0,104.99484703
22,58.0,77.04310305
23,54.0,70.5921991
24,84.0,103.02772202
25,58.0,77.05752706
26,49.0,67.95883341
27,20.0,44.34226432
28,90.0,114.68488281
29,48.0,68.03970695999999
30,4.0,27.08132338
31,25.0,41.992399070000005
32,42.0,62.33151664
33,0.0,20.329089443
34,60.0,81.92303698
35,93.0,111.17716423
36,39.0,59.45358014
37,7.0,25.996069607000003
38,21.0,42.59015942
39,68.0,81.18044413999999
40,84.0,105.02778957
41,0.0,18.71368911
42,58.0,81.94273962
43,19.0,41.960333469999995
44,36.0,53.66194193
45,19.0,37.60946242
46,59.0,78.5630564
47,51.0,72.82390762
48,19.0,42.136348100000006
49,33.0,55.07467353
50,85.0,106.18822311
51,44.0,62.63227697
52,5.0,24.09817744
53,59.0,81.2229864
54,14.0,37.70677576
55,9.0,31.85312574
56,75.0,100.23051695
57,69.0,82.64931741000001
58,10.0,29.616859804
59,17.0,40.02797699
60,58.0,81.7510743
61,74.0,91.61010303
62,21.0,43.77154623
63,51.0,71.90142035
64,19.0,42.66073682
65,50.0,70.02897927000001
66,24.0,46.687943680000004
67,0.0,20.376911899
68,12.0,26.806419002
69,75.0,97.33986001
70,21.0,48.90260209
71,64.0,86.7346608
72,5.0,20.707510638
73,58.0,77.07748383
74,32.0,48.414531960000005
75,41.0,64.46272123
76,7.0,27.459605998
77,4.0,22.316708112
78,5.0,24.928546187000002
79,49.0,72.50336074
80,90.0,111.19109623
81,3.0,28.489164326
82,11.0,26.963371967
83,32.0,51.97989959
84,83.0,101.42812049999998
85,25.0,42.62365422
86,83.0,98.52505087
87,26.0,45.80714057
88,76.0,93.51081775
89,95.0,111.775467
90,53.0,69.21863515999999
91,77.0,100.50445387
92,42.0,70.05636123
93,25.0,45.46292549
94,54.0,75.32164264
95,55.0,79.1244888
96,0.0,21.100686692
97,73.0,91.98020786
98,35.0,50.13666408
99,86.0,103.88427405
100,90.0,109.91004752
101,13.0,28.335654576
102,46.0,67.88388961
103,46.0,65.00397413
104,32.0,51.15664574
105,8.0,29.190375682000003
106,71.0,94.83135003
107,28.0,50.231776069999995
108,24.0,44.21914027
109,56.0,77.87219151
110,49.0,70.61728392
111,79.0,98.67470043
112,90.0,106.236707
113,89.0,109.10409255
114,41.0,63.26595082
115,27.0,46.68273277
116,58.0,79.46383041
117,26.0,48.90055826
118,31.0,51.300416
119,70.0,91.1433266
120,71.0,88.47392059999999
121,39.0,59.98238856
122,7.0,24.075776144
123,48.0,67.85817542000001
124,56.0,71.20390216999999
125,45.0,63.9367213
126,41.0,58.13626679
127,3.0,23.574661632
128,37.0,56.413995799999995
129,24.0,42.219085230000005
130,68.0,83.53125720000001
131,47.0,69.86702787
132,27.0,41.531400090000005
133,68.0,84.05710234
134,74.0,90.77549842
135,95.0,112.15749762
136,79.0,101.22259156
137,21.0,45.10114067
138,95.0,114.08853397
139,54.0,73.25166165
140,56.0,79.16236621
141,80.0,95.24148428
142,26.0,48.22325833
143,25.0,45.33323728
144,8.0,26.364615703
145,95.0,115.46092159999999
146,94.0,108.64183756
147,54.0,78.70318693
148,7.0,26.815491279
149,99.0,119.40394676
150,36.0,52.77049249
151,48.0,67.0586788
152,65.0,80.53321778
153,42.0,60.30929858
154,93.0,109.42222685
155,86.0,106.82132066
156,26.0,46.11697543
157,51.0,73.26657596
158,94.0,115.78441027
159,6.0,26.047286687
160,24.0,44.47387908
161,75.0,95.96844763
162,7.0,23.829381009
163,53.0,72.51703683
164,73.0,92.80457527
165,16.0,34.10999096
166,80.0,100.86087062
167,77.0,97.01988215
168,89.0,106.26972444
169,80.0,97.13735466
170,55.0,71.47649476000001
171,19.0,37.34557531
172,56.0,77.72853572
173,47.0,64.15029394
174,56.0,79.24362743
175,2.0,18.946724389
176,82.0,106.79002254
177,57.0,80.14031858
178,44.0,64.04222057999999
179,26.0,44.5227488
180,52.0,72.95305521
181,41.0,63.16133498
182,44.0,65.67562576
183,3.0,17.169250499
184,31.0,49.19693178
185,97.0,116.49812401
186,21.0,42.5453232
187,17.0,40.10741433
188,7.0,24.035430253
189,61.0,81.14568518
190,10.0,33.97163653
191,52.0,75.34529893
192,10.0,32.18441166
193,65.0,84.00077658
194,71.0,90.3188322
195,4.0,19.063104953
196,24.0,38.91422276
197,26.0,43.87590331
198,51.0,67.5775361
199,42.0,63.2736092
200,62.0,86.48278755
201,74.0,95.72605529
202,77.0,100.59643338
203,3.0,17.764120148
204,50.0,67.04654956
205,24.0,41.59635575
206,37.0,52.87558963
207,58.0,77.95782956
208,52.0,72.24760026999999
209,27.0,44.582869020000004
210,14.0,32.12573805
211,72.0,94.04682658
212,5.0,21.611947467
213,71.0,90.36836307
214,54.0,72.26831734999999
215,84.0,103.1286166
216,42.0,63.64765048
217,54.0,69.44785426
218,74.0,92.6356699
219,54.0,72.78130641
220,53.0,77.11195136
221,78.0,99.10506290000002
222,97.0,121.6228548
223,49.0,73.5825402
224,71.0,88.92139297
225,48.0,66.96669610000001
226,51.0,71.02642868000001
227,89.0,105.52073551
228,99.0,119.51685756
229,93.0,114.63911256
230,49.0,66.78357742
231,18.0,41.21321959
232,65.0,78.37266004
233,83.0,107.22059677
234,41.0,63.88314335
235,52.0,73.06655757
236,29.0,46.334647849999996
237,97.0,118.52008934
238,7.0,29.400497579
239,51.0,72.94026699
240,58.0,73.83020877
241,50.0,65.94511142
242,67.0,85.0132736
243,89.0,106.5069584
244,76.0,95.63280796
245,35.0,56.78035027
246,99.0,120.5328916
247,31.0,49.04466136
248,52.0,71.70352433
249,11.0,29.199954718
250,66.0,91.70015848
251,50.0,69.82634062
252,39.0,57.49971096
253,60.0,73.65084683
254,35.0,53.92561965
255,53.0,69.92639685
256,14.0,28.148154262
257,49.0,69.72359037
258,16.0,36.167127570000005
259,76.0,95.30033002
260,13.0,29.577368567999997
261,51.0,68.38088357000001
262,70.0,92.95331671
263,98.0,112.59573853
264,86.0,108.85523586
265,46.0,65.09439571
266,51.0,66.94362684000001
267,50.0,68.33449605
268,91.0,114.92329574
269,48.0,67.78165247999999
270,81.0,101.28960746
271,38.0,57.83155021
272,40.0,59.69185252
273,79.0,96.92664854
274,96.0,108.02990531
275,60.0,76.99178872
276,70.0,92.58929383
277,44.0,64.98103442
278,11.0,31.99017641
279,6.0,21.919513328
280,5.0,21.628826073
281,72.0,86.27746655
282,55.0,77.53887255000001
283,95.0,114.70291077
284,41.0,61.21469904
285,25.0,45.04169243
286,1.0,23.778209914
287,55.0,70.50711779
288,4.0,29.682408486
289,48.0,68.88147608
290,55.0,74.40348599000001
291,75.0,91.70233156
292,68.0,89.35848388
293,25.0,46.03323718
294,75.0,95.48910307
295,34.0,56.59623056
296,38.0,60.95102191
297,92.0,106.78316267
298,21.0,35.507011840000004
299,88.0,105.86077871
300,75.0,99.20610113
301,76.0,100.80643766
302,44.0,68.59717283
303,10.0,33.93415049
304,21.0,47.3051179
305,16.0,34.002262970000004
306,32.0,53.67416
307,13.0,33.11612884
308,26.0,44.76649193
309,70.0,93.68477876
310,77.0,97.53149541
311,77.0,96.24503196
312,88.0,108.0578931
313,35.0,55.02445799
314,24.0,41.658577390000005
315,17.0,37.336815619999996
316,91.0,114.36778957
317,32.0,53.43396307
318,36.0,52.52179399
319,89.0,110.57741298
320,69.0,91.25634126
321,30.0,51.23212856
322,6.0,25.398840061
323,22.0,38.562413910000004
324,67.0,91.97121038
325,9.0,25.225759566
326,74.0,93.5964342
327,50.0,69.76948983
328,85.0,102.69087513
329,3.0,21.652309089
330,0.0,16.163347856
331,59.0,82.03811556
332,62.0,81.26514581
333,17.0,33.24991628
334,90.0,108.61672694
335,23.0,41.136555279999996
336,19.0,43.85017475
337,93.0,112.01203405
338,14.0,30.26712261
339,58.0,74.14681616
340,87.0,107.00645713
341,37.0,57.69447352
342,20.0,39.62278654
343,35.0,54.78561007
344,63.0,82.03190982999999
345,56.0,72.67003801
346,62.0,78.09031476
347,98.0,117.19448821
348,90.0,110.50155298
349,51.0,70.5123462
350,93.0,114.45211871
351,22.0,41.10794636
352,38.0,57.36298431
353,13.0,30.28574844
354,98.0,116.04932416
355,99.0,120.0953697
356,31.0,50.6063167
357,94.0,116.19000542
358,73.0,91.30828034
359,37.0,54.59311043
360,23.0,39.02332876
361,11.0,30.766696879999998
362,88.0,110.5799868
363,47.0,68.71787678999999
364,79.0,98.74139764
365,91.0,105.23492274
366,71.0,91.65789964
367,10.0,28.938990554
368,39.0,59.89606046
369,92.0,111.85091116
370,99.0,119.11200375
371,28.0,46.22196486
372,32.0,53.21584226
373,32.0,55.72392691
374,75.0,96.88604495
375,99.0,119.30874567
376,27.0,45.77161074
377,64.0,87.85169407
378,98.0,118.50371084
379,38.0,51.11331895
380,46.0,65.51171028
381,13.0,32.65537808
382,96.0,115.56065366
383,9.0,29.526431641000002
384,34.0,56.10893209
385,49.0,66.43628318
386,1.0,16.16001888
387,50.0,68.97302037
388,94.0,113.25305499
389,27.0,43.47650968
390,20.0,37.13551132
391,12.0,34.55896144
392,45.0,61.53992729
393,91.0,111.64730552
394,61.0,86.16652565
395,10.0,29.230857489
396,47.0,67.41377893
397,33.0,54.76441561
398,84.0,106.10796637
399,24.0,41.812679540000005
400,48.0,68.89963951
401,48.0,66.78108638
402,9.0,32.91328547
403,93.0,114.55203143
404,99.0,114.97068753
405,8.0,22.379172481
406,20.0,41.47982988
407,38.0,55.79795462
408,78.0,102.0763803
409,81.0,98.87097714
410,42.0,67.24924250000001
411,95.0,116.18852325
412,78.0,98.38491927
413,44.0,62.94274064
414,68.0,84.43231595
415,87.0,104.21191485
416,58.0,77.3069783
417,52.0,72.52101436000001
418,26.0,45.74402430000001
419,75.0,95.42283401
420,48.0,73.62523007
421,71.0,95.14466308
422,77.0,94.12151511
423,34.0,56.24807243
424,24.0,40.21665898
425,70.0,86.94758118
426,29.0,54.07278254
427,76.0,93.13850045
428,98.0,112.85929155
429,28.0,48.36793808
430,87.0,105.59308727
431,9.0,30.68453755
432,87.0,106.10708624
433,33.0,53.22031418
434,64.0,86.09563422
435,17.0,39.30486546
436,49.0,68.84542083
437,95.0,113.73176312
438,75.0,95.45758614
439,89.0,111.24239226
440,81.0,107.15690853
441,25.0,45.53752833
442,47.0,66.06629477999999
443,50.0,69.65277660999999
444,5.0,27.382244165
445,68.0,91.11189935
446,84.0,103.50570521
447,8.0,28.791139893
448,41.0,53.30638903
449,26.0,46.40362524
450,89.0,111.72960726
451,78.0,102.53030719
452,34.0,56.67762733
453,92.0,106.98450355
454,27.0,52.34784175
455,12.0,36.783539739999995
456,2.0,21.576584383
457,22.0,37.4618141
458,0.0,22.116113029
459,26.0,44.34804332
460,50.0,68.29491198
461,84.0,105.52145453
462,70.0,93.71434779
463,66.0,83.15189497
464,42.0,58.46213684
465,19.0,39.47100788
466,94.0,114.07428225
467,71.0,87.92051286
468,19.0,42.58096241
469,16.0,36.01629889
470,49.0,68.43307886
471,29.0,49.667359899999994
472,29.0,46.65566328
473,86.0,106.28206739
474,50.0,70.82304924
475,86.0,108.57251713
476,30.0,52.59980745
477,23.0,41.02469368
478,20.0,40.72894979
479,16.0,40.38051187
480,57.0,77.25180153
481,8.0,26.967537054
482,8.0,30.240085
483,62.0,84.94841088
484,55.0,75.35893915
485,30.0,51.24365589
486,86.0,110.72048818
487,62.0,78.75012699999999
488,51.0,75.85003198
489,61.0,80.19925869
490,86.0,105.03295412
491,61.0,80.38823085
492,21.0,38.44679787
493,81.0,102.18839247
494,97.0,114.2963344
495,5.0,27.682024586
496,61.0,81.01858089000001
497,47.0,73.60562216
498,98.0,114.47728801
499,30.0,47.9645947
500,63.0,82.55662585
501,0.0,21.406254414
502,18.0,33.84973988
503,30.0,48.99769315
504,98.0,119.04315693
505,16.0,35.56135514
506,22.0,44.63528393
507,55.0,73.98393374
508,43.0,62.91449728
509,75.0,94.29662112
510,91.0,111.17012883
511,46.0,69.42440876
512,85.0,102.47683519
513,55.0,76.15303953
514,36.0,57.17063131
515,49.0,66.36928662
516,94.0,117.02383456
517,43.0,60.83182104
518,22.0,44.08498313
519,37.0,61.14386358
520,24.0,41.97388066
521,95.0,120.740897
522,61.0,81.19971595999999
523,75.0,94.39517002
524,68.0,89.04377173
525,58.0,76.68718792
526,5.0,25.860391715
527,53.0,75.72021355999999
528,80.0,99.22021816
529,83.0,106.30177517
530,25.0,45.26971886
531,34.0,56.33294447
532,26.0,47.65574228
533,90.0,114.79690531
534,60.0,78.67366670999999
535,49.0,76.15934471
536,19.0,38.409193880000004
537,92.0,106.26936988
538,29.0,46.59436195
539,8.0,28.452520159000002
540,57.0,76.18131518
541,29.0,47.65452669
542,19.0,40.87391785
543,81.0,97.83354439
544,50.0,70.01787825
545,15.0,29.290856255999998
546,70.0,95.02847249999998
547,39.0,58.3037698
548,43.0,64.70786405
549,21.0,42.51016575
550,98.0,122.49594520000001
551,86.0,106.76845244
552,16.0,33.89748578
553,25.0,44.818242690000005
554,31.0,53.94224862
555,93.0,112.26970059
556,67.0,88.73365081
557,49.0,67.38516883
558,25.0,52.37576914
559,88.0,107.67388681
560,54.0,74.57648370999999
561,21.0,38.06450222
562,8.0,27.896539841
563,32.0,55.00341078
564,35.0,56.72823317
565,67.0,85.84975426
566,90.0,109.59295492
567,59.0,81.69026202
568,15.0,31.60499315
569,67.0,91.08268029999998
570,42.0,63.71901164
571,44.0,61.57421008
572,77.0,94.25552425
573,68.0,86.28310437
574,36.0,56.62438077
575,11.0,30.32374866
576,10.0,27.156457657
577,65.0,87.88603132
578,98.0,121.10975909999999
579,98.0,118.6132033
580,49.0,70.19083844
581,31.0,47.838962609999996
582,56.0,75.9249564
583,70.0,96.47340872
584,91.0,112.05756378
585,25.0,47.35245439
586,54.0,75.32083476
587,39.0,61.39990349
588,91.0,113.59057024
589,3.0,25.297054029
590,22.0,41.01429422
591,2.0,22.267059451
592,2.0,19.878139498
593,65.0,86.49546208
594,71.0,93.83637687
595,42.0,62.10140878
596,76.0,97.35135732
597,43.0,61.02251779
598,8.0,34.75305272
599,86.0,103.28199022
600,87.0,109.93374342
601,3.0,22.286571686
602,58.0,75.61421297
603,62.0,82.15313408
604,89.0,109.55803528
605,95.0,114.00291863
606,28.0,46.78023848
607,0.0,19.235462374
608,1.0,20.282866003
609,49.0,64.26800515
610,21.0,39.85174138
611,46.0,67.15960005
612,11.0,28.359366572
613,89.0,112.08157084
614,37.0,61.88734051
615,29.0,50.541312899999994
616,44.0,66.87654473
617,96.0,116.35659485
618,16.0,37.917069899999994
619,74.0,91.67949917
620,35.0,52.64997554
621,42.0,59.34482965
622,16.0,37.034019990000004
623,56.0,72.87524074000001
624,18.0,35.85414849
625,54.0,69.30477253000001
626,92.0,109.4749477
627,63.0,83.67348242
628,81.0,103.78410946
629,73.0,93.51136922
630,48.0,66.80297243999999
631,1.0,25.809946802
632,85.0,105.23027975
633,14.0,30.58213964
634,25.0,41.37698317
635,45.0,66.0537745
636,98.0,115.2389253
637,97.0,114.15149206
638,58.0,74.54868046
639,93.0,107.36260449
640,88.0,108.47741598
641,89.0,104.48045678
642,47.0,68.79647071
643,6.0,30.76675683
644,34.0,50.48882921
645,30.0,49.76846185
646,16.0,33.51574749
647,86.0,106.12955884
648,40.0,63.30022747
649,52.0,71.92110232
650,15.0,36.49185287
651,4.0,27.998073432
652,95.0,117.66689567
653,99.0,109.80545367
654,35.0,58.07166567
655,58.0,80.27852322
656,10.0,26.709195759
657,16.0,38.35488924
658,53.0,76.37058203000001
659,58.0,82.80064204
660,42.0,61.25155632
661,24.0,39.42637541
662,84.0,102.88935804
663,64.0,83.61364981
664,12.0,31.29627199
665,61.0,80.02274882
666,75.0,92.60339326
667,15.0,31.87964573
668,43.0,65.12420809
669,13.0,34.81106804
670,48.0,68.09368033999999
671,45.0,62.29145672
672,52.0,72.73389793999999
673,34.0,56.72396986
674,30.0,48.64535198
675,65.0,82.16675273
676,67.0,86.04325304
677,99.0,119.9566225
678,45.0,66.14941984000001
679,87.0,109.13754963
680,73.0,89.71787806
681,9.0,32.317366480000004
682,81.0,98.20296268
683,72.0,91.30995371
684,81.0,101.45544709
685,58.0,78.59500642
686,93.0,114.62509374
687,82.0,108.60376995
688,66.0,83.64868529
689,97.0,114.9752655
