Division,WeightClassKg,Place,Name,Team,BodyweightKg,Best3SquatKg,Best3BenchKg,Best3DeadliftKg,TotalKg,Equipment,Event,Sex
Girls,44.23,1,Ally Highful,Los Fresnos,43.36,115.67,52.16,124.74,292.57,Single-ply,SBD,F
Girls,44.23,2,Daniela Perez,Los Fresnos,43.64,106.59,56.7,115.67,278.96,Single-ply,SBD,F
Girls,44.23,3,Valeria Pérez #2,Weslaco East,44.09,102.06,40.82,90.72,233.6,Single-ply,SBD,F
Girls,44.23,4,Priscila Gara,Brownsville Porter,44,61.23,24.95,65.77,151.95,Single-ply,SBD,F
Girls,47.85,1,Sophie Avila,Los Fresnos,47.49,142.88,61.23,142.88,347,Single-ply,SBD,F
Girls,47.85,2,Perla Hernandez,Brownsville Pace,46.77,122.47,47.63,111.13,281.23,Single-ply,SBD,F
Girls,47.85,3,Alexis Rivas #2,Brownsville Lopez,47.26,108.86,52.16,108.86,269.89,Single-ply,SBD,F
Girls,47.85,4,Alyssa Tovar,Rio Hondo,47.17,88.45,43.09,104.33,235.87,Single-ply,SBD,F
Girls,47.85,5,Noemi Adame,Brownsville Porter,47.31,92.99,31.75,97.52,222.26,Single-ply,SBD,F
Girls,47.85,6,Raven Fernandez,La Feria,47.63,79.38,38.56,102.06,219.99,Single-ply,SBD,F
Girls,47.85,7,Ashley Martinez,Edinburg Idea College Prep,46.27,92.99,40.82,83.91,217.72,Single-ply,SBD,F
Girls,47.85,8,Lupita Gonzalez,Brownsville Porter,46.27,86.18,29.48,68.04,183.7,Single-ply,SBD,F
Girls,47.85,9,Doralee Tarner,Port Isabel,46.27,54.43,31.75,63.5,149.69,Single-ply,SBD,F
Girls,51.94,1,Marie Cavazos,Edinburg Vela,51.71,149.69,63.5,136.08,349.27,Single-ply,SBD,F
Girls,51.94,2,Abril Salinas,Pharr Valley View,51.8,138.35,58.97,133.81,331.12,Single-ply,SBD,F
Girls,51.94,3,Joanna Philo,Los Fresnos,51.48,138.35,58.97,131.54,328.85,Single-ply,SBD,F
Girls,51.94,4,Mandy Sanchez,Los Fresnos,50.8,136.08,58.97,131.54,326.59,Single-ply,SBD,F
Girls,51.94,5,Alexis Torres #2,Los Fresnos,51.75,122.47,65.77,131.54,319.78,Single-ply,SBD,F
Girls,51.94,6,Rebecca Rocha,Rio Hondo,49.44,131.54,63.5,120.2,315.25,Single-ply,SBD,F
Girls,51.94,7,Summer Sosa,Los Fresnos,51.75,124.74,52.16,129.27,306.17,Single-ply,SBD,F
Girls,51.94,8,Juliette Cantu,Edinburg Vela,51.39,113.4,63.5,115.67,292.57,Single-ply,SBD,F
Girls,51.94,9,JoAnn Tello,Raymondville,51.26,111.13,52.16,124.74,288.03,Single-ply,SBD,F
Girls,51.94,10,Alejandra Escandon,Brownsville Hanna,50.8,115.67,52.16,113.4,281.23,Single-ply,SBD,F
Girls,51.94,11,Jaylyn Hernandez,La Feria,51.71,95.25,36.29,102.06,233.6,Single-ply,SBD,F
Girls,51.94,12,Annabell Santacruz,La Feria,51.85,90.72,43.09,99.79,233.6,Single-ply,SBD,F
Girls,51.94,13,Alexandria Canchola,McAllen,51.66,81.65,49.9,95.25,226.8,Single-ply,SBD,F
Girls,51.94,14,Salma Talavera,Mission Veterans Memorial,50.8,72.57,34.02,83.91,190.51,Single-ply,SBD,F
Girls,51.94,15,Hayley Leal,Edcouch-Elsa,50.85,74.84,31.75,74.84,181.44,Single-ply,SBD,F
Girls,51.94,16,Irma Vela,McAllen Rowe,48.22,52.16,27.22,45.36,124.74,Single-ply,SBD,F
Girls,56.02,1,Brianna Ruiz,Los Fresnos,55.38,142.88,58.97,127.01,328.85,Single-ply,SBD,F
Girls,56.02,2,Victoria Olivarez,Mission Veterans Memorial,56.02,129.27,61.23,138.35,328.85,Single-ply,SBD,F
Girls,56.02,3,Briana Rocha,Rio Hondo,55.88,120.2,56.7,136.08,312.98,Single-ply,SBD,F
Girls,56.02,4,Demi Ibarra,Brownsville Pace,55.34,127.01,54.43,124.74,306.17,Single-ply,SBD,F
Girls,56.02,5,Luz Hernandez,Weslaco East,55.79,131.54,43.09,131.54,306.17,Single-ply,SBD,F
Girls,56.02,6,Alma Martinez,Raymondville,55.79,124.74,63.5,113.4,301.64,Single-ply,SBD,F
Girls,56.02,7,Brittiney Soliz,Edinburg Vela,54.88,106.59,65.77,124.74,297.1,Single-ply,SBD,F
Girls,56.02,8,Stephanie Garcia,Brownsville Lopez,55.88,129.27,61.23,106.59,297.1,Single-ply,SBD,F
Girls,56.02,9,Beatriz Zapata,Brownsville Pace,54.88,111.13,49.9,120.2,281.23,Single-ply,SBD,F
Girls,56.02,10,Denise Sanchez,Los Fresnos,55.97,102.06,52.16,117.93,272.16,Single-ply,SBD,F
Girls,56.02,11,Alejandra Cuellar,Pharr Valley View,54.43,106.59,49.9,111.13,267.62,Single-ply,SBD,F
Girls,56.02,12,Jeniece Uribe,Brownsville Hanna,55.79,102.06,40.82,111.13,254.01,Single-ply,SBD,F
Girls,56.02,13,Judy Villarreal,Mission Veterans Memorial,53.52,95.25,43.09,104.33,242.67,Single-ply,SBD,F
Girls,56.02,14,Miya Whittington,Port Isabel,54.88,90.72,47.63,102.06,240.4,Single-ply,SBD,F
Girls,56.02,15,Cristy Gonzalez,Edinburg Idea College Prep,55.34,92.99,52.16,90.72,235.87,Single-ply,SBD,F
Girls,56.02,16,Deisy Moreno,Brownsville Pace,54.43,97.52,43.09,90.72,231.33,Single-ply,SBD,F
Girls,56.02,17,Erika Gonzalez,Rio Hondo,54.43,92.99,47.63,88.45,229.06,Single-ply,SBD,F
Girls,56.02,DQ,Destiny Villa,Weslaco East,54.79,,,,,Single-ply,SBD,F
Girls,56.02,DQ,Janice Fan,Weslaco East,56.02,,,,,Single-ply,SBD,F
Girls,56.02,DQ,Suzy Martinez,Brownsville Veterans Memorial,55.79,,,,,Single-ply,SBD,F
Girls,56.02,DQ,Shelsey Calvillo,Brownsville Hanna,55.34,108.86,49.9,,,Single-ply,SBD,F
Girls,60.1,1,Lorena Martinez,Los Fresnos,60.06,163.29,63.5,161.03,387.82,Single-ply,SBD,F
Girls,60.1,2,Brendalee Hernandez,Weslaco East,59.87,124.74,68.04,142.88,335.66,Single-ply,SBD,F
Girls,60.1,3,Steffi Olivarez,Edinburg Vela,57.79,129.27,63.5,124.74,317.51,Single-ply,SBD,F
Girls,60.1,4,Rebekah Medeiros,Rio Hondo,59.87,117.93,68.04,131.54,317.51,Single-ply,SBD,F
Girls,60.1,5,Joanna Rodriguez,Brownsville Pace,59.87,124.74,63.5,117.93,306.17,Single-ply,SBD,F
Girls,60.1,6,Lori Celedon,McAllen Rowe,58.51,122.47,58.97,122.47,303.91,Single-ply,SBD,F
Girls,60.1,7,Gloria Saldana,Brownsville Pace,58.51,124.74,61.23,115.67,301.64,Single-ply,SBD,F
Girls,60.1,8,Alexis Martinez #5,La Feria,59.87,111.13,65.77,124.74,301.64,Single-ply,SBD,F
Girls,60.1,9,Valerie Valdez,Weslaco East,58.42,113.4,49.9,115.67,278.96,Single-ply,SBD,F
Girls,60.1,10,Victoria Hernandez,Raymondville,58.51,104.33,61.23,106.59,272.16,Single-ply,SBD,F
Girls,60.1,11,Anna Delgado,Port Isabel,56.61,104.33,52.16,108.86,265.35,Single-ply,SBD,F
Girls,60.1,12,Tanija Barbarrera,Port Isabel,57.61,99.79,54.43,108.86,263.08,Single-ply,SBD,F
Girls,60.1,13,Erica Trevino,Mission Veterans Memorial,58.97,108.86,45.36,106.59,260.82,Single-ply,SBD,F
Girls,60.1,14,Ashley Garza,Brownsville Pace,58.2,108.86,47.63,102.06,258.55,Single-ply,SBD,F
Girls,60.1,15,Jessica Villarreal,Brownsville Hanna,59.87,92.99,40.82,120.2,254.01,Single-ply,SBD,F
Girls,60.1,16,Nasay Herbet,Brownsville Porter,59.51,106.59,38.56,106.59,251.74,Single-ply,SBD,F
Girls,60.1,17,Emily Trevino,Brownsville Porter,58.51,90.72,40.82,86.18,217.72,Single-ply,SBD,F
Girls,60.1,18,Jarizza Villarreal,McAllen,60.06,79.38,43.09,95.25,217.72,Single-ply,SBD,F
Girls,60.1,DQ,Erin Quiroz,Edinburg Vela,59.51,106.59,61.23,,,Single-ply,SBD,F
Girls,60.1,DQ,Aylin Rocillo,Edinburg Idea College Prep,58.06,83.91,,,,Single-ply,SBD,F
Girls,67.36,1,Julissa Torres,Los Fresnos,64.41,183.7,104.33,165.56,453.59,Single-ply,SBD,F
Girls,67.36,2,Stephanie Trevino,Los Fresnos,66.5,170.1,90.72,172.37,433.18,Single-ply,SBD,F
Girls,67.36,3,Andrea Ramirez,Rio Hondo,63.96,183.7,92.99,154.22,430.91,Single-ply,SBD,F
Girls,67.36,4,Marisol Pulido,Brownsville Lopez,63.14,163.29,63.5,163.29,390.09,Single-ply,SBD,F
Girls,67.36,5,Franchesca Sandoval,Port Isabel,66.22,165.56,74.84,138.35,378.75,Single-ply,SBD,F
Girls,67.36,6,Sofia Cruz,Brownsville Hanna,63.05,158.76,74.84,142.88,376.48,Single-ply,SBD,F
Girls,67.36,7,Victoria Ortega,Rio Hondo,61.69,151.95,65.77,124.74,342.46,Single-ply,SBD,F
Girls,67.36,8,Jocelyn Martinez,Pharr Valley View,62.14,127.01,47.63,138.35,312.98,Single-ply,SBD,F
Girls,67.36,9,Claudia Rodriguez,Pharr Valley View,66.68,140.61,63.5,104.33,308.44,Single-ply,SBD,F
Girls,67.36,10,Alexa Garcia,Edinburg Vela,62.87,106.59,70.31,108.86,285.76,Single-ply,SBD,F
Girls,67.36,11,Cassandra Rodriquez,Pharr Valley View,66.22,111.13,65.77,106.59,283.5,Single-ply,SBD,F
Girls,67.36,12,Carla Bocanegra,Raymondville,62.14,111.13,61.23,104.33,276.69,Single-ply,SBD,F
Girls,67.36,13,Joanna Trujillo,Brownsville Porter,64.41,120.2,40.82,106.59,267.62,Single-ply,SBD,F
Girls,67.36,14,Adelita Arevalo,Mission Veterans Memorial,66.86,111.13,38.56,95.25,244.94,Single-ply,SBD,F
Girls,67.36,15,Julissa Guerrero,Edcouch-Elsa,62.6,83.91,40.82,102.06,226.8,Single-ply,SBD,F
Girls,67.36,16,Ary Ruiz,Brownsville Hanna,66.68,90.72,24.95,97.52,213.19,Single-ply,SBD,F
Girls,67.36,17,Jacqueline Rios,McAllen Rowe,64.86,79.38,36.29,90.72,206.38,Single-ply,SBD,F
Girls,67.36,18,Katerina Cardenas,McAllen,63.96,72.57,43.09,86.18,201.85,Single-ply,SBD,F
Girls,67.36,DQ,Zoe Pena,McAllen,66.77,102.06,56.7,,,Single-ply,SBD,F
Girls,75.07,1,Jesed Castro,Los Fresnos,75.02,219.99,104.33,170.1,494.42,Single-ply,SBD,F
Girls,75.07,2,Melanie Quintero,Brownsville Lopez,74.48,149.69,56.7,161.03,367.41,Single-ply,SBD,F
Girls,75.07,3,Chelsea Juarez,Edcouch-Elsa,73.94,145.15,72.57,145.15,362.87,Single-ply,SBD,F
Girls,75.07,4,Esmeralda Hinojosa,Raymondville,73.03,149.69,68.04,140.61,358.34,Single-ply,SBD,F
Girls,75.07,5,Ariana Segura,Edcouch-Elsa,74.84,145.15,58.97,142.88,347,Single-ply,SBD,F
Girls,75.07,6,Krista Figueroa,Brownsville Hanna,70.76,147.42,61.23,129.27,337.93,Single-ply,SBD,F
Girls,75.07,7,Jaslyn Olivarez,McAllen,69.85,136.08,65.77,113.4,315.25,Single-ply,SBD,F
Girls,75.07,8,Vanessa Ybarra,Port Isabel,72.12,113.4,56.7,129.27,299.37,Single-ply,SBD,F
Girls,75.07,9,Alexis Alaniz #2,Brownsville Hanna,71.21,113.4,56.7,111.13,281.23,Single-ply,SBD,F
Girls,75.07,10,Mikaela Snyder,Port Isabel,70.76,104.33,47.63,120.2,272.16,Single-ply,SBD,F
Girls,75.07,11,Vanessa Ravell,Brownsville Porter,72.21,131.54,40.82,92.99,265.35,Single-ply,SBD,F
Girls,75.07,12,Mia Murphy,McAllen Rowe,70.31,102.06,54.43,104.33,260.82,Single-ply,SBD,F
Girls,75.07,13,Brianna Flores,Mission Veterans Memorial,69.85,83.91,54.43,115.67,254.01,Single-ply,SBD,F
Girls,75.07,14,Valerie Cordova,Mission Veterans Memorial,71.21,92.99,29.48,92.99,215.46,Single-ply,SBD,F
Girls,75.07,15,Daniela Hernandez,McAllen Rowe,74.84,74.84,27.22,97.52,199.58,Single-ply,SBD,F
Girls,75.07,16,Erika Treto,Brownsville Porter,73.94,70.31,29.48,74.84,174.63,Single-ply,SBD,F
Girls,75.07,DQ,Ithalia Garza,McAllen,68.08,102.06,52.16,,,Single-ply,SBD,F
Girls,75.07,DQ,Virginia Galvan,La Feria,73.03,,,,,Single-ply,SBD,F
Girls,82.33,1,Brandie Bernal,Edcouch-Elsa,81.65,154.22,70.31,149.69,374.21,Single-ply,SBD,F
Girls,82.33,2,Alyssa Juarez,Weslaco East,78.93,161.03,68.04,142.88,371.95,Single-ply,SBD,F
Girls,82.33,3,Adriana Valerio,Brownsville Pace,81.65,149.69,68.04,142.88,360.61,Single-ply,SBD,F
Girls,82.33,4,Anyssa Barrientes,Rio Hondo,78.93,140.61,56.7,145.15,342.46,Single-ply,SBD,F
Girls,82.33,5,Sadie Granados,Edcouch-Elsa,81.65,124.74,65.77,149.69,340.19,Single-ply,SBD,F
Girls,82.33,6,Priscilla Acosta,McAllen Rowe,79.97,122.47,70.31,117.93,310.71,Single-ply,SBD,F
Girls,82.33,7,Layla Carrizales,Los Fresnos,82.24,131.54,61.23,111.13,303.91,Single-ply,SBD,F
Girls,82.33,8,Audrey Martinez,Port Isabel,82.1,111.13,54.43,120.2,285.76,Single-ply,SBD,F
Girls,82.33,9,Samantha Romero,Mission Veterans Memorial,81.65,106.59,61.23,102.06,269.89,Single-ply,SBD,F
Girls,82.33,10,Brittany Barrera,Brownsville Porter,77.61,90.72,43.09,108.86,242.67,Single-ply,SBD,F
Girls,82.33,11,Adreanna Guerrero,Mission Veterans Memorial,78.47,83.91,52.16,83.91,219.99,Single-ply,SBD,F
Girls,82.33,12,Samantha Walter,Mission Veterans Memorial,76.66,86.18,43.09,88.45,217.72,Single-ply,SBD,F
Girls,90.04,1,Julie Torres,Los Fresnos,82.55,183.7,86.18,183.7,453.59,Single-ply,SBD,F
Girls,90.04,2,Angelina Young,Edinburg Vela,89.9,149.69,90.72,136.08,376.48,Single-ply,SBD,F
Girls,90.04,3,Dolores Guajardo,Raymondville,86.64,163.29,79.38,129.27,371.95,Single-ply,SBD,F
Girls,90.04,4,Yasmine Perez,La Feria,89.36,149.69,68.04,151.95,369.68,Single-ply,SBD,F
Girls,90.04,5,Kassie Lopez,Brownsville Porter,88.54,124.74,65.77,140.61,331.12,Single-ply,SBD,F
Girls,90.04,6,Elizabeth Zaragoza,Raymondville,86.64,136.08,61.23,129.27,326.59,Single-ply,SBD,F
Girls,90.04,7,Dalilah Sanchez,Rio Hondo,86.64,133.81,56.7,129.27,319.78,Single-ply,SBD,F
Girls,90.04,8,Olivia Mata,McAllen,87.27,111.13,70.31,124.74,306.17,Single-ply,SBD,F
Girls,90.04,DQ,Monique Gonzalez,La Feria,85.28,111.13,,,,Single-ply,SBD,F
Girls,90.04,DQ,Nicole Ozuna,Edinburg Vela,89.49,,,,,Single-ply,SBD,F
Girls,100.02,1,Karina Martinez #2,Raymondville,97.52,192.78,92.99,138.35,424.11,Single-ply,SBD,F
Girls,100.02,2,Kassandra Chavez,Pharr Valley View,99.79,147.42,79.38,147.42,374.21,Single-ply,SBD,F
Girls,100.02,3,Justine Guerrero,Edcouch-Elsa,99.34,172.37,63.5,136.08,371.95,Single-ply,SBD,F
Girls,100.02,4,Diana Mendoza,Brownsville Pace,98.88,163.29,74.84,117.93,356.07,Single-ply,SBD,F
Girls,100.02,5,Brandy Gonzalez,Rio Hondo,99.79,145.15,68.04,124.74,337.93,Single-ply,SBD,F
Girls,100.02,6,Andrea Ochoa,Edinburg Vela,95.35,129.27,68.04,111.13,308.44,Single-ply,SBD,F
Girls,100.02,7,Angelica Lozano,McAllen Rowe,95.71,106.59,63.5,136.08,306.17,Single-ply,SBD,F
Girls,100.02,8,Desiree Perez,La Feria,96.62,99.79,54.43,124.74,278.96,Single-ply,SBD,F
Girls,100.02,9,Alondra Bustos,Brownsville Hanna,97.98,68.04,43.09,102.06,213.19,Single-ply,SBD,F
Girls,100.02,DQ,Blanca Gonzalez,Brownsville Pace,97.98,142.88,68.04,,,Single-ply,SBD,F
Girls,100.02,DQ,Miranda Lopez #2,Edcouch-Elsa,99.34,,,,,Single-ply,SBD,F
Girls,100.02+,1,Joseline Padilla,Port Isabel,106.59,204.12,79.38,161.03,444.52,Single-ply,SBD,F
Girls,100.02+,2,Amber Estrada,Edcouch-Elsa,123.83,181.44,79.38,156.49,417.3,Single-ply,SBD,F
Girls,100.02+,3,Arely Rincon,Weslaco East,115.67,147.42,77.11,142.88,367.41,Single-ply,SBD,F
Girls,100.02+,4,Rene Almazan,Brownsville Porter,105.23,163.29,58.97,127.01,349.27,Single-ply,SBD,F
Girls,100.02+,5,Chasity Alvarez,McAllen Rowe,107.95,127.01,68.04,117.93,312.98,Single-ply,SBD,F
Girls,100.02+,6,Monika Morales,Edinburg Idea College Prep,109.77,113.4,38.56,113.4,265.35,Single-ply,SBD,F
Girls,100.02+,DQ,Monica Gallegos,Rio Hondo,100.7,,,,,Single-ply,SBD,F
