Name,Team,Country,Sex,BirthDate,BirthYear,Age,Division,WeightClassKg,BodyweightKg,Squat1Kg,Squat2Kg,Squat3Kg,Best3SquatKg,Bench1Kg,Bench2Kg,Bench3Kg,Best3BenchKg,Deadlift1Kg,Deadlift2Kg,Deadlift3Kg,Best3DeadliftKg,TotalKg,Place,Event,Equipment
Eva Buxbom,Denmark,Denmark,F,,1969,55,Open,52,51.87,150,157.5,162.5,162.5,75,-77.5,-77.5,75,155,-162.5,-162.5,155,392.5,5,SBD,Single-ply
Heidi Hille Arnesen,Norway,Norway,F,,1970,54,Open,84,84.00,240,247.5,252.5,252.5,130,135,-140,135,195,-202.5,205,205,592.5,6,SBD,Single-ply
Larysa Soloviova #1,Ukraine,Ukraine,F,,1978,46,Open,63,62.98,210,220,230,230,150,160,-170,160,202.5,-210,215,215,605,1,SBD,Single-ply
Kathrine Holmgaard Bak,Denmark,Denmark,F,,1981,43,Open,69,64.93,-170,170,177.5,177.5,107.5,-110,-110,107.5,212.5,222.5,-235.5,222.5,507.5,6,SBD,Single-ply
Jane Aaberg,Denmark,Denmark,F,,1981,43,Open,84,83.20,205,-212.5,-212.5,205,107.5,112.5,115,115,220,232.5,-252,232.5,552.5,9,SBD,Single-ply
Kate Sweatman,UK,UK,F,,1985,39,Open,84+,136.19,255,270,275,275,-210,-215,-215,,175,185,-190,185,,DQ,SBD,Single-ply
Olga Głowala,Poland,Poland,F,,1986,38,Open,52,51.59,-160,-160,-160,-160,70,75,-77.5,75,120,127.5,-135,127.5,,DQ,SBD,Single-ply
Katja Broxtermann,Germany,Germany,F,,1986,38,Open,76,73.95,220,227.5,-232.5,227.5,-147.5,-147.5,147.5,147.5,175,185,-187.5,185,560,4,SBD,Single-ply
Karolina Moszynska,Germany,Germany,F,,1986,38,Open,57,56.46,185,-195,200,200,115,120,125,125,165,175,180,180,505,6,SBD,Single-ply
Ankie Timmers,Luxembourg,Luxembourg,F,,1986,38,Open,84,83.40,220,230,237.5,237.5,190,195,200,200,205,212.5,-220,212.5,650,2,SBD,Single-ply
Anastasiia Derevianko,Ukraine,Ukraine,F,,1987,37,Open,52,51.79,180,187.5,192.5,192.5,105,110,112.5,112.5,-170,170,175,175,480,1,SBD,Single-ply
Emma Goodwin,UK,UK,F,,1987,37,Open,57,56.30,180,187.5,192.5,192.5,-90,90,-95,90,170,182.5,-192.5,182.5,465,7,SBD,Single-ply
Sarah Klein #1,Germany,Germany,F,,1988,36,Open,52,51.23,170,180,187.5,187.5,75,-105,-107.5,75,155,172.5,182.5,182.5,445,2,SBD,Single-ply
Mélodie Anthouard,France,France,F,,1988,36,Open,63,61.52,190,197.5,202.5,202.5,130,137.5,142.5,142.5,150,157.5,-165,157.5,502.5,6,SBD,Single-ply
Kimberley Cowell,UK,UK,F,,1988,36,Open,76,74.71,155,-175,,155,137.5,-142.5,-142.5,137.5,75,,,75,367.5,6,SBD,Single-ply
Stefana Dumitrescu,Romania,Romania,F,,1988,36,Open,52,51.82,135,-145,-145,135,65,70,-75,70,137.5,145,-160,145,350,6,SBD,Single-ply
Ruth Viehauser,Austria,Austria,F,,1988,36,Open,63,62.95,205,212.5,-217.5,212.5,107.5,112.5,-117.5,112.5,175,190,205,205,530,4,SBD,Single-ply
Cathrin Monika Silberzahn,Germany,Germany,F,,1988,36,Open,69,68.90,235,242.5,247.5,247.5,137.5,-142.5,-142.5,137.5,-195,200,-205,200,585,1,SBD,Single-ply
Jenny Marie Johansen,Norway,Norway,F,,1989,35,Open,69,68.48,215,222.5,-227.5,222.5,127.5,132.5,-137.5,132.5,195,205,-217.5,205,560,4,SBD,Single-ply
Lauren Elder,UK,UK,F,,1989,35,Open,63,62.84,-200,200,-212.5,200,87.5,92.5,-97.5,92.5,182.5,-192.5,-202.5,182.5,475,8,SBD,Single-ply
Lisette I Hansen,Denmark,Denmark,F,,1989,35,Open,47,46.61,147.5,155,160,160,85,90,92.5,92.5,157.5,165,-175.5,165,417.5,2,SBD,Single-ply
Sofia Kamlund,Sweden,Sweden,F,,1990,34,Open,84,83.99,220,227.5,-232.5,227.5,150,-155,-157.5,150,182.5,-192.5,-192.5,182.5,560,8,SBD,Single-ply
Marte Elverum,Norway,Norway,F,,1990,34,Open,76,75.97,242.5,-250,250,250,140,147.5,152.5,152.5,230,247.5,-252.5,247.5,650,1,SBD,Single-ply
Sandrine Quignaudon,Sweden,Sweden,F,,1991,33,Open,52,51.50,165,172.5,177.5,177.5,95,100,102.5,102.5,157.5,-162.5,165,165,445,3,SBD,Single-ply
Frida Wik,Sweden,Sweden,F,,1991,33,Open,76,75.93,202.5,210,215,215,-150,152.5,-157.5,152.5,195,200,207.5,207.5,575,2,SBD,Single-ply
Andreea Vasilescu,Romania,Romania,F,,1991,33,Open,57,56.63,167.5,175,182.5,182.5,-102.5,102.5,-105,102.5,170,-177.5,-177.5,170,455,9,SBD,Single-ply
Ellie Steel,UK,UK,F,,1991,33,Open,57,56.99,195,205,210,210,137.5,145,-150,145,160,170,175,175,530,3,SBD,Single-ply
Christie Civetta,UK,UK,F,,1992,32,Open,84,83.50,225,237.5,245,245,135,142.5,145,145,185,200,210,210,600,5,SBD,Single-ply
Valentina Zagoruyko,Ukraine,Ukraine,F,,1992,32,Open,84+,102.47,262.5,272.5,280,280,147.5,157.5,162.5,162.5,205,220,-235,220,662.5,2,SBD,Single-ply
Anna Sørlie Heranger,Norway,Norway,F,,1992,32,Open,84,83.88,-250,-250,250,250,147.5,-152.5,152.5,152.5,205,212.5,217.5,217.5,620,3,SBD,Single-ply
Valérie von Gleichen,Germany,Germany,F,,1992,32,Open,84,83.64,235,245,252.5,252.5,-120,120,-122.5,120,200,212.5,-230,212.5,585,7,SBD,Single-ply
Alba Jurado,Luxembourg,Luxembourg,F,,1993,31,Open,69,63.58,135,142.5,150,150,82.5,90,95,95,165,172.5,-177.5,172.5,417.5,7,SBD,Single-ply
Anna Zielińska,Poland,Poland,F,,1993,31,Open,84+,100.20,180,190,200,200,110,120,,120,185,200,-205,200,520,5,SBD,Single-ply
Radostina Lulova,Bulgaria,Bulgaria,F,,1993,31,Open,63,62.92,217.5,227.5,232.5,232.5,100,105,-107.5,105,200,207.5,212.5,212.5,550,2,SBD,Single-ply
Gerlyn Mäepea,Estonia,Estonia,F,,1993,31,Open,52,51.27,-155,155,160,160,125,130,135,135,140,-150,-150,140,435,4,SBD,Single-ply
Karmen Kaljula,Estonia,Estonia,F,,1994,30,Open,76,74.10,-200,205,-215,205,165,170,-175,170,185,197.5,-205,197.5,572.5,3,SBD,Single-ply
Sabrina Mancini,Italy,Italy,F,,1994,30,Open,57,56.61,195,202.5,210,210,110,115,-120,115,182.5,190,-195,190,515,5,SBD,Single-ply
Holly Bryans,UK,UK,F,,1994,30,Open,69,68.86,220,230,-232.5,230,140,150,155,155,185,197.5,-205,197.5,582.5,2,SBD,Single-ply
Lucy Hart,UK,UK,F,,1995,29,Open,63,62.82,190,-195,195,195,97.5,105,-110,105,145,157.5,-167.5,157.5,457.5,9,SBD,Single-ply
Alessandra Cernigliaro,Italy,Italy,F,,1995,29,Open,57,56.97,207.5,215,223,223,130,135,-145,135,180,192.5,197.5,197.5,555.5,1,SBD,Single-ply
Blanka Bartoňková,Czechia,Czechia,F,,1995,29,Open,57,56.34,195,-205,205,205,115,120,-125,120,177.5,190,-195,190,515,4,SBD,Single-ply
Tetiana Bila,Ukraine,Ukraine,F,,1996,28,Open,47,46.91,175,191.5,,191.5,105,115,-122.5,115,155,-165,-167.5,155,461.5,1,SBD,Single-ply
Tetyana Shchavinska,Ukraine,Ukraine,F,,1996,28,Open,57,53.06,-177.5,177.5,-190,177.5,-122.5,122.5,125,125,-150,155,-160,155,457.5,8,SBD,Single-ply
Lisa Schlagbauer,Germany,Germany,F,,1996,28,Open,69,68.37,207.5,215,220,220,-125,125,-130,125,195,205,-215,205,550,5,SBD,Single-ply
Margarita Kirilova,Bulgaria,Bulgaria,F,,1997,27,Open,57,56.72,147.5,157.5,170,170,95,100,-102.5,100,165,177.5,-192.5,177.5,447.5,10,SBD,Single-ply
Mélodie Darmon,France,France,F,,1997,27,Open,63,62.76,180,187.5,192.5,192.5,107.5,112.5,117.5,117.5,170,-180,180,180,490,7,SBD,Single-ply
Emilia Pituelli,Italy,Italy,F,,1998,26,Open,63,62.92,192.5,200,207.5,207.5,100,105,-110,105,192.5,202.5,-210,202.5,515,5,SBD,Single-ply
Marthe Tjelta,Norway,Norway,F,,1999,25,Open,69,64.58,207.5,217.5,225,225,140,-145,145,145,180,192.5,200,200,570,3,SBD,Single-ply
Daniela Stroe,Romania,Romania,F,,1999,25,Open,47,46.48,110,-120,120,120,65,67.5,70,70,120,125,-130,125,315,3,SBD,Single-ply
Zuzanna Kula,Poland,Poland,F,,1999,25,Open,57,54.77,205,-215,-215,205,-161.5,161.5,166,166,170,177.5,182.5,182.5,553.5,2,SBD,Single-ply
Karolina Kołata,Poland,Poland,F,,1999,25,Open,84+,103.69,197.5,207.5,-215,207.5,180,-185,-185,180,160,-170,170,170,557.5,3,SBD,Single-ply
Sonja Stefanie Krüger,Germany,Germany,F,,1999,25,Open,76,75.65,-270,270,-281,270,-200,-200,-200,-200,-195,195,-210,195,,DQ,SBD,Single-ply
Paulina Pajączkowska,Poland,Poland,F,,2000,24,Open,63,62.67,162.5,172.5,-177.5,172.5,-80,-80,80,80,165,180,-185,180,432.5,10,SBD,Single-ply
Viktoriia Kostiuk,Ukraine,Ukraine,F,,2000,24,Open,84+,96.15,217.5,230,242.5,242.5,112.5,120,-125,120,160,172.5,-195,172.5,535,4,SBD,Single-ply
Karen Thrige Andersen,Denmark,Denmark,F,,2000,24,Open,84,83.21,265,279,-285.5,279,-105,105,110,110,185,200,212.5,212.5,601.5,4,SBD,Single-ply
Emily Finnern,Germany,Germany,F,,2000,24,Open,63,61.32,215,225,230,230,140,145,-150,145,162.5,172.5,-177.5,172.5,547.5,3,SBD,Single-ply
Natalia Wójtowicz,Poland,Poland,F,,2001,23,Juniors,76,69.84,180,-187.5,187.5,187.5,102.5,110,115,115,170,-182.5,-182.5,170,472.5,5,SBD,Single-ply
Sofia Räihä,Finland,Finland,F,,2001,23,Juniors,63,62.79,180,-190,190,190,120,-125,-125,120,167.5,180,-190,180,490,1,SBD,Single-ply
Daria Rusanenko,Ukraine,Ukraine,F,,2001,23,Open,84,77.71,265,278.5,-285.5,278.5,145,150,155,155,202.5,215,220,220,653.5,1,SBD,Single-ply
Patricia Slizova,Slovakia,Slovakia,F,,2001,23,Juniors,84+,93.10,180,200,210,210,120,127.5,130,130,140,155,165,165,505,2,SBD,Single-ply
Sóley Margrét Jónsdóttir,Iceland,Iceland,F,,2001,23,Open,84+,120.79,252.5,270,280,280,182.5,-192.5,192.5,192.5,190,200,205,205,677.5,1,SBD,Single-ply
Nataliia Maha,Ukraine,Ukraine,F,,2001,23,Juniors,57,56.79,152.5,157.5,160,160,87.5,-92.5,92.5,92.5,145,155,162.5,162.5,415,1,SBD,Single-ply
Laura Isabel Salazar Droege,Austria,Austria,F,,2001,23,Juniors,69,68.12,-220,220,225,225,120,125,-130,125,177.5,185,190,190,540,2,SBD,Single-ply
Alexandra Zamfirescu,Romania,Romania,F,,2001,23,Juniors,47,46.47,90,95,-100,95,47.5,50,-52.5,50,-100,100,-115,100,245,2,SBD,Single-ply
Oksana Sukhodieieva,Ukraine,Ukraine,F,,2001,23,Juniors,43,42.02,120,125,-130,125,30,37.5,,37.5,95,100,105,105,267.5,1,SBD,Single-ply
Julia Bilicka,Poland,Poland,F,,2002,22,Juniors,76,70.25,180,190,200,200,100,105,107.5,107.5,190,200,205,205,512.5,2,SBD,Single-ply
Kateryna Muliar,Ukraine,Ukraine,F,,2002,22,Open,76,75.56,-220,220,-230,220,120,-130,-130,120,170,190,200,200,540,5,SBD,Single-ply
Emily Shergold,UK,UK,F,,2002,22,Juniors,84,83.55,195,202.5,210,210,95,102.5,107.5,107.5,160,167.5,175,175,492.5,3,SBD,Single-ply
Tuva Lierhagen,Norway,Norway,F,,2003,21,Juniors,84+,103.33,140,155,162.5,162.5,162.5,167.5,170,170,170,182.5,185,185,517.5,1,SBD,Single-ply
Olívia Lapšanská,Slovakia,Slovakia,F,,2003,21,Juniors,84,76.23,170,177.5,187.5,187.5,90,97.5,-102.5,97.5,160,167.5,-177.5,167.5,452.5,5,SBD,Single-ply
Eliise Mikomägi,Estonia,Estonia,F,,2003,21,Juniors,76,75.18,190,205,,205,110,115,-120,115,200,-215,215,215,535,1,SBD,Single-ply
Yasmina Juliette Havnen,Norway,Norway,F,,2003,21,Juniors,69,68.68,200,210,215,215,-125,125,132.5,132.5,177.5,187.5,195,195,542.5,1,SBD,Single-ply
Veronika Bordiuh,Ukraine,Ukraine,F,,2003,21,Juniors,69,67.22,212.5,222.5,227.5,227.5,-115,115,125,125,165,175,185,185,537.5,3,SBD,Single-ply
Desiree Schoepf,Austria,Austria,F,,2003,21,Juniors,76,69.99,185,195,-205,195,115,-120,120,120,165,180,-192.5,180,495,4,SBD,Single-ply
Sofiia Bzdyr,Ukraine,Ukraine,F,,2003,21,Juniors,63,57.23,130,137.5,140,140,62.5,67.5,72.5,72.5,115,127.5,-135,127.5,340,3,SBD,Single-ply
Emma Elise Aas,Norway,Norway,F,,2003,21,Juniors,63,62.44,167.5,175,177.5,177.5,-90,90,95,95,175,187.5,-195,187.5,460,2,SBD,Single-ply
Mariia Polianska,Ukraine,Ukraine,F,,2003,21,Juniors,47,46.91,155,165,,165,50,55,57.5,57.5,155,-170,-170,155,377.5,1,SBD,Single-ply
Alexandra Cazacu,Romania,Romania,F,,2003,21,Juniors,57,56.66,157.5,162.5,167.5,167.5,57.5,62.5,-65,62.5,137.5,142.5,152.5,152.5,382.5,3,SBD,Single-ply
Paula Nitz,Austria,Austria,F,,2003,21,Juniors,84,76.01,207.5,215,220,220,105,-112.5,115,115,167.5,177.5,-180,177.5,512.5,2,SBD,Single-ply
Emma Weydert,Luxembourg,Luxembourg,F,,2004,20,Juniors,57,56.25,130,-135,135,135,67.5,72.5,75,75,137.5,145,152.5,152.5,362.5,4,SBD,Single-ply
Lara Hinz,Germany,Germany,F,,2004,20,Juniors,84+,106.02,-250,-250,-250,-250,-162.5,162.5,-170,162.5,75,-77.5,-77.5,75,,DQ,SBD,Single-ply
Klara Haspel,Germany,Germany,F,,2004,20,Juniors,84,81.76,220,227.5,235,235,-122.5,122.5,127.5,127.5,160,170,180,180,542.5,1,SBD,Single-ply
Rosanna Lampela,Finland,Finland,F,,2004,20,Juniors,84,83.17,160,170,-180,170,105,110,-115,110,150,-162.5,-162.5,150,430,6,SBD,Single-ply
Oleksandra Borshch,Ukraine,Ukraine,F,,2004,20,Juniors,76,71.57,195,207.5,220,220,100,105,-107.5,105,180,187.5,-195,187.5,512.5,3,SBD,Single-ply
Eerika Palosaari,Finland,Finland,F,,2005,19,Juniors,57,56.64,145,-152.5,157.5,157.5,105,-112.5,-112.5,105,130,142.5,150,150,412.5,2,SBD,Single-ply
Tetiana Muzychenko,Ukraine,Ukraine,F,,2005,19,Juniors,52,50.95,130,145,160,160,65,70,75,75,120,127.5,132.5,132.5,367.5,1,SBD,Single-ply
Alina Nikohosian,Ukraine,Ukraine,F,,2005,19,Juniors,84,82.22,-180,180,192.5,192.5,107.5,115,117.5,117.5,140,150,-155,150,460,4,SBD,Single-ply
Khrystyna Ulianyk,Ukraine,Ukraine,F,,2005,19,Juniors,43,39.72,-100,100,-110,100,40,45,-47.5,45,-85,85,90,90,235,2,SBD,Single-ply
Natasza Rajewska,Poland,Poland,F,,2006,18,Sub-Juniors,52,51.66,-120,-120,-120,-120,60,65,-70,65,130,135,-140,135,,DQ,SBD,Single-ply
Rehina Fursenko,Ukraine,Ukraine,F,,2006,18,Sub-Juniors,69,67.85,140,-150,-150,140,50,80,-85,80,125,135,-142.5,135,355,2,SBD,Single-ply
Karolina Milatova,Slovakia,Slovakia,F,,2006,18,Sub-Juniors,57,54.34,127.5,135,-140,135,75,77.5,80,80,145,150,157.5,157.5,372.5,1,SBD,Single-ply
Bianca Todorescu,Romania,Romania,F,,2006,18,Sub-Juniors,52,51.74,127.5,-135,135,135,87.5,-95,95,95,115,120,-125,120,350,3,SBD,Single-ply
Julia Kliestikova,Slovakia,Slovakia,F,,2006,18,Sub-Juniors,84,76.15,162.5,175,182.5,182.5,80,85,-87.5,85,135,147.5,-157.5,147.5,415,2,SBD,Single-ply
Sofiya Stanko,Ukraine,Ukraine,F,,2006,18,Sub-Juniors,63,61.51,170,185,-195,185,115,125,132.5,132.5,145,155,160,160,477.5,1,SBD,Single-ply
Emma Honkonen,Finland,Finland,F,,2006,18,Sub-Juniors,57,56.65,135,145,-152.5,145,75,77.5,80,80,135,142.5,147.5,147.5,372.5,2,SBD,Single-ply
Alice Del Fabro,Italy,Italy,F,,2006,18,Sub-Juniors,52,51.82,155,165,170,170,-80,-80,80,80,150,161,173,173,423,1,SBD,Single-ply
Katie Tatum,UK,UK,F,,2006,18,Sub-Juniors,84,78.75,145,155,162.5,162.5,-95,-100,100,100,125,132.5,140,140,402.5,3,SBD,Single-ply
Fanni Viljanen,Finland,Finland,F,,2006,18,Sub-Juniors,47,46.58,95,100,-105,100,-50,50,-52.5,50,107.5,117.5,-127.5,117.5,267.5,2,SBD,Single-ply
Sonata Lapaitytė,Lithuania,Lithuania,F,,2006,18,Sub-Juniors,47,46.69,75,80,-85,80,40,-45,45,45,75,80,82.5,82.5,207.5,5,SBD,Single-ply
Sandra Dzieżok,Poland,Poland,F,,2007,17,Sub-Juniors,57,56.61,140,-150,-150,140,80,-85,85,85,132.5,137.5,142.5,142.5,367.5,3,SBD,Single-ply
Karolina Idczak,Poland,Poland,F,,2007,17,Sub-Juniors,43,42.17,115,120,-122.5,120,45,50,-52.5,50,125,133,-135,133,303,1,SBD,Single-ply
Aleksandra Zwierzycka,Poland,Poland,F,,2007,17,Sub-Juniors,57,56.94,120,-125,-125,120,55,-60,-60,55,135,-140,-140,135,310,4,SBD,Single-ply
Zuzanna Majewska,Poland,Poland,F,,2007,17,Sub-Juniors,63,61.41,120,130,135,135,47.5,52.5,,52.5,135,137.5,140,140,327.5,4,SBD,Single-ply
Ivanna Holinei,Ukraine,Ukraine,F,,2007,17,Sub-Juniors,76,75.10,180,190,200,200,105,115,120,120,145,157.5,-177.5,157.5,477.5,1,SBD,Single-ply
Gracie Besant,UK,UK,F,,2007,17,Sub-Juniors,69,66.62,100,115,-120,115,60,-70,72.5,72.5,140,150,152.5,152.5,340,3,SBD,Single-ply
Ninni Kopola,Finland,Finland,F,,2007,17,Sub-Juniors,63,62.70,152.5,160,165,165,95,102.5,105,105,120,132.5,-142.5,132.5,402.5,3,SBD,Single-ply
Nelli Korpi,Finland,Finland,F,,2007,17,Sub-Juniors,69,67.89,-120,-135,140,140,60,65,-72.5,65,120,135,-142.5,135,340,4,SBD,Single-ply
Reda Laurinavičiūtė,Lithuania,Lithuania,F,,2007,17,Sub-Juniors,84,83.68,155,165,,165,85,87.5,90,90,160,170,-175,170,425,1,SBD,Single-ply
Ana Maria Oproiu,Romania,Romania,F,,2007,17,Sub-Juniors,47,46.76,92.5,-97.5,-102.5,92.5,-47.5,47.5,-52.5,47.5,70,75,82.5,82.5,222.5,4,SBD,Single-ply
Yana Zhyla,Ukraine,Ukraine,F,,2007,17,Sub-Juniors,47,46.36,95,102.5,-107.5,102.5,37.5,42.5,-45,42.5,95,102.5,-107.5,102.5,247.5,3,SBD,Single-ply
Zuzanna Znojek,Poland,Poland,F,,2008,16,Sub-Juniors,47,46.57,100,107.5,110,110,50,55,60,60,95,100,105,105,275,1,SBD,Single-ply
Anastasiia Olentyr,Ukraine,Ukraine,F,,2008,16,Sub-Juniors,52,51.17,135,140,-145,140,77.5,82.5,-87.5,82.5,115,125,127.5,127.5,350,2,SBD,Single-ply
Sofiia Rozhyk,Ukraine,Ukraine,F,,2008,16,Sub-Juniors,76,71.69,120,130,140,140,80,85,-90,85,105,-110,110,110,335,2,SBD,Single-ply
Mariia Zbandut,Ukraine,Ukraine,F,,2008,16,Sub-Juniors,63,62.92,185,-195,195,195,-105,105,110,110,147.5,-155,-155,147.5,452.5,2,SBD,Single-ply
Essi Närvä,Finland,Finland,F,,2009,15,Sub-Juniors,69,67.78,-125,127.5,137.5,137.5,-100,-100,100,100,140,150,-163.5,150,387.5,1,SBD,Single-ply
Bernie McGurk,UK,UK,M,,1968,56,Open,74,73.63,235,245,-255,245,130,-135,-140,130,-250,250,-275,250,625,6,SBD,Single-ply
Hassan El Belghiti,France,France,M,,1975,49,Open,74,70.03,280,-295,295,295,175,180,-182.5,180,300,-317.5,-325,300,775,2,SBD,Single-ply
Margus Silbaum,Estonia,Estonia,M,,1976,48,Open,120,107.74,340,355,370,370,-210,220,-230,220,315,-330,-330,315,905,8,SBD,Single-ply
Dariusz Wszoła,Poland,Poland,M,,1978,46,Open,59,58.67,-220,225,235,235,145,152.5,160,160,190,200,205,205,600,1,SBD,Single-ply
Kent Flaeten,Denmark,Denmark,M,,1979,45,Open,83,82.73,270,-285,285,285,-220,220,230,230,230,240,250,250,765,3,SBD,Single-ply
Oleksandr Ahadzhanian,Ukraine,Ukraine,M,,1979,45,Open,59,58.91,200,210,217.5,217.5,125,130,-135,130,195,202.5,207.5,207.5,555,2,SBD,Single-ply
Volodymyr Rysiev,Ukraine,Ukraine,M,,1982,42,Open,93,92.87,-372.5,372.5,392.5,392.5,285,307.5,-317.5,307.5,327.5,-342.5,-342.5,327.5,1027.5,1,SBD,Single-ply
Tomi Määttä,Finland,Finland,M,,1982,42,Open,120,111.16,370,-380,385,385,255,265,272.5,272.5,-290,290,307.5,307.5,965,3,SBD,Single-ply
Sofiane Belkesir,France,France,M,,1984,40,Open,120,117.84,400,415,425,425,280,287.5,292.5,292.5,320,340,-360,340,1057.5,2,SBD,Single-ply
Jussi Kangasvieri,Finland,Finland,M,,1987,37,Open,105,104.67,322.5,332.5,-340,332.5,-235,-235,235,235,300,-315,-315,300,867.5,7,SBD,Single-ply
Martin Lange,Germany,Germany,M,,1987,37,Open,120,113.46,360,375,385,385,265,275,280,280,300,-310,-312.5,300,965,4,SBD,Single-ply
Asgeir Hoel,Norway,Norway,M,,1988,36,Open,105,104.55,-390,390,405,405,-250,-250,-250,-250,330,-342.5,-342.5,330,,DQ,SBD,Single-ply
Mariusz Grotkowski,Poland,Poland,M,,1989,35,Open,66,65.68,-270,270,285,285,200,215,-222.5,215,250,-265,-265,250,750,1,SBD,Single-ply
Alex Cambray Orrason,Iceland,Iceland,M,,1989,35,Open,93,92.62,320,-332.5,340,340,207.5,-215,-215,207.5,265,280,292.5,292.5,840,5,SBD,Single-ply
Casper Futtrup,Denmark,Denmark,M,,1989,35,Open,120,118.76,345,360,372.5,372.5,255,-262.5,262.5,262.5,275,290,310,310,945,5,SBD,Single-ply
Florin Lupas Ionut,Romania,Romania,M,,1989,35,Open,120+,148.30,372.5,385,-400,385,-305,305,-320,305,270,295,305,305,995,4,SBD,Single-ply
Aftab Uddin,UK,UK,M,,1989,35,Open,66,65.66,202.5,210,220,220,120,125,-130,125,215,225,232.5,232.5,577.5,4,SBD,Single-ply
Gabriel de Almeida,Luxembourg,Luxembourg,M,,1990,34,Open,93,91.60,255,262.5,270,270,-165,165,-172.5,165,225,232.5,240,240,675,11,SBD,Single-ply
Sergii Bilyi,Ukraine,Ukraine,M,,1990,34,Open,105,104.17,370,385,395,395,280,290,-297.5,290,340,-350,-352.5,340,1025,3,SBD,Single-ply
Lawrence Koleilat,Italy,Italy,M,,1990,34,Open,66,65.10,210,217.5,222.5,222.5,142.5,150,155,155,220,235,255,255,632.5,2,SBD,Single-ply
Viktor Leskovets,Ukraine,Ukraine,M,,1990,34,Open,105,104.68,380,-390,395,395,307.5,317.5,325.5,325.5,302.5,-312.5,312.5,312.5,1033,2,SBD,Single-ply
Andrei Nicolae Irimie,Romania,Romania,M,,1990,34,Open,83,82.24,215,225,232.5,232.5,-255,255,-270,255,200,212.5,220,220,707.5,4,SBD,Single-ply
Hugo Duarte,UK,UK,M,,1990,34,Open,105,103.20,-335,-335,-335,-335,215,225,230,230,280,-300,-300,280,,DQ,SBD,Single-ply
Jordan Bollard,UK,UK,M,,1990,34,Open,120+,152.61,405,-425,-425,405,-277.5,277.5,287.5,287.5,270,295,305,305,997.5,3,SBD,Single-ply
Alexander Pelovski,Bulgaria,Bulgaria,M,,1991,33,Open,120,117.09,125,,,125,210,-222.5,-222.5,210,125,,,125,460,12,SBD,Single-ply
Zdravko Petrov,Bulgaria,Bulgaria,M,,1991,33,Open,83,83.00,285,300,310,310,190,200,-207.5,200,245,255,262.5,262.5,772.5,2,SBD,Single-ply
Andrii Stepanov,Ukraine,Ukraine,M,,1992,32,Open,74,73.97,265,275,285,285,-165,-165,165,165,247.5,-255,-257.5,247.5,697.5,4,SBD,Single-ply
Nicki Lentz,Denmark,Denmark,M,,1992,32,Open,105,102.15,405,417.5,430,430,275,-285,285,285,302.5,312.5,320,320,1035,1,SBD,Single-ply
Dan-Andrei Hideg,Romania,Romania,M,,1992,32,Open,93,92.25,235,242.5,-250,242.5,-227.5,-227.5,-227.5,-227.5,220,235,242.5,242.5,,DQ,SBD,Single-ply
Matthew Hallett,UK,UK,M,,1992,32,Open,93,91.89,320,335,345,345,-260,260,-277.5,260,215,225,230,230,835,6,SBD,Single-ply
Gintaras Blėdis,Lithuania,Lithuania,M,,1994,30,Open,74,73.63,255,265,272.5,272.5,175,185,187.5,187.5,220,-240,-240,220,680,5,SBD,Single-ply
Nickolaj Olsen,Denmark,Denmark,M,,1994,30,Open,93,92.34,317.5,325,332.5,332.5,185,190,-195,190,275,290,300,300,822.5,9,SBD,Single-ply
Jordan Ivanov,Bulgaria,Bulgaria,M,,1994,30,Open,93,92.90,300,315,-320,315,-210,-210,-210,-210,272.5,,,272.5,,DQ,SBD,Single-ply
Domingo González Martínez,Spain,Spain,M,,1994,30,Open,105,104.68,-265,280,-300,280,152.5,162.5,167.5,167.5,235,255,275,275,722.5,8,SBD,Single-ply
Matias Viiperi,Finland,Finland,M,,1994,30,Open,83,82.50,-317.5,317.5,-330,317.5,255,270,-280,270,275,295,-312.5,295,882.5,1,SBD,Single-ply
Samuel Lederleitner,Slovakia,Slovakia,M,,1994,30,Open,120,119.37,360,370,-377.5,370,250,-260,-260,250,-310,-310,310,310,930,7,SBD,Single-ply
Gabriel Ndoja,Luxembourg,Luxembourg,M,,1995,29,Open,120,119.56,305,317.5,325,325,235,242.5,-247.5,242.5,282.5,290,295,295,862.5,9,SBD,Single-ply
Kristián Slíž,Slovakia,Slovakia,M,,1995,29,Open,105,104.40,350,360,-370,360,230,-240,-240,230,290,-305,-305,290,880,6,SBD,Single-ply
Oliver Dahlkvist,Sweden,Sweden,M,,1995,29,Open,105,104.61,370,390,-397.5,390,290,300,-307.5,300,282.5,295,305,305,995,4,SBD,Single-ply
Andrii Shevchenko,Ukraine,Ukraine,M,,1995,29,Open,120+,155.82,410,430,-445,430,320,340,-350,340,320,340,360,360,1130,1,SBD,Single-ply
Gheorghe Moise,Romania,Romania,M,,1995,29,Open,66,64.86,235,242.5,-247.5,242.5,165,-170,-172.5,165,200,215,222.5,222.5,630,3,SBD,Single-ply
Francesco Cimini,Italy,Italy,M,,1995,29,Open,120,113.29,340,355,-370,355,272.5,282.5,292.5,292.5,270,285,292.5,292.5,940,6,SBD,Single-ply
Danylo Kovalyov,Ukraine,Ukraine,M,,1996,28,Open,120,119.17,-412.5,412.5,435,435,320,332.5,340,340,-310,310,317.5,317.5,1092.5,1,SBD,Single-ply
Bruno Murra,Italy,Italy,M,,1996,28,Open,93,92.68,305,320,342.5,342.5,190,-197.5,-197.5,190,275,297.5,-320,297.5,830,8,SBD,Single-ply
Michal Vavrinec,Slovakia,Slovakia,M,,1996,28,Open,93,92.42,300,310,320,320,245,-255,-255,245,265,-272.5,-275,265,830,7,SBD,Single-ply
Guðfinnur Snær Magnússon,Iceland,Iceland,M,,1997,27,Open,120+,168.14,385,-400,-400,385,-305,-305,-310,,295,310,-325,310,,DQ,SBD,Single-ply
Alexandru Cazacu,Romania,Romania,M,,1997,27,Open,120,119.32,315,-330,-342.5,315,-200,-200,-200,-200,-230,,,-230,,DQ,SBD,Single-ply
Kostiantyn Musiienko,Ukraine,Ukraine,M,,1997,27,Open,93,92.66,370,390,-405.5,390,315,-330,-330,315,315,-335,-335,315,1020,2,SBD,Single-ply
Felix Vallejo Ruiz,UK,UK,M,,1997,27,Open,93,92.68,252.5,270,-285,270,125,142.5,152.5,152.5,265,287.5,-317.5,287.5,710,10,SBD,Single-ply
Yannick Djankou,Luxembourg,Luxembourg,M,,1998,26,Open,83,81.42,220,232.5,240,240,-175,175,180,180,240,250,262.5,262.5,682.5,5,SBD,Single-ply
Kevin Nilles,Luxembourg,Luxembourg,M,,1998,26,Open,66,65.51,200,210,-217.5,210,-110,110,112.5,112.5,215,-230,-232.5,215,537.5,5,SBD,Single-ply
Eetu Kumpulainen,Finland,Finland,M,,1998,26,Open,74,73.76,255,270,277.5,277.5,230,-240,240,240,260,275,282.5,282.5,800,1,SBD,Single-ply
Maxim Andronache,Romania,Romania,M,,1998,26,Open,74,73.61,-215,215,-225,215,167.5,172.5,177.5,177.5,215,230,-247.5,230,622.5,7,SBD,Single-ply
Jack Johnson,UK,UK,M,,1998,26,Open,105,104.32,330,345,355,355,-237.5,237.5,-252.5,237.5,315,335,-342.5,335,927.5,5,SBD,Single-ply
Joseph Shaw,UK,UK,M,,1998,26,Open,120,114.94,255,275,-285,275,250,-262.5,-262.5,250,225,240,-245,240,765,11,SBD,Single-ply
Anton Mårtensson,Sweden,Sweden,M,,1998,26,Open,120+,137.73,360,372.5,-380,372.5,-255,255,-260,255,275,285,-292.5,285,912.5,5,SBD,Single-ply
Elias Brandecker,Austria,Austria,M,,1999,25,Open,93,89.57,320,337.5,350,350,235,245,255,255,265,280,287.5,287.5,892.5,3,SBD,Single-ply
Santeri Helin,Finland,Finland,M,,2000,24,Open,120,118.37,300,320,-335,320,210,-222.5,222.5,222.5,270,-290,290,290,832.5,10,SBD,Single-ply
Nojus Čypas,Lithuania,Lithuania,M,,2000,24,Open,74,73.51,240,255,270,270,145,155,-165,155,270,280,-305,280,705,3,SBD,Single-ply
Philippe Parage,Luxembourg,Luxembourg,M,,2001,23,Juniors,120+,124.72,320,330,-342.5,330,190,197.5,205,205,282.5,-292.5,-292.5,282.5,817.5,5,SBD,Single-ply
Radosław Dębicki,Poland,Poland,M,,2001,23,Juniors,66,65.72,210,225,235,235,150,-155,155,155,210,225,235,235,625,3,SBD,Single-ply
Knut Einar Skaar,Norway,Norway,M,,2001,23,Juniors,120,110.04,365,385,405.5,405.5,255,270,277.5,277.5,317.5,-337.5,337.5,337.5,1020.5,1,SBD,Single-ply
Kristian Filip Jakubec,Slovakia,Slovakia,M,,2001,23,Juniors,105,95.33,280,-295,-310,280,180,190,-200,190,272.5,282.5,292.5,292.5,762.5,3,SBD,Single-ply
Richard Borsc,Slovakia,Slovakia,M,,2001,23,Juniors,74,73.28,252.5,262.5,270,270,162.5,170,-177.5,170,210,225,-250,225,665,2,SBD,Single-ply
Cristian Moise,Romania,Romania,M,,2001,23,Open,59,57.71,207.5,215,225,225,120,122.5,125,125,190,197.5,-215,197.5,547.5,3,SBD,Single-ply
Grégory Ostyn,Belgium,Belgium,M,,2001,23,Juniors,74,73.58,225,245,260,260,190,-197.5,-197.5,190,285,-308,-308,285,735,1,SBD,Single-ply
Oscar Dahlkvist,Sweden,Sweden,M,,2001,23,Juniors,83,81.62,260,275,-285,275,160,170,-177.5,170,260,-275,-287.5,260,705,3,SBD,Single-ply
Matěj Jurka,Czechia,Czechia,M,,2001,23,Juniors,105,102.98,-310,310,317.5,317.5,-200,-200,200,200,250,267.5,-282.5,267.5,785,2,SBD,Single-ply
Dmytro Holinei,Ukraine,Ukraine,M,,2001,23,Juniors,120,119.11,330,345,360,360,210,220,-227.5,220,280,297.5,300,300,880,3,SBD,Single-ply
Ludvik Moen,Norway,Norway,M,,2002,22,Juniors,93,92.97,330,345,-352.5,345,232.5,240,-252.5,240,240,275,290,290,875,1,SBD,Single-ply
Piotr Marzysz,Poland,Poland,M,,2002,22,Juniors,120+,129.46,330,-345,-345,330,225,250,257.5,257.5,310,-312.5,-347.5,310,897.5,3,SBD,Single-ply
Lars Engø-Monsen,Norway,Norway,M,,2002,22,Juniors,83,82.59,300,315,325,325,232.5,-240,-240,232.5,260,277.5,295,295,852.5,1,SBD,Single-ply
Ondřej Šíp,Czechia,Czechia,M,,2002,22,Open,93,92.80,-360,360,-372.5,360,220,227.5,232.5,232.5,300,-310,-310,300,892.5,4,SBD,Single-ply
Martin Bach Thomsen,Denmark,Denmark,M,,2002,22,Juniors,120,118.53,340,355,367.5,367.5,270,277.5,280,280,255,270,-282.5,270,917.5,2,SBD,Single-ply
Moritz Taschner,Germany,Germany,M,,2002,22,Open,120+,159.49,385,405,-412.5,405,280,-310,-332.5,280,335,360,377.5,377.5,1062.5,2,SBD,Single-ply
Šimon Král,Czechia,Czechia,M,,2002,22,Juniors,120+,146.46,-340,340,367.5,367.5,220,232.5,-240,232.5,285,315,-337.5,315,915,2,SBD,Single-ply
Oleksii Lisenko,Ukraine,Ukraine,M,,2003,21,Juniors,120,114.27,-350,350,-360,350,230,242.5,252.5,252.5,250,267.5,275,275,877.5,4,SBD,Single-ply
Ondřej Smetaník,Czechia,Czechia,M,,2003,21,Juniors,93,92.32,275,-290,-290,275,-202.5,-202.5,202.5,202.5,245,260,-270,260,737.5,3,SBD,Single-ply
Marius Tutunaru,Romania,Romania,M,,2003,21,Juniors,105,94.71,215,225,240,240,150,162.5,165,165,230,250,-255,250,655,4,SBD,Single-ply
Dmytro Vovchok,Ukraine,Ukraine,M,,2003,21,Juniors,120+,130.85,320,-340,340,340,220,230,237.5,237.5,230,250,257.5,257.5,835,4,SBD,Single-ply
Martin Putera,Slovakia,Slovakia,M,,2003,21,Juniors,120+,143.00,300,320,-322.5,320,200,207.5,210,210,280,-290,-290,280,810,6,SBD,Single-ply
Ben Feiereisen,Luxembourg,Luxembourg,M,,2004,20,Juniors,93,90.76,200,212.5,220,220,110,117.5,125,125,200,212.5,220,220,565,4,SBD,Single-ply
Oleksandr Shulepa,Ukraine,Ukraine,M,,2004,20,Juniors,74,73.62,245,257.5,265,265,135,-137.5,-137.5,135,235,242.5,250,250,650,3,SBD,Single-ply
Domantas Barauskas,Lithuania,Lithuania,M,,2004,20,Juniors,105,104.95,240,260,,260,145,152.5,-165,152.5,240,-252.5,-252.5,240,652.5,5,SBD,Single-ply
Dmytro Rozhanskyi,Ukraine,Ukraine,M,,2004,20,Juniors,105,104.67,320,340,352.5,352.5,195,207.5,-215,207.5,300,315,-325,315,875,1,SBD,Single-ply
Axel Isberg,Sweden,Sweden,M,,2004,20,Juniors,120+,139.93,365,380,390,390,200,210,220,220,295,312.5,325,325,935,1,SBD,Single-ply
Tobias Soerensen,Denmark,Denmark,M,,2004,20,Juniors,74,73.72,-240,240,-252.5,240,152.5,157.5,-160,157.5,220,232.5,-247.5,232.5,630,4,SBD,Single-ply
Oleksandr Luzhbin,Ukraine,Ukraine,M,,2004,20,Juniors,83,82.50,-290,300,-315,300,-170,170,180,180,240,252.5,-262.5,252.5,732.5,2,SBD,Single-ply
Tarjei Gronaas,Norway,Norway,M,,2005,19,Juniors,59,58.63,187.5,197.5,-202.5,197.5,145,152.5,160,160,195,210,-220,210,567.5,1,SBD,Single-ply
Adam Stromko,Slovakia,Slovakia,M,,2005,19,Juniors,120,115.78,320,340,355,355,-210,-215,-215,,240,260,-280,260,,DQ,SBD,Single-ply
Dmytro Butenko,Ukraine,Ukraine,M,,2005,19,Juniors,66,65.63,255,-265,270,270,150,-160,-170,150,205,215,-225,215,635,2,SBD,Single-ply
Anton Savkin,Ukraine,Ukraine,M,,2005,19,Juniors,66,65.39,252.5,262.5,272.5,272.5,152.5,-157.5,-157.5,152.5,217.5,-230,230,230,655,1,SBD,Single-ply
Brandon Lee #10,UK,UK,M,,2005,19,Juniors,120,119.11,-262.5,-265,-265,,192.5,200,207.5,207.5,210,225,232.5,232.5,,DQ,SBD,Single-ply
Sebastian Bordea,Romania,Romania,M,,2005,19,Juniors,66,65.23,190,202.5,210,210,-120,120,125,125,200,212.5,-217.5,212.5,547.5,4,SBD,Single-ply
Davyd Rubets,Ukraine,Ukraine,M,,2005,19,Juniors,93,87.44,305,330,345,345,190,202.5,-210,202.5,250,265,270,270,817.5,2,SBD,Single-ply
Tom Senior,UK,UK,M,,2005,19,Juniors,74,72.65,-255,-262.5,-267.5,,125,140,-152.5,140,200,-215,215,215,,DQ,SBD,Single-ply
Gracjan Pieper,Poland,Poland,M,,2006,18,Sub-Juniors,120,105.50,-265,265,290,290,222.5,230,-235,230,240,255,265,265,785,1,SBD,Single-ply
Tomas Vicente Santana,Luxembourg,Luxembourg,M,,2006,18,Sub-Juniors,74,73.21,215,-225,225,225,147.5,155,160,160,195,205,-217.5,205,590,1,SBD,Single-ply
Vasyl' Zbandut,Ukraine,Ukraine,M,,2006,18,Sub-Juniors,93,88.28,325,-340,351,351,160,-172.5,172.5,172.5,280,-307.5,-307.5,280,803.5,1,SBD,Single-ply
Vladyslav Kliakovkin,Ukraine,Ukraine,M,,2006,18,Sub-Juniors,120,106.11,270,280,-290,280,150,160,-167.5,160,232.5,242.5,250,250,690,2,SBD,Single-ply
Jakub Golianek,Poland,Poland,M,,2006,18,Sub-Juniors,105,98.39,-290,295,305,305,-225,-225,-230,,250,262.5,-270,262.5,,DQ,SBD,Single-ply
Oskar Wencel,UK,UK,M,,2006,18,Sub-Juniors,83,82.38,235,245,255,255,127.5,142.5,145,145,220,230,235,235,635,4,SBD,Single-ply
Jorgen Jonvaag,Norway,Norway,M,,2006,18,Sub-Juniors,105,97.04,270,290,300,300,190,197.5,205,205,250,275,-282.5,275,780,1,SBD,Single-ply
Rares Matei,Romania,Romania,M,,2006,18,Sub-Juniors,120,105.25,202.5,-212.5,-222.5,202.5,-127.5,127.5,-142.5,127.5,182.5,202.5,212.5,212.5,542.5,3,SBD,Single-ply
Richard Novotný,Czechia,Czechia,M,,2006,18,Sub-Juniors,83,82.15,240,255,265,265,145,152.5,157.5,157.5,205,220,230,230,652.5,3,SBD,Single-ply
Vladyslav Bilous,Ukraine,Ukraine,M,,2006,18,Sub-Juniors,83,80.30,302.5,310.5,320,320,170,180,185,185,260,267.5,280,280,785,1,SBD,Single-ply
Václav Bartůněk,Czechia,Czechia,M,,2006,18,Sub-Juniors,93,90.72,270,280,-290,280,170,177.5,182.5,182.5,230,250,-270,250,712.5,2,SBD,Single-ply
Mykyta Motuzko,Ukraine,Ukraine,M,,2006,18,Sub-Juniors,105,98.25,-255,265,275,275,140,-147.5,150,150,-235,235,250,250,675,2,SBD,Single-ply
Radosław Rogala,Poland,Poland,M,,2007,17,Sub-Juniors,59,58.87,145,155,160,160,90,100,-105,100,145,155,-165,155,415,2,SBD,Single-ply
Kajetan Link,Poland,Poland,M,,2007,17,Sub-Juniors,66,62.45,155,165,170,170,107.5,112.5,115,115,160,175,177.5,177.5,462.5,2,SBD,Single-ply
Tomasz Mytych,Poland,Poland,M,,2007,17,Sub-Juniors,74,72.98,-165,-165,165,165,85,95,,95,165,-167.5,,165,425,5,SBD,Single-ply
Igor Dudek,Poland,Poland,M,,2007,17,Sub-Juniors,120+,121.25,215,230,240,240,125,135,142.5,142.5,190,205,217.5,217.5,600,1,SBD,Single-ply
Jakub Pudmarcik,Slovakia,Slovakia,M,,2007,17,Sub-Juniors,120+,123.30,200,217.5,-227.5,217.5,120,130,-137.5,130,192.5,207.5,-220,207.5,555,2,SBD,Single-ply
Eden Scantlebury-Watson,UK,UK,M,,2007,17,Sub-Juniors,74,73.72,200,-210,-210,200,-90,97.5,105,105,175,185,-187.5,185,490,3,SBD,Single-ply
Mykola Hodunov,Ukraine,Ukraine,M,,2007,17,Sub-Juniors,83,81.35,280,295,310,310,150,160,165,165,250,265,-277.5,265,740,2,SBD,Single-ply
David Stanis,Romania,Romania,M,,2007,17,Sub-Juniors,93,89.56,172.5,182.5,-202.5,182.5,122.5,127.5,-132.5,127.5,-162.5,162.5,172.5,172.5,482.5,4,SBD,Single-ply
Hector Willcocks,UK,UK,M,,2007,17,Sub-Juniors,105,103.93,220,240,257.5,257.5,145,150,152.5,152.5,160,180,192.5,192.5,602.5,3,SBD,Single-ply
Egor Palczewski,Poland,Poland,M,,2008,16,Sub-Juniors,53,52.61,100,110,112.5,112.5,55,60,-62.5,60,105,110,117.5,117.5,290,3,SBD,Single-ply
Jakub Haupt,Poland,Poland,M,,2008,16,Sub-Juniors,66,65.49,145,162.5,-165,162.5,-85,85,97.5,97.5,170,190,-205,190,450,3,SBD,Single-ply
Filip Szałaj,Poland,Poland,M,,2008,16,Sub-Juniors,93,91.21,250,-265,-265,250,160,-167.5,170,170,210,220,-225,220,640,3,SBD,Single-ply
Adrian Stiskal,Slovakia,Slovakia,M,,2008,16,Sub-Juniors,74,72.83,185,-192.5,-200,185,110,115,122.5,122.5,162.5,172.5,-182.5,172.5,480,4,SBD,Single-ply
Arsen Stefanyshyn,Ukraine,Ukraine,M,,2008,16,Sub-Juniors,59,58.64,170,182.5,190,190,-102.5,102.5,112.5,112.5,137.5,152.5,-165,152.5,455,1,SBD,Single-ply
Kaloyan Panayotov,Bulgaria,Bulgaria,M,,2008,16,Sub-Juniors,74,70.47,190,197.5,202.5,202.5,130,135,140,140,200,210,215,215,557.5,2,SBD,Single-ply
Oleksandr Shmatko,Ukraine,Ukraine,M,,2009,15,Sub-Juniors,53,52.95,-140,140,155,155,-60,70,75,75,140,150,160,160,390,1,SBD,Single-ply
Oleksii Bychkov,Ukraine,Ukraine,M,,2009,15,Sub-Juniors,66,65.42,-200,200,-215,200,-95,97.5,102.5,102.5,180,-190,197.5,197.5,500,1,SBD,Single-ply
Maksym Cheviuk,Ukraine,Ukraine,M,,2009,15,Sub-Juniors,53,52.50,140,145,150,150,65,70,75,75,140,152.5,-155,152.5,377.5,2,SBD,Single-ply
