Division,WeightClassKg,Place,Name,Team,BodyweightKg,Best3SquatKg,Best3BenchKg,Best3DeadliftKg,TotalKg,Equipment,Event,Sex,BirthDate
Boys,55.79,1,Cayne Dickerson,Pineland West Sabine,54.88,138.35,81.65,138.35,358.34,Unlimited,SBD,M,
Boys,55.79,2,LaMare Williams,Pineland West Sabine,52.07,88.45,52.16,102.06,242.67,Unlimited,SBD,M,
Boys,55.79,DQ,Tristan McCauley,Pineland West Sabine,52.89,,,,,Unlimited,SBD,M,
Boys,59.87,DQ,Dario Reyes,Shelbyville,59.42,,,,,Unlimited,SBD,M,
Boys,67.13,1,Kameron Striegel,Pineland West Sabine,65.59,210.92,124.74,213.19,548.85,Unlimited,SBD,M,
Boys,67.13,2,Corey Holcomb,Pineland West Sabine,64.23,149.69,102.06,179.17,430.91,Unlimited,SBD,M,
Boys,67.13,3,JaDon Clifton,San Augustine,61.42,158.76,97.52,149.69,405.97,Unlimited,SBD,M,
Boys,67.13,DQ,Cj Ford,Pineland West Sabine,65.32,,,,,Unlimited,SBD,M,
Boys,67.13,DQ,Braeden Jordan,Hemphill,66.86,,,,,Unlimited,SBD,M,
Boys,67.13,DQ,Tyler Striegel,Pineland West Sabine,66.04,,,,,Unlimited,SBD,M,
Boys,74.84,1,Ronnie Williams,Shelbyville,74.57,170.1,108.86,188.24,467.2,Unlimited,SBD,M,
Boys,74.84,2,Tristan Vickers,Shelbyville,71.94,147.42,106.59,136.08,390.09,Unlimited,SBD,M,
Boys,74.84,3,Christian Chavez,Pineland West Sabine,69.13,131.54,81.65,154.22,367.41,Unlimited,SBD,M,
Boys,74.84,4,Hunter Crawford,Hemphill,67.49,133.81,74.84,124.74,333.39,Unlimited,SBD,M,
Boys,74.84,5,Trevor Ballard,Hemphill,68.04,120.2,74.84,124.74,319.78,Unlimited,SBD,M,
Boys,74.84,6,Mason Reynolds,Hemphill,72.03,113.4,52.16,124.74,290.3,Unlimited,SBD,M,
Boys,82.1,1,Sergio Reyes,Shelbyville,80.92,190.51,113.4,190.51,494.42,Unlimited,SBD,M,
Boys,82.1,2,Jordan Daniels #2,Hemphill,81.1,188.24,108.86,183.7,480.81,Unlimited,SBD,M,
Boys,82.1,3,Trevon McDaniel,Hemphill,76.84,151.95,90.72,183.7,426.38,Unlimited,SBD,M,
Boys,82.1,4,Kyle Parnell,Pineland West Sabine,79.29,147.42,83.91,167.83,399.16,Unlimited,SBD,M,
Boys,82.1,5,Ethan Powell,Pineland West Sabine,76.57,142.88,83.91,167.83,394.63,Unlimited,SBD,M,
Boys,82.1,6,Sawyer Fiscus,Hemphill,75.84,136.08,81.65,142.88,360.61,Unlimited,SBD,M,
Boys,89.81,1,Chesney Wilkins,Shelbyville,89.72,192.78,127.01,197.31,517.1,Unlimited,SBD,M,
Boys,89.81,2,Justus Fowler,Hemphill,89.72,183.7,83.91,183.7,451.32,Unlimited,SBD,M,
Boys,89.81,3,Johntorian Farr,Hemphill,88,174.63,88.45,183.7,446.79,Unlimited,SBD,M,
Boys,99.79,1,Jose Gonzalez,Shelbyville,99.16,226.8,145.15,226.8,598.74,Unlimited,SBD,M,
Boys,99.79,2,Kane Smith,Hemphill,95.44,226.8,138.35,208.65,573.79,Unlimited,SBD,M,
Boys,99.79,3,Jarrell Williams,Hemphill,96.34,201.85,117.93,195.04,514.83,Unlimited,SBD,M,
Boys,99.79,4,Courtney Davis,San Augustine,91.81,179.17,102.06,165.56,446.79,Unlimited,SBD,M,
Boys,99.79,5,Allary Daniels,San Augustine,91.63,136.08,86.18,147.42,369.68,Unlimited,SBD,M,
Boys,99.79,6,Terry Cooper,San Augustine,94.53,122.47,83.91,149.69,356.07,Unlimited,SBD,M,
Boys,99.79,7,X'Twaan Sheperd,San Augustine,95.71,117.93,83.91,154.22,356.07,Unlimited,SBD,M,
Boys,99.79,DQ,Hunter Primrose,Pineland West Sabine,93.98,,,,,Unlimited,SBD,M,
Boys,109.77,1,JaKameron Roberts,San Augustine,106.68,181.44,120.2,213.19,514.83,Unlimited,SBD,M,
Boys,109.77,2,Rayburn McClelland,Pineland West Sabine,104.46,183.7,102.06,215.46,501.22,Unlimited,SBD,M,
Boys,109.77,3,Tucker Stovall,Shelbyville,109.41,195.04,138.35,165.56,498.95,Unlimited,SBD,M,
Boys,124.74,1,Ely Corbello,Hemphill,116.94,183.7,127.01,188.24,498.95,Unlimited,SBD,M,
Boys,124.74,2,Konner Miller,San Augustine,124.28,181.44,108.86,195.04,485.34,Unlimited,SBD,M,
Boys,124.74,3,Brady Bishop,Hemphill,112.76,167.83,92.99,167.83,428.64,Unlimited,SBD,M,
Boys,124.74,4,Esteban Antimo,Hemphill,123.01,165.56,79.38,145.15,390.09,Unlimited,SBD,M,
Boys,124.74,5,Cleveland Smith,Pineland West Sabine,116.3,147.42,83.91,142.88,374.21,Unlimited,SBD,M,
Boys,139.71,1,Stephen Morrison,Pineland West Sabine,130.73,219.99,131.54,199.58,551.11,Unlimited,SBD,M,
Boys,139.71+,1,Keyston Simmons,Hemphill,162.57,244.94,124.74,195.04,564.72,Unlimited,SBD,M,
