2020-05-15 20:29:53,410 ERROR: Exception on /index [GET] [in /Users/reckony/Desktop/UGSTUDIA/wzorce_projektowe/microblog_final/venv/lib/python3.7/site-packages/flask/app.py:1892]
Traceback (most recent call last):
  File "/Users/reckony/Desktop/UGSTUDIA/wzorce_projektowe/microblog_final/venv/lib/python3.7/site-packages/flask/app.py", line 2447, in wsgi_app
    response = self.full_dispatch_request()
  File "/Users/reckony/Desktop/UGSTUDIA/wzorce_projektowe/microblog_final/venv/lib/python3.7/site-packages/flask/app.py", line 1952, in full_dispatch_request
    rv = self.handle_user_exception(e)
  File "/Users/reckony/Desktop/UGSTUDIA/wzorce_projektowe/microblog_final/venv/lib/python3.7/site-packages/flask/app.py", line 1821, in handle_user_exception
    reraise(exc_type, exc_value, tb)
  File "/Users/reckony/Desktop/UGSTUDIA/wzorce_projektowe/microblog_final/venv/lib/python3.7/site-packages/flask/_compat.py", line 39, in reraise
    raise value
  File "/Users/reckony/Desktop/UGSTUDIA/wzorce_projektowe/microblog_final/venv/lib/python3.7/site-packages/flask/app.py", line 1950, in full_dispatch_request
    rv = self.dispatch_request()
  File "/Users/reckony/Desktop/UGSTUDIA/wzorce_projektowe/microblog_final/venv/lib/python3.7/site-packages/flask/app.py", line 1936, in dispatch_request
    return self.view_functions[rule.endpoint](**req.view_args)
  File "/Users/reckony/Desktop/UGSTUDIA/wzorce_projektowe/microblog_final/venv/lib/python3.7/site-packages/flask_login/utils.py", line 272, in decorated_view
    return func(*args, **kwargs)
  File "/Users/reckony/Desktop/UGSTUDIA/wzorce_projektowe/microblog_final/App/main/routes.py", line 48, in index
    prev_url=prev_url)
  File "/Users/reckony/Desktop/UGSTUDIA/wzorce_projektowe/microblog_final/venv/lib/python3.7/site-packages/flask/templating.py", line 140, in render_template
    ctx.app,
  File "/Users/reckony/Desktop/UGSTUDIA/wzorce_projektowe/microblog_final/venv/lib/python3.7/site-packages/flask/templating.py", line 120, in _render
    rv = template.render(context)
  File "/Users/reckony/Desktop/UGSTUDIA/wzorce_projektowe/microblog_final/venv/lib/python3.7/site-packages/jinja2/environment.py", line 1090, in render
    self.environment.handle_exception()
  File "/Users/reckony/Desktop/UGSTUDIA/wzorce_projektowe/microblog_final/venv/lib/python3.7/site-packages/jinja2/environment.py", line 832, in handle_exception
    reraise(*rewrite_traceback_stack(source=source))
  File "/Users/reckony/Desktop/UGSTUDIA/wzorce_projektowe/microblog_final/venv/lib/python3.7/site-packages/jinja2/_compat.py", line 28, in reraise
    raise value.with_traceback(tb)
  File "/Users/reckony/Desktop/UGSTUDIA/wzorce_projektowe/microblog_final/App/templates/index.html", line 2, in top-level template code
    {% import 'bootstrap/wtf.html' as wtf %}
  File "/Users/reckony/Desktop/UGSTUDIA/wzorce_projektowe/microblog_final/App/templates/base.html", line 2, in top-level template code
    {% from "_form_helper.html" import render_field %}
  File "/Users/reckony/Desktop/UGSTUDIA/wzorce_projektowe/microblog_final/venv/lib/python3.7/site-packages/flask_bootstrap/templates/bootstrap/base.html", line 1, in top-level template code
    {% block doc -%}
  File "/Users/reckony/Desktop/UGSTUDIA/wzorce_projektowe/microblog_final/venv/lib/python3.7/site-packages/flask_bootstrap/templates/bootstrap/base.html", line 4, in block "doc"
    {%- block html %}
  File "/Users/reckony/Desktop/UGSTUDIA/wzorce_projektowe/microblog_final/venv/lib/python3.7/site-packages/flask_bootstrap/templates/bootstrap/base.html", line 20, in block "html"
    {% block body -%}
  File "/Users/reckony/Desktop/UGSTUDIA/wzorce_projektowe/microblog_final/venv/lib/python3.7/site-packages/flask_bootstrap/templates/bootstrap/base.html", line 21, in block "body"
    {% block navbar %}
  File "/Users/reckony/Desktop/UGSTUDIA/wzorce_projektowe/microblog_final/App/templates/base.html", line 36, in block "navbar"
    <a class="navbar-brand" href="{{ url_for('main.search_user', username=user.username) }}">Search</a>
  File "/Users/reckony/Desktop/UGSTUDIA/wzorce_projektowe/microblog_final/venv/lib/python3.7/site-packages/jinja2/environment.py", line 471, in getattr
    return getattr(obj, attribute)
jinja2.exceptions.UndefinedError: 'user' is undefined
2020-05-15 20:30:02,331 ERROR: Exception on /iexplore [GET] [in /Users/reckony/Desktop/UGSTUDIA/wzorce_projektowe/microblog_final/venv/lib/python3.7/site-packages/flask/app.py:1892]
Traceback (most recent call last):
  File "/Users/reckony/Desktop/UGSTUDIA/wzorce_projektowe/microblog_final/venv/lib/python3.7/site-packages/flask/app.py", line 1950, in full_dispatch_request
    rv = self.dispatch_request()
  File "/Users/reckony/Desktop/UGSTUDIA/wzorce_projektowe/microblog_final/venv/lib/python3.7/site-packages/flask/app.py", line 1926, in dispatch_request
    self.raise_routing_exception(req)
  File "/Users/reckony/Desktop/UGSTUDIA/wzorce_projektowe/microblog_final/venv/lib/python3.7/site-packages/flask/app.py", line 1908, in raise_routing_exception
    raise request.routing_exception
  File "/Users/reckony/Desktop/UGSTUDIA/wzorce_projektowe/microblog_final/venv/lib/python3.7/site-packages/flask/ctx.py", line 350, in match_request
    result = self.url_adapter.match(return_rule=True)
  File "/Users/reckony/Desktop/UGSTUDIA/wzorce_projektowe/microblog_final/venv/lib/python3.7/site-packages/werkzeug/routing.py", line 1945, in match
    raise NotFound()
werkzeug.exceptions.NotFound: 404 Not Found: The requested URL was not found on the server. If you entered the URL manually please check your spelling and try again.

During handling of the above exception, another exception occurred:

Traceback (most recent call last):
  File "/Users/reckony/Desktop/UGSTUDIA/wzorce_projektowe/microblog_final/venv/lib/python3.7/site-packages/flask/app.py", line 2447, in wsgi_app
    response = self.full_dispatch_request()
  File "/Users/reckony/Desktop/UGSTUDIA/wzorce_projektowe/microblog_final/venv/lib/python3.7/site-packages/flask/app.py", line 1952, in full_dispatch_request
    rv = self.handle_user_exception(e)
  File "/Users/reckony/Desktop/UGSTUDIA/wzorce_projektowe/microblog_final/venv/lib/python3.7/site-packages/flask/app.py", line 1816, in handle_user_exception
    return self.handle_http_exception(e)
  File "/Users/reckony/Desktop/UGSTUDIA/wzorce_projektowe/microblog_final/venv/lib/python3.7/site-packages/flask/app.py", line 1744, in handle_http_exception
    return handler(e)
  File "/Users/reckony/Desktop/UGSTUDIA/wzorce_projektowe/microblog_final/App/errors/error_handlers.py", line 8, in not_found_error
    return render_template('errors/error_404.html'), 404
  File "/Users/reckony/Desktop/UGSTUDIA/wzorce_projektowe/microblog_final/venv/lib/python3.7/site-packages/flask/templating.py", line 140, in render_template
    ctx.app,
  File "/Users/reckony/Desktop/UGSTUDIA/wzorce_projektowe/microblog_final/venv/lib/python3.7/site-packages/flask/templating.py", line 120, in _render
    rv = template.render(context)
  File "/Users/reckony/Desktop/UGSTUDIA/wzorce_projektowe/microblog_final/venv/lib/python3.7/site-packages/jinja2/environment.py", line 1090, in render
    self.environment.handle_exception()
  File "/Users/reckony/Desktop/UGSTUDIA/wzorce_projektowe/microblog_final/venv/lib/python3.7/site-packages/jinja2/environment.py", line 832, in handle_exception
    reraise(*rewrite_traceback_stack(source=source))
  File "/Users/reckony/Desktop/UGSTUDIA/wzorce_projektowe/microblog_final/venv/lib/python3.7/site-packages/jinja2/_compat.py", line 28, in reraise
    raise value.with_traceback(tb)
  File "/Users/reckony/Desktop/UGSTUDIA/wzorce_projektowe/microblog_final/App/templates/errors/error_404.html", line 1, in top-level template code
    {% extends "base.html" %}
  File "/Users/reckony/Desktop/UGSTUDIA/wzorce_projektowe/microblog_final/App/templates/base.html", line 2, in top-level template code
    {% from "_form_helper.html" import render_field %}
  File "/Users/reckony/Desktop/UGSTUDIA/wzorce_projektowe/microblog_final/venv/lib/python3.7/site-packages/flask_bootstrap/templates/bootstrap/base.html", line 1, in top-level template code
    {% block doc -%}
  File "/Users/reckony/Desktop/UGSTUDIA/wzorce_projektowe/microblog_final/venv/lib/python3.7/site-packages/flask_bootstrap/templates/bootstrap/base.html", line 4, in block "doc"
    {%- block html %}
  File "/Users/reckony/Desktop/UGSTUDIA/wzorce_projektowe/microblog_final/venv/lib/python3.7/site-packages/flask_bootstrap/templates/bootstrap/base.html", line 20, in block "html"
    {% block body -%}
  File "/Users/reckony/Desktop/UGSTUDIA/wzorce_projektowe/microblog_final/venv/lib/python3.7/site-packages/flask_bootstrap/templates/bootstrap/base.html", line 21, in block "body"
    {% block navbar %}
  File "/Users/reckony/Desktop/UGSTUDIA/wzorce_projektowe/microblog_final/App/templates/base.html", line 36, in block "navbar"
    <a class="navbar-brand" href="{{ url_for('main.search_user', username=user.username) }}">Search</a>
  File "/Users/reckony/Desktop/UGSTUDIA/wzorce_projektowe/microblog_final/venv/lib/python3.7/site-packages/jinja2/environment.py", line 471, in getattr
    return getattr(obj, attribute)
jinja2.exceptions.UndefinedError: 'user' is undefined
