2020-05-16 11:52:16,719 ERROR: Exception on /explore [GET] [in /Users/reckony/Desktop/UGSTUDIA/wzorce_projektowe/microblog_final/venv/lib/python3.7/site-packages/flask/app.py:1892]
Traceback (most recent call last):
  File "/Users/reckony/Desktop/UGSTUDIA/wzorce_projektowe/microblog_final/venv/lib/python3.7/site-packages/flask/app.py", line 2447, in wsgi_app
    response = self.full_dispatch_request()
  File "/Users/reckony/Desktop/UGSTUDIA/wzorce_projektowe/microblog_final/venv/lib/python3.7/site-packages/flask/app.py", line 1952, in full_dispatch_request
    rv = self.handle_user_exception(e)
  File "/Users/reckony/Desktop/UGSTUDIA/wzorce_projektowe/microblog_final/venv/lib/python3.7/site-packages/flask/app.py", line 1821, in handle_user_exception
    reraise(exc_type, exc_value, tb)
  File "/Users/reckony/Desktop/UGSTUDIA/wzorce_projektowe/microblog_final/venv/lib/python3.7/site-packages/flask/_compat.py", line 39, in reraise
    raise value
  File "/Users/reckony/Desktop/UGSTUDIA/wzorce_projektowe/microblog_final/venv/lib/python3.7/site-packages/flask/app.py", line 1950, in full_dispatch_request
    rv = self.dispatch_request()
  File "/Users/reckony/Desktop/UGSTUDIA/wzorce_projektowe/microblog_final/venv/lib/python3.7/site-packages/flask/app.py", line 1936, in dispatch_request
    return self.view_functions[rule.endpoint](**req.view_args)
  File "/Users/reckony/Desktop/UGSTUDIA/wzorce_projektowe/microblog_final/venv/lib/python3.7/site-packages/flask_login/utils.py", line 272, in decorated_view
    return func(*args, **kwargs)
  File "/Users/reckony/Desktop/UGSTUDIA/wzorce_projektowe/microblog_final/App/main/routes.py", line 62, in explore
    next_url=next_url, prev_url=prev_url)
  File "/Users/reckony/Desktop/UGSTUDIA/wzorce_projektowe/microblog_final/venv/lib/python3.7/site-packages/flask/templating.py", line 140, in render_template
    ctx.app,
  File "/Users/reckony/Desktop/UGSTUDIA/wzorce_projektowe/microblog_final/venv/lib/python3.7/site-packages/flask/templating.py", line 120, in _render
    rv = template.render(context)
  File "/Users/reckony/Desktop/UGSTUDIA/wzorce_projektowe/microblog_final/venv/lib/python3.7/site-packages/jinja2/environment.py", line 1090, in render
    self.environment.handle_exception()
  File "/Users/reckony/Desktop/UGSTUDIA/wzorce_projektowe/microblog_final/venv/lib/python3.7/site-packages/jinja2/environment.py", line 832, in handle_exception
    reraise(*rewrite_traceback_stack(source=source))
  File "/Users/reckony/Desktop/UGSTUDIA/wzorce_projektowe/microblog_final/venv/lib/python3.7/site-packages/jinja2/_compat.py", line 28, in reraise
    raise value.with_traceback(tb)
  File "/Users/reckony/Desktop/UGSTUDIA/wzorce_projektowe/microblog_final/App/templates/index.html", line 1, in top-level template code
    {% extends "base.html" %}
  File "/Users/reckony/Desktop/UGSTUDIA/wzorce_projektowe/microblog_final/venv/lib/python3.7/site-packages/jinja2/environment.py", line 832, in handle_exception
    reraise(*rewrite_traceback_stack(source=source))
  File "/Users/reckony/Desktop/UGSTUDIA/wzorce_projektowe/microblog_final/venv/lib/python3.7/site-packages/jinja2/_compat.py", line 28, in reraise
    raise value.with_traceback(tb)
  File "/Users/reckony/Desktop/UGSTUDIA/wzorce_projektowe/microblog_final/App/templates/base.html", line 47, in template
    {% endblock %}
jinja2.exceptions.TemplateSyntaxError: Encountered unknown tag 'endblock'. You probably made a nesting mistake. Jinja is expecting this tag, but currently looking for 'endif'. The innermost block that needs to be closed is 'if'.
2020-05-16 11:52:17,799 ERROR: Exception on /explore [GET] [in /Users/reckony/Desktop/UGSTUDIA/wzorce_projektowe/microblog_final/venv/lib/python3.7/site-packages/flask/app.py:1892]
Traceback (most recent call last):
  File "/Users/reckony/Desktop/UGSTUDIA/wzorce_projektowe/microblog_final/venv/lib/python3.7/site-packages/flask/app.py", line 2447, in wsgi_app
    response = self.full_dispatch_request()
  File "/Users/reckony/Desktop/UGSTUDIA/wzorce_projektowe/microblog_final/venv/lib/python3.7/site-packages/flask/app.py", line 1952, in full_dispatch_request
    rv = self.handle_user_exception(e)
  File "/Users/reckony/Desktop/UGSTUDIA/wzorce_projektowe/microblog_final/venv/lib/python3.7/site-packages/flask/app.py", line 1821, in handle_user_exception
    reraise(exc_type, exc_value, tb)
  File "/Users/reckony/Desktop/UGSTUDIA/wzorce_projektowe/microblog_final/venv/lib/python3.7/site-packages/flask/_compat.py", line 39, in reraise
    raise value
  File "/Users/reckony/Desktop/UGSTUDIA/wzorce_projektowe/microblog_final/venv/lib/python3.7/site-packages/flask/app.py", line 1950, in full_dispatch_request
    rv = self.dispatch_request()
  File "/Users/reckony/Desktop/UGSTUDIA/wzorce_projektowe/microblog_final/venv/lib/python3.7/site-packages/flask/app.py", line 1936, in dispatch_request
    return self.view_functions[rule.endpoint](**req.view_args)
  File "/Users/reckony/Desktop/UGSTUDIA/wzorce_projektowe/microblog_final/venv/lib/python3.7/site-packages/flask_login/utils.py", line 272, in decorated_view
    return func(*args, **kwargs)
  File "/Users/reckony/Desktop/UGSTUDIA/wzorce_projektowe/microblog_final/App/main/routes.py", line 62, in explore
    next_url=next_url, prev_url=prev_url)
  File "/Users/reckony/Desktop/UGSTUDIA/wzorce_projektowe/microblog_final/venv/lib/python3.7/site-packages/flask/templating.py", line 140, in render_template
    ctx.app,
  File "/Users/reckony/Desktop/UGSTUDIA/wzorce_projektowe/microblog_final/venv/lib/python3.7/site-packages/flask/templating.py", line 120, in _render
    rv = template.render(context)
  File "/Users/reckony/Desktop/UGSTUDIA/wzorce_projektowe/microblog_final/venv/lib/python3.7/site-packages/jinja2/environment.py", line 1090, in render
    self.environment.handle_exception()
  File "/Users/reckony/Desktop/UGSTUDIA/wzorce_projektowe/microblog_final/venv/lib/python3.7/site-packages/jinja2/environment.py", line 832, in handle_exception
    reraise(*rewrite_traceback_stack(source=source))
  File "/Users/reckony/Desktop/UGSTUDIA/wzorce_projektowe/microblog_final/venv/lib/python3.7/site-packages/jinja2/_compat.py", line 28, in reraise
    raise value.with_traceback(tb)
  File "/Users/reckony/Desktop/UGSTUDIA/wzorce_projektowe/microblog_final/App/templates/index.html", line 1, in top-level template code
    {% extends "base.html" %}
  File "/Users/reckony/Desktop/UGSTUDIA/wzorce_projektowe/microblog_final/venv/lib/python3.7/site-packages/jinja2/environment.py", line 832, in handle_exception
    reraise(*rewrite_traceback_stack(source=source))
  File "/Users/reckony/Desktop/UGSTUDIA/wzorce_projektowe/microblog_final/venv/lib/python3.7/site-packages/jinja2/_compat.py", line 28, in reraise
    raise value.with_traceback(tb)
  File "/Users/reckony/Desktop/UGSTUDIA/wzorce_projektowe/microblog_final/App/templates/base.html", line 47, in template
    {% endblock %}
jinja2.exceptions.TemplateSyntaxError: Encountered unknown tag 'endblock'. You probably made a nesting mistake. Jinja is expecting this tag, but currently looking for 'endif'. The innermost block that needs to be closed is 'if'.
2020-05-16 11:57:18,675 INFO: Microtweet startup [in /Users/reckony/Desktop/UGSTUDIA/wzorce_projektowe/microblog_final/App/__init__.py:75]
2020-05-16 12:00:32,610 INFO: Microtweet startup [in /Users/reckony/Desktop/UGSTUDIA/wzorce_projektowe/microblog_final/App/__init__.py:75]
2020-05-16 12:01:34,671 INFO: Microtweet startup [in /Users/reckony/Desktop/UGSTUDIA/wzorce_projektowe/microblog_final/App/__init__.py:75]
2020-05-16 12:01:58,995 INFO: Microtweet startup [in /Users/reckony/Desktop/UGSTUDIA/wzorce_projektowe/microblog_final/App/__init__.py:75]
2020-05-16 12:03:03,841 INFO: Microtweet startup [in /Users/reckony/Desktop/UGSTUDIA/wzorce_projektowe/microblog_final/App/__init__.py:75]
2020-05-16 12:04:12,285 INFO: Microtweet startup [in /Users/reckony/Desktop/UGSTUDIA/wzorce_projektowe/microblog_final/App/__init__.py:75]
2020-05-16 12:07:36,581 INFO: Microtweet startup [in /Users/reckony/Desktop/UGSTUDIA/wzorce_projektowe/microblog_final/App/__init__.py:75]
2020-05-16 12:07:45,006 ERROR: Exception on /search [POST] [in /Users/reckony/Desktop/UGSTUDIA/wzorce_projektowe/microblog_final/venv/lib/python3.7/site-packages/flask/app.py:1892]
Traceback (most recent call last):
  File "/Users/reckony/Desktop/UGSTUDIA/wzorce_projektowe/microblog_final/venv/lib/python3.7/site-packages/flask/app.py", line 2447, in wsgi_app
    response = self.full_dispatch_request()
  File "/Users/reckony/Desktop/UGSTUDIA/wzorce_projektowe/microblog_final/venv/lib/python3.7/site-packages/flask/app.py", line 1952, in full_dispatch_request
    rv = self.handle_user_exception(e)
  File "/Users/reckony/Desktop/UGSTUDIA/wzorce_projektowe/microblog_final/venv/lib/python3.7/site-packages/flask/app.py", line 1821, in handle_user_exception
    reraise(exc_type, exc_value, tb)
  File "/Users/reckony/Desktop/UGSTUDIA/wzorce_projektowe/microblog_final/venv/lib/python3.7/site-packages/flask/_compat.py", line 39, in reraise
    raise value
  File "/Users/reckony/Desktop/UGSTUDIA/wzorce_projektowe/microblog_final/venv/lib/python3.7/site-packages/flask/app.py", line 1950, in full_dispatch_request
    rv = self.dispatch_request()
  File "/Users/reckony/Desktop/UGSTUDIA/wzorce_projektowe/microblog_final/venv/lib/python3.7/site-packages/flask/app.py", line 1936, in dispatch_request
    return self.view_functions[rule.endpoint](**req.view_args)
  File "/Users/reckony/Desktop/UGSTUDIA/wzorce_projektowe/microblog_final/venv/lib/python3.7/site-packages/flask_login/utils.py", line 272, in decorated_view
    return func(*args, **kwargs)
  File "/Users/reckony/Desktop/UGSTUDIA/wzorce_projektowe/microblog_final/App/main/routes.py", line 133, in search_user
    posts = user.posts.order_by(Post.timestamp.desc()).paginate(
AttributeError: 'BaseQuery' object has no attribute 'posts'
2020-05-16 12:10:28,228 INFO: Microtweet startup [in /Users/reckony/Desktop/UGSTUDIA/wzorce_projektowe/microblog_final/App/__init__.py:75]
