2020-05-16 15:37:37,501 ERROR: Exception on /auth/register [POST] [in /Users/reckony/Desktop/UGSTUDIA/wzorce_projektowe/microblog_final/venv/lib/python3.7/site-packages/flask/app.py:1892]
Traceback (most recent call last):
  File "/Users/reckony/Desktop/UGSTUDIA/wzorce_projektowe/microblog_final/venv/lib/python3.7/site-packages/flask/app.py", line 2447, in wsgi_app
    response = self.full_dispatch_request()
  File "/Users/reckony/Desktop/UGSTUDIA/wzorce_projektowe/microblog_final/venv/lib/python3.7/site-packages/flask/app.py", line 1952, in full_dispatch_request
    rv = self.handle_user_exception(e)
  File "/Users/reckony/Desktop/UGSTUDIA/wzorce_projektowe/microblog_final/venv/lib/python3.7/site-packages/flask/app.py", line 1821, in handle_user_exception
    reraise(exc_type, exc_value, tb)
  File "/Users/reckony/Desktop/UGSTUDIA/wzorce_projektowe/microblog_final/venv/lib/python3.7/site-packages/flask/_compat.py", line 39, in reraise
    raise value
  File "/Users/reckony/Desktop/UGSTUDIA/wzorce_projektowe/microblog_final/venv/lib/python3.7/site-packages/flask/app.py", line 1950, in full_dispatch_request
    rv = self.dispatch_request()
  File "/Users/reckony/Desktop/UGSTUDIA/wzorce_projektowe/microblog_final/venv/lib/python3.7/site-packages/flask/app.py", line 1936, in dispatch_request
    return self.view_functions[rule.endpoint](**req.view_args)
  File "/Users/reckony/Desktop/UGSTUDIA/wzorce_projektowe/microblog_final/App/auth/routes.py", line 41, in register
    if form.validate_on_submit():
  File "/Users/reckony/Desktop/UGSTUDIA/wzorce_projektowe/microblog_final/venv/lib/python3.7/site-packages/flask_wtf/form.py", line 100, in validate_on_submit
    return self.is_submitted() and self.validate()
  File "/Users/reckony/Desktop/UGSTUDIA/wzorce_projektowe/microblog_final/venv/lib/python3.7/site-packages/wtforms/form.py", line 318, in validate
    return super(Form, self).validate(extra)
  File "/Users/reckony/Desktop/UGSTUDIA/wzorce_projektowe/microblog_final/venv/lib/python3.7/site-packages/wtforms/form.py", line 150, in validate
    if not field.validate(self, extra):
  File "/Users/reckony/Desktop/UGSTUDIA/wzorce_projektowe/microblog_final/venv/lib/python3.7/site-packages/wtforms/fields/core.py", line 226, in validate
    stop_validation = self._run_validation_chain(form, chain)
  File "/Users/reckony/Desktop/UGSTUDIA/wzorce_projektowe/microblog_final/venv/lib/python3.7/site-packages/wtforms/fields/core.py", line 246, in _run_validation_chain
    validator(form, self)
TypeError: validate_username() takes 1 positional argument but 2 were given
2020-05-16 20:43:42,684 INFO: Microtweet startup [in /Users/reckony/Desktop/UGSTUDIA/wzorce_projektowe/microblog_final/App/__init__.py:75]
2020-05-16 20:44:34,206 ERROR: Exception on /auth/register [POST] [in /Users/reckony/Desktop/UGSTUDIA/wzorce_projektowe/microblog_final/venv/lib/python3.7/site-packages/flask/app.py:1892]
Traceback (most recent call last):
  File "/Users/reckony/Desktop/UGSTUDIA/wzorce_projektowe/microblog_final/venv/lib/python3.7/site-packages/flask/app.py", line 2447, in wsgi_app
    response = self.full_dispatch_request()
  File "/Users/reckony/Desktop/UGSTUDIA/wzorce_projektowe/microblog_final/venv/lib/python3.7/site-packages/flask/app.py", line 1952, in full_dispatch_request
    rv = self.handle_user_exception(e)
  File "/Users/reckony/Desktop/UGSTUDIA/wzorce_projektowe/microblog_final/venv/lib/python3.7/site-packages/flask/app.py", line 1821, in handle_user_exception
    reraise(exc_type, exc_value, tb)
  File "/Users/reckony/Desktop/UGSTUDIA/wzorce_projektowe/microblog_final/venv/lib/python3.7/site-packages/flask/_compat.py", line 39, in reraise
    raise value
  File "/Users/reckony/Desktop/UGSTUDIA/wzorce_projektowe/microblog_final/venv/lib/python3.7/site-packages/flask/app.py", line 1950, in full_dispatch_request
    rv = self.dispatch_request()
  File "/Users/reckony/Desktop/UGSTUDIA/wzorce_projektowe/microblog_final/venv/lib/python3.7/site-packages/flask/app.py", line 1936, in dispatch_request
    return self.view_functions[rule.endpoint](**req.view_args)
  File "/Users/reckony/Desktop/UGSTUDIA/wzorce_projektowe/microblog_final/App/auth/routes.py", line 41, in register
    if form.validate_on_submit():
  File "/Users/reckony/Desktop/UGSTUDIA/wzorce_projektowe/microblog_final/venv/lib/python3.7/site-packages/flask_wtf/form.py", line 100, in validate_on_submit
    return self.is_submitted() and self.validate()
  File "/Users/reckony/Desktop/UGSTUDIA/wzorce_projektowe/microblog_final/venv/lib/python3.7/site-packages/wtforms/form.py", line 318, in validate
    return super(Form, self).validate(extra)
  File "/Users/reckony/Desktop/UGSTUDIA/wzorce_projektowe/microblog_final/venv/lib/python3.7/site-packages/wtforms/form.py", line 150, in validate
    if not field.validate(self, extra):
  File "/Users/reckony/Desktop/UGSTUDIA/wzorce_projektowe/microblog_final/venv/lib/python3.7/site-packages/wtforms/fields/core.py", line 226, in validate
    stop_validation = self._run_validation_chain(form, chain)
  File "/Users/reckony/Desktop/UGSTUDIA/wzorce_projektowe/microblog_final/venv/lib/python3.7/site-packages/wtforms/fields/core.py", line 246, in _run_validation_chain
    validator(form, self)
TypeError: validate_username() takes 1 positional argument but 2 were given
2020-05-18 22:12:10,536 INFO: Microtweet startup [in /Users/reckony/Desktop/UGSTUDIA/wzorce_projektowe/microblog_final/App/__init__.py:75]
2020-05-27 19:01:50,253 INFO: Microtweet startup [in /Users/reckony/Desktop/UGSTUDIA/wzorce_projektowe/microblog_final/App/__init__.py:75]
2020-05-27 19:03:51,627 ERROR: Exception on /auth/register [POST] [in /Users/reckony/Desktop/UGSTUDIA/wzorce_projektowe/microblog_final/venv/lib/python3.7/site-packages/flask/app.py:1892]
Traceback (most recent call last):
  File "/Users/reckony/Desktop/UGSTUDIA/wzorce_projektowe/microblog_final/venv/lib/python3.7/site-packages/flask/app.py", line 2447, in wsgi_app
    response = self.full_dispatch_request()
  File "/Users/reckony/Desktop/UGSTUDIA/wzorce_projektowe/microblog_final/venv/lib/python3.7/site-packages/flask/app.py", line 1952, in full_dispatch_request
    rv = self.handle_user_exception(e)
  File "/Users/reckony/Desktop/UGSTUDIA/wzorce_projektowe/microblog_final/venv/lib/python3.7/site-packages/flask/app.py", line 1821, in handle_user_exception
    reraise(exc_type, exc_value, tb)
  File "/Users/reckony/Desktop/UGSTUDIA/wzorce_projektowe/microblog_final/venv/lib/python3.7/site-packages/flask/_compat.py", line 39, in reraise
    raise value
  File "/Users/reckony/Desktop/UGSTUDIA/wzorce_projektowe/microblog_final/venv/lib/python3.7/site-packages/flask/app.py", line 1950, in full_dispatch_request
    rv = self.dispatch_request()
  File "/Users/reckony/Desktop/UGSTUDIA/wzorce_projektowe/microblog_final/venv/lib/python3.7/site-packages/flask/app.py", line 1936, in dispatch_request
    return self.view_functions[rule.endpoint](**req.view_args)
  File "/Users/reckony/Desktop/UGSTUDIA/wzorce_projektowe/microblog_final/App/auth/routes.py", line 41, in register
    if form.validate_on_submit():
  File "/Users/reckony/Desktop/UGSTUDIA/wzorce_projektowe/microblog_final/venv/lib/python3.7/site-packages/flask_wtf/form.py", line 100, in validate_on_submit
    return self.is_submitted() and self.validate()
  File "/Users/reckony/Desktop/UGSTUDIA/wzorce_projektowe/microblog_final/venv/lib/python3.7/site-packages/wtforms/form.py", line 318, in validate
    return super(Form, self).validate(extra)
  File "/Users/reckony/Desktop/UGSTUDIA/wzorce_projektowe/microblog_final/venv/lib/python3.7/site-packages/wtforms/form.py", line 150, in validate
    if not field.validate(self, extra):
  File "/Users/reckony/Desktop/UGSTUDIA/wzorce_projektowe/microblog_final/venv/lib/python3.7/site-packages/wtforms/fields/core.py", line 226, in validate
    stop_validation = self._run_validation_chain(form, chain)
  File "/Users/reckony/Desktop/UGSTUDIA/wzorce_projektowe/microblog_final/venv/lib/python3.7/site-packages/wtforms/fields/core.py", line 246, in _run_validation_chain
    validator(form, self)
TypeError: validate_username() takes 1 positional argument but 2 were given
2020-05-27 19:06:35,515 INFO: Microtweet startup [in /Users/reckony/Desktop/UGSTUDIA/wzorce_projektowe/microblog_final/App/__init__.py:75]
