2020-05-31 19:33:29,578 ERROR: Exception on /auth/login [GET] [in /Users/reckony/Desktop/UGSTUDIA/wzorce_projektowe/microblog_final/venv/lib/python3.7/site-packages/flask/app.py:1892]
Traceback (most recent call last):
  File "/Users/reckony/Desktop/UGSTUDIA/wzorce_projektowe/microblog_final/venv/lib/python3.7/site-packages/flask/app.py", line 2447, in wsgi_app
    response = self.full_dispatch_request()
  File "/Users/reckony/Desktop/UGSTUDIA/wzorce_projektowe/microblog_final/venv/lib/python3.7/site-packages/flask/app.py", line 1952, in full_dispatch_request
    rv = self.handle_user_exception(e)
  File "/Users/reckony/Desktop/UGSTUDIA/wzorce_projektowe/microblog_final/venv/lib/python3.7/site-packages/flask/app.py", line 1821, in handle_user_exception
    reraise(exc_type, exc_value, tb)
  File "/Users/reckony/Desktop/UGSTUDIA/wzorce_projektowe/microblog_final/venv/lib/python3.7/site-packages/flask/_compat.py", line 39, in reraise
    raise value
  File "/Users/reckony/Desktop/UGSTUDIA/wzorce_projektowe/microblog_final/venv/lib/python3.7/site-packages/flask/app.py", line 1950, in full_dispatch_request
    rv = self.dispatch_request()
  File "/Users/reckony/Desktop/UGSTUDIA/wzorce_projektowe/microblog_final/venv/lib/python3.7/site-packages/flask/app.py", line 1936, in dispatch_request
    return self.view_functions[rule.endpoint](**req.view_args)
  File "/Users/reckony/Desktop/UGSTUDIA/wzorce_projektowe/microblog_final/App/auth/routes.py", line 27, in login
    return render_template('auth/login.html', title=_('Sign In'), form=form)
  File "/Users/reckony/Desktop/UGSTUDIA/wzorce_projektowe/microblog_final/venv/lib/python3.7/site-packages/flask/templating.py", line 140, in render_template
    ctx.app,
  File "/Users/reckony/Desktop/UGSTUDIA/wzorce_projektowe/microblog_final/venv/lib/python3.7/site-packages/flask/templating.py", line 120, in _render
    rv = template.render(context)
  File "/Users/reckony/Desktop/UGSTUDIA/wzorce_projektowe/microblog_final/venv/lib/python3.7/site-packages/jinja2/environment.py", line 1090, in render
    self.environment.handle_exception()
  File "/Users/reckony/Desktop/UGSTUDIA/wzorce_projektowe/microblog_final/venv/lib/python3.7/site-packages/jinja2/environment.py", line 832, in handle_exception
    reraise(*rewrite_traceback_stack(source=source))
  File "/Users/reckony/Desktop/UGSTUDIA/wzorce_projektowe/microblog_final/venv/lib/python3.7/site-packages/jinja2/_compat.py", line 28, in reraise
    raise value.with_traceback(tb)
  File "/Users/reckony/Desktop/UGSTUDIA/wzorce_projektowe/microblog_final/App/templates/auth/login.html", line 1, in top-level template code
    {% extends "base.html" %}
  File "/Users/reckony/Desktop/UGSTUDIA/wzorce_projektowe/microblog_final/venv/lib/python3.7/site-packages/jinja2/environment.py", line 832, in handle_exception
    reraise(*rewrite_traceback_stack(source=source))
  File "/Users/reckony/Desktop/UGSTUDIA/wzorce_projektowe/microblog_final/venv/lib/python3.7/site-packages/jinja2/_compat.py", line 28, in reraise
    raise value.with_traceback(tb)
  File "/Users/reckony/Desktop/UGSTUDIA/wzorce_projektowe/microblog_final/App/templates/base.html", line 40, in template
    {% else %}
jinja2.exceptions.TemplateSyntaxError: Encountered unknown tag 'else'. Jinja was looking for the following tags: 'endif'. The innermost block that needs to be closed is 'if'.
2020-05-31 19:34:13,052 INFO: Microtweet startup [in /Users/reckony/Desktop/UGSTUDIA/wzorce_projektowe/microblog_final/App/__init__.py:75]
2020-05-31 19:49:21,190 INFO: Microtweet startup [in /Users/reckony/Desktop/UGSTUDIA/wzorce_projektowe/microblog_final/App/__init__.py:75]
2020-06-03 21:32:54,771 INFO: Microtweet startup [in /Users/reckony/Desktop/UGSTUDIA/wzorce_projektowe/microblog_final/App/__init__.py:75]
2020-06-03 21:33:07,735 ERROR: Exception on /user/Reckony [GET] [in /Users/reckony/Desktop/UGSTUDIA/wzorce_projektowe/microblog_final/venv/lib/python3.7/site-packages/flask/app.py:1892]
Traceback (most recent call last):
  File "/Users/reckony/Desktop/UGSTUDIA/wzorce_projektowe/microblog_final/venv/lib/python3.7/site-packages/flask/app.py", line 2447, in wsgi_app
    response = self.full_dispatch_request()
  File "/Users/reckony/Desktop/UGSTUDIA/wzorce_projektowe/microblog_final/venv/lib/python3.7/site-packages/flask/app.py", line 1952, in full_dispatch_request
    rv = self.handle_user_exception(e)
  File "/Users/reckony/Desktop/UGSTUDIA/wzorce_projektowe/microblog_final/venv/lib/python3.7/site-packages/flask/app.py", line 1821, in handle_user_exception
    reraise(exc_type, exc_value, tb)
  File "/Users/reckony/Desktop/UGSTUDIA/wzorce_projektowe/microblog_final/venv/lib/python3.7/site-packages/flask/_compat.py", line 39, in reraise
    raise value
  File "/Users/reckony/Desktop/UGSTUDIA/wzorce_projektowe/microblog_final/venv/lib/python3.7/site-packages/flask/app.py", line 1950, in full_dispatch_request
    rv = self.dispatch_request()
  File "/Users/reckony/Desktop/UGSTUDIA/wzorce_projektowe/microblog_final/venv/lib/python3.7/site-packages/flask/app.py", line 1936, in dispatch_request
    return self.view_functions[rule.endpoint](**req.view_args)
  File "/Users/reckony/Desktop/UGSTUDIA/wzorce_projektowe/microblog_final/venv/lib/python3.7/site-packages/flask_login/utils.py", line 272, in decorated_view
    return func(*args, **kwargs)
  File "/Users/reckony/Desktop/UGSTUDIA/wzorce_projektowe/microblog_final/App/main/routes.py", line 74, in user
    return render_template('user.html', user=user, posts=posts.items, next_url=next_url, prev_url=prev_url)
  File "/Users/reckony/Desktop/UGSTUDIA/wzorce_projektowe/microblog_final/venv/lib/python3.7/site-packages/flask/templating.py", line 140, in render_template
    ctx.app,
  File "/Users/reckony/Desktop/UGSTUDIA/wzorce_projektowe/microblog_final/venv/lib/python3.7/site-packages/flask/templating.py", line 120, in _render
    rv = template.render(context)
  File "/Users/reckony/Desktop/UGSTUDIA/wzorce_projektowe/microblog_final/venv/lib/python3.7/site-packages/jinja2/environment.py", line 1090, in render
    self.environment.handle_exception()
  File "/Users/reckony/Desktop/UGSTUDIA/wzorce_projektowe/microblog_final/venv/lib/python3.7/site-packages/jinja2/environment.py", line 832, in handle_exception
    reraise(*rewrite_traceback_stack(source=source))
  File "/Users/reckony/Desktop/UGSTUDIA/wzorce_projektowe/microblog_final/venv/lib/python3.7/site-packages/jinja2/_compat.py", line 28, in reraise
    raise value.with_traceback(tb)
  File "/Users/reckony/Desktop/UGSTUDIA/wzorce_projektowe/microblog_final/App/templates/user.html", line 1, in top-level template code
    {% extends "base.html" %}
  File "/Users/reckony/Desktop/UGSTUDIA/wzorce_projektowe/microblog_final/App/templates/base.html", line 1, in top-level template code
    {% extends 'bootstrap/base.html' %}
  File "/Users/reckony/Desktop/UGSTUDIA/wzorce_projektowe/microblog_final/venv/lib/python3.7/site-packages/flask_bootstrap/templates/bootstrap/base.html", line 1, in top-level template code
    {% block doc -%}
  File "/Users/reckony/Desktop/UGSTUDIA/wzorce_projektowe/microblog_final/venv/lib/python3.7/site-packages/flask_bootstrap/templates/bootstrap/base.html", line 4, in block "doc"
    {%- block html %}
  File "/Users/reckony/Desktop/UGSTUDIA/wzorce_projektowe/microblog_final/venv/lib/python3.7/site-packages/flask_bootstrap/templates/bootstrap/base.html", line 20, in block "html"
    {% block body -%}
  File "/Users/reckony/Desktop/UGSTUDIA/wzorce_projektowe/microblog_final/venv/lib/python3.7/site-packages/flask_bootstrap/templates/bootstrap/base.html", line 23, in block "body"
    {% block content -%}
  File "/Users/reckony/Desktop/UGSTUDIA/wzorce_projektowe/microblog_final/App/templates/base.html", line 58, in block "content"
    {% block app_content %}{% endblock %}
  File "/Users/reckony/Desktop/UGSTUDIA/wzorce_projektowe/microblog_final/App/templates/user.html", line 16, in block "app_content"
    <p><a href="{{ url_for('main.wordcloud') }}">{{ _('Generate your wordcloud') }}</a></p>
  File "/Users/reckony/Desktop/UGSTUDIA/wzorce_projektowe/microblog_final/venv/lib/python3.7/site-packages/flask/helpers.py", line 370, in url_for
    return appctx.app.handle_url_build_error(error, endpoint, values)
  File "/Users/reckony/Desktop/UGSTUDIA/wzorce_projektowe/microblog_final/venv/lib/python3.7/site-packages/flask/app.py", line 2216, in handle_url_build_error
    reraise(exc_type, exc_value, tb)
  File "/Users/reckony/Desktop/UGSTUDIA/wzorce_projektowe/microblog_final/venv/lib/python3.7/site-packages/flask/_compat.py", line 39, in reraise
    raise value
  File "/Users/reckony/Desktop/UGSTUDIA/wzorce_projektowe/microblog_final/venv/lib/python3.7/site-packages/flask/helpers.py", line 358, in url_for
    endpoint, values, method=method, force_external=external
  File "/Users/reckony/Desktop/UGSTUDIA/wzorce_projektowe/microblog_final/venv/lib/python3.7/site-packages/werkzeug/routing.py", line 2179, in build
    raise BuildError(endpoint, values, method, self)
werkzeug.routing.BuildError: Could not build url for endpoint 'main.wordcloud'. Did you forget to specify values ['username']?
2020-06-03 21:35:12,364 INFO: Microtweet startup [in /Users/reckony/Desktop/UGSTUDIA/wzorce_projektowe/microblog_final/App/__init__.py:75]
