2020-06-03 21:35:16,158 ERROR: Exception on /user/Reckony [GET] [in /Users/reckony/Desktop/UGSTUDIA/wzorce_projektowe/microblog_final/venv/lib/python3.7/site-packages/flask/app.py:1892]
Traceback (most recent call last):
  File "/Users/reckony/Desktop/UGSTUDIA/wzorce_projektowe/microblog_final/venv/lib/python3.7/site-packages/flask/app.py", line 2447, in wsgi_app
    response = self.full_dispatch_request()
  File "/Users/reckony/Desktop/UGSTUDIA/wzorce_projektowe/microblog_final/venv/lib/python3.7/site-packages/flask/app.py", line 1952, in full_dispatch_request
    rv = self.handle_user_exception(e)
  File "/Users/reckony/Desktop/UGSTUDIA/wzorce_projektowe/microblog_final/venv/lib/python3.7/site-packages/flask/app.py", line 1821, in handle_user_exception
    reraise(exc_type, exc_value, tb)
  File "/Users/reckony/Desktop/UGSTUDIA/wzorce_projektowe/microblog_final/venv/lib/python3.7/site-packages/flask/_compat.py", line 39, in reraise
    raise value
  File "/Users/reckony/Desktop/UGSTUDIA/wzorce_projektowe/microblog_final/venv/lib/python3.7/site-packages/flask/app.py", line 1950, in full_dispatch_request
    rv = self.dispatch_request()
  File "/Users/reckony/Desktop/UGSTUDIA/wzorce_projektowe/microblog_final/venv/lib/python3.7/site-packages/flask/app.py", line 1936, in dispatch_request
    return self.view_functions[rule.endpoint](**req.view_args)
  File "/Users/reckony/Desktop/UGSTUDIA/wzorce_projektowe/microblog_final/venv/lib/python3.7/site-packages/flask_login/utils.py", line 272, in decorated_view
    return func(*args, **kwargs)
  File "/Users/reckony/Desktop/UGSTUDIA/wzorce_projektowe/microblog_final/App/main/routes.py", line 74, in user
    return render_template('user.html', user=user, posts=posts.items, next_url=next_url, prev_url=prev_url)
  File "/Users/reckony/Desktop/UGSTUDIA/wzorce_projektowe/microblog_final/venv/lib/python3.7/site-packages/flask/templating.py", line 138, in render_template
    ctx.app.jinja_env.get_or_select_template(template_name_or_list),
  File "/Users/reckony/Desktop/UGSTUDIA/wzorce_projektowe/microblog_final/venv/lib/python3.7/site-packages/jinja2/environment.py", line 930, in get_or_select_template
    return self.get_template(template_name_or_list, parent, globals)
  File "/Users/reckony/Desktop/UGSTUDIA/wzorce_projektowe/microblog_final/venv/lib/python3.7/site-packages/jinja2/environment.py", line 883, in get_template
    return self._load_template(name, self.make_globals(globals))
  File "/Users/reckony/Desktop/UGSTUDIA/wzorce_projektowe/microblog_final/venv/lib/python3.7/site-packages/jinja2/environment.py", line 857, in _load_template
    template = self.loader.load(self, name, globals)
  File "/Users/reckony/Desktop/UGSTUDIA/wzorce_projektowe/microblog_final/venv/lib/python3.7/site-packages/jinja2/loaders.py", line 127, in load
    code = environment.compile(source, name, filename)
  File "/Users/reckony/Desktop/UGSTUDIA/wzorce_projektowe/microblog_final/venv/lib/python3.7/site-packages/jinja2/environment.py", line 638, in compile
    self.handle_exception(source=source_hint)
  File "/Users/reckony/Desktop/UGSTUDIA/wzorce_projektowe/microblog_final/venv/lib/python3.7/site-packages/jinja2/environment.py", line 832, in handle_exception
    reraise(*rewrite_traceback_stack(source=source))
  File "/Users/reckony/Desktop/UGSTUDIA/wzorce_projektowe/microblog_final/venv/lib/python3.7/site-packages/jinja2/_compat.py", line 28, in reraise
    raise value.with_traceback(tb)
  File "/Users/reckony/Desktop/UGSTUDIA/wzorce_projektowe/microblog_final/App/templates/user.html", line 16, in template
    <p><a href="{{ url_for('main.wordcloud', username=user.username)) }}">{{ _('Generate your wordcloud') }}</a></p>
jinja2.exceptions.TemplateSyntaxError: unexpected ')'
2020-06-03 21:36:12,304 INFO: Microtweet startup [in /Users/reckony/Desktop/UGSTUDIA/wzorce_projektowe/microblog_final/App/__init__.py:75]
2020-06-03 21:36:15,400 ERROR: Exception on /wordcloud/Reckony [GET] [in /Users/reckony/Desktop/UGSTUDIA/wzorce_projektowe/microblog_final/venv/lib/python3.7/site-packages/flask/app.py:1892]
Traceback (most recent call last):
  File "/Users/reckony/Desktop/UGSTUDIA/wzorce_projektowe/microblog_final/venv/lib/python3.7/site-packages/flask/app.py", line 2447, in wsgi_app
    response = self.full_dispatch_request()
  File "/Users/reckony/Desktop/UGSTUDIA/wzorce_projektowe/microblog_final/venv/lib/python3.7/site-packages/flask/app.py", line 1952, in full_dispatch_request
    rv = self.handle_user_exception(e)
  File "/Users/reckony/Desktop/UGSTUDIA/wzorce_projektowe/microblog_final/venv/lib/python3.7/site-packages/flask/app.py", line 1821, in handle_user_exception
    reraise(exc_type, exc_value, tb)
  File "/Users/reckony/Desktop/UGSTUDIA/wzorce_projektowe/microblog_final/venv/lib/python3.7/site-packages/flask/_compat.py", line 39, in reraise
    raise value
  File "/Users/reckony/Desktop/UGSTUDIA/wzorce_projektowe/microblog_final/venv/lib/python3.7/site-packages/flask/app.py", line 1950, in full_dispatch_request
    rv = self.dispatch_request()
  File "/Users/reckony/Desktop/UGSTUDIA/wzorce_projektowe/microblog_final/venv/lib/python3.7/site-packages/flask/app.py", line 1936, in dispatch_request
    return self.view_functions[rule.endpoint](**req.view_args)
  File "/Users/reckony/Desktop/UGSTUDIA/wzorce_projektowe/microblog_final/venv/lib/python3.7/site-packages/flask_login/utils.py", line 272, in decorated_view
    return func(*args, **kwargs)
  File "/Users/reckony/Desktop/UGSTUDIA/wzorce_projektowe/microblog_final/App/main/routes.py", line 205, in wordcloud
    prepared_post_info = text_operator.PostTextHandler(user_posts)
  File "/Users/reckony/Desktop/UGSTUDIA/wzorce_projektowe/microblog_final/App/words/text_operator.py", line 43, in __init__
    self.posts_body_list = self.get_posts_body()
  File "/Users/reckony/Desktop/UGSTUDIA/wzorce_projektowe/microblog_final/App/words/text_operator.py", line 48, in get_posts_body
    posts_body = [x.body for x in posts]
  File "/Users/reckony/Desktop/UGSTUDIA/wzorce_projektowe/microblog_final/App/words/text_operator.py", line 48, in <listcomp>
    posts_body = [x.body for x in posts]
AttributeError: 'AppenderBaseQuery' object has no attribute 'body'
2020-06-04 08:32:49,575 INFO: Microtweet startup [in /Users/reckony/Desktop/UGSTUDIA/wzorce_projektowe/microblog_final/App/__init__.py:75]
2020-06-04 08:32:59,663 ERROR: Exception on /wordcloud/Reckony [GET] [in /Users/reckony/Desktop/UGSTUDIA/wzorce_projektowe/microblog_final/venv/lib/python3.7/site-packages/flask/app.py:1892]
Traceback (most recent call last):
  File "/Users/reckony/Desktop/UGSTUDIA/wzorce_projektowe/microblog_final/venv/lib/python3.7/site-packages/flask/app.py", line 2447, in wsgi_app
    response = self.full_dispatch_request()
  File "/Users/reckony/Desktop/UGSTUDIA/wzorce_projektowe/microblog_final/venv/lib/python3.7/site-packages/flask/app.py", line 1952, in full_dispatch_request
    rv = self.handle_user_exception(e)
  File "/Users/reckony/Desktop/UGSTUDIA/wzorce_projektowe/microblog_final/venv/lib/python3.7/site-packages/flask/app.py", line 1821, in handle_user_exception
    reraise(exc_type, exc_value, tb)
  File "/Users/reckony/Desktop/UGSTUDIA/wzorce_projektowe/microblog_final/venv/lib/python3.7/site-packages/flask/_compat.py", line 39, in reraise
    raise value
  File "/Users/reckony/Desktop/UGSTUDIA/wzorce_projektowe/microblog_final/venv/lib/python3.7/site-packages/flask/app.py", line 1950, in full_dispatch_request
    rv = self.dispatch_request()
  File "/Users/reckony/Desktop/UGSTUDIA/wzorce_projektowe/microblog_final/venv/lib/python3.7/site-packages/flask/app.py", line 1936, in dispatch_request
    return self.view_functions[rule.endpoint](**req.view_args)
  File "/Users/reckony/Desktop/UGSTUDIA/wzorce_projektowe/microblog_final/venv/lib/python3.7/site-packages/flask_login/utils.py", line 272, in decorated_view
    return func(*args, **kwargs)
  File "/Users/reckony/Desktop/UGSTUDIA/wzorce_projektowe/microblog_final/App/main/routes.py", line 205, in wordcloud
    prepared_post_info = text_operator.PostTextHandler(user_posts)
  File "/Users/reckony/Desktop/UGSTUDIA/wzorce_projektowe/microblog_final/App/words/text_operator.py", line 43, in __init__
    self.posts_body_list = self.get_posts_body()
  File "/Users/reckony/Desktop/UGSTUDIA/wzorce_projektowe/microblog_final/App/words/text_operator.py", line 48, in get_posts_body
    posts_body = [x.body for x in posts]
  File "/Users/reckony/Desktop/UGSTUDIA/wzorce_projektowe/microblog_final/App/words/text_operator.py", line 48, in <listcomp>
    posts_body = [x.body for x in posts]
AttributeError: 'list' object has no attribute 'body'
2020-06-04 08:33:59,498 INFO: Microtweet startup [in /Users/reckony/Desktop/UGSTUDIA/wzorce_projektowe/microblog_final/App/__init__.py:75]
