%YAML 1.1
%TAG !u! tag:unity3d.com,2011:
--- !u!114 &11400000
MonoBehaviour:
  m_ObjectHideFlags: 0
  m_CorrespondingSourceObject: {fileID: 0}
  m_PrefabInstance: {fileID: 0}
  m_PrefabAsset: {fileID: 0}
  m_GameObject: {fileID: 0}
  m_Enabled: 1
  m_EditorHideFlags: 0
  m_Script: {fileID: 11500000, guid: 50bbc33dc27cacf48a0ca6d993e6413a, type: 3}
  m_Name: ScriptableAttack
  m_EditorClassIdentifier: 
  nom: 
  CostMineral: 0
  Damage: 0
  Estat: 0
