%YAML 1.1
%TAG !u! tag:unity3d.com,2011:
--- !u!114 &11400000
MonoBehaviour:
  m_ObjectHideFlags: 0
  m_CorrespondingSourceObject: {fileID: 0}
  m_PrefabInstance: {fileID: 0}
  m_PrefabAsset: {fileID: 0}
  m_GameObject: {fileID: 0}
  m_Enabled: 1
  m_EditorHideFlags: 0
  m_Script: {fileID: 11500000, guid: 28c56617e4c7ff74fb5ef62df9a447a9, type: 3}
  m_Name: PlayerMarta
  m_EditorClassIdentifier: 
  equipo:
  - {fileID: 11400000, guid: e80fa921a17a04542917a252c1da800b, type: 2}
  - {fileID: 11400000, guid: a8ff0e1ebb39203458e0da619126bad1, type: 2}
  inventari: []
  Dineros: -200
