%YAML 1.1
%TAG !u! tag:unity3d.com,2011:
--- !u!114 &11400000
MonoBehaviour:
  m_ObjectHideFlags: 0
  m_CorrespondingSourceObject: {fileID: 0}
  m_PrefabInstance: {fileID: 0}
  m_PrefabAsset: {fileID: 0}
  m_GameObject: {fileID: 0}
  m_Enabled: 1
  m_EditorHideFlags: 0
  m_Script: {fileID: 11500000, guid: 13b75c95f34a00d4e8c04f76b73312e6, type: 3}
  m_Name: T_Intermedia
  m_EditorClassIdentifier: 
  m_AnimatedSprites:
  - {fileID: -1409449800, guid: 0d06f5e7f7674124faa0d5410c919eec, type: 3}
  - {fileID: 545329027, guid: 0d06f5e7f7674124faa0d5410c919eec, type: 3}
  - {fileID: 1946201069, guid: 0d06f5e7f7674124faa0d5410c919eec, type: 3}
  m_MinSpeed: 1.5
  m_MaxSpeed: 2
  m_AnimationStartTime: 0
  m_AnimationStartFrame: 0
  m_TileColliderType: 1
