%YAML 1.1
%TAG !u! tag:unity3d.com,2011:
--- !u!114 &11400000
MonoBehaviour:
  m_ObjectHideFlags: 0
  m_CorrespondingSourceObject: {fileID: 0}
  m_PrefabInstance: {fileID: 0}
  m_PrefabAsset: {fileID: 0}
  m_GameObject: {fileID: 0}
  m_Enabled: 1
  m_EditorHideFlags: 0
  m_Script: {fileID: 11500000, guid: d0aea70f16fa5904cae0bcf82700abc4, type: 3}
  m_Name: PoliteCat
  m_EditorClassIdentifier: 
  idObj: 6
  nom: PoliteCat
  preuAct: 0
  preu: 10
  sprite: {fileID: 21300000, guid: 1be40b8c6d5190c4693599db937baa4c, type: 3}
  isMaterial: 0
  estacions: 01000000020000000000000003000000
  atmosferas: 01000000
  temps: 00000000
  dificultatCanya: 0
  xarxaPeixExtra: 0
  isMolusc: 0
  busseigComportament: 0
