%YAML 1.1
%TAG !u! tag:unity3d.com,2011:
--- !u!114 &11400000
MonoBehaviour:
  m_ObjectHideFlags: 0
  m_CorrespondingSourceObject: {fileID: 0}
  m_PrefabInstance: {fileID: 0}
  m_PrefabAsset: {fileID: 0}
  m_GameObject: {fileID: 0}
  m_Enabled: 1
  m_EditorHideFlags: 0
  m_Script: {fileID: 11500000, guid: d0aea70f16fa5904cae0bcf82700abc4, type: 3}
  m_Name: Lenguado
  m_EditorClassIdentifier: 
  idObj: 6
  nom: Llenguado
  preuAct: 10
  preu: 10
  sprite: {fileID: 21300000, guid: 5e7061e0651f58446a121327c46f31fc, type: 3}
  isMaterial: 0
  estacions: 0000000002000000
  atmosferas: 
  temps: 
  dificultatCanya: 0
  xarxaPeixExtra: 0
  isMolusc: 0
  busseigComportament: 0
