%YAML 1.1
%TAG !u! tag:unity3d.com,2011:
--- !u!1045 &1
EditorBuildSettings:
  m_ObjectHideFlags: 0
  serializedVersion: 2
  m_Scenes:
  - enabled: 1
    path: Assets/Scenes/MainMenu.unity
    guid: b3afe1442882b9e42864434acf06d2b9
  - enabled: 1
    path: Assets/Scenes/Puerto.unity
    guid: 69a7ac4234bc4f349837fffca799b2dd
  - enabled: 1
    path: Assets/Scenes/Llac.unity
    guid: e68744531df67f544bbc91554eb2ec2a
  - enabled: 1
    path: Assets/Scenes/AltaMar.unity
    guid: 91f288b5f19d9284c81354d309c15a49
  - enabled: 1
    path: Assets/Scenes/MJBusseig.unity
    guid: 28d4f4e3aa5fcde4fb74458ae6ad365a
  - enabled: 0
    path: Assets/Scenes/MartaTesting.unity
    guid: b512759f5fbb09446be3afec31777fbf
  m_configObjects: {}
