[
  {
    "id": 1,
    "name": "Niagara Falls",
    "tours": [
      {
        "id": 1,
        "name": "To Niagara Falls",
        "duration": 5,
        "rating": 4.5,
        "numberOfReviews": 462,
        "price": 465,
        "image": "https://images.unsplash.com/photo-1511358146320-eb018ab3e22e?ixlib=rb-4.0.3&ixid=MnwxMjA3fDB8MHxzZWFyY2h8Nnx8bmlhZ2FyYSUyMGZhbGxzfGVufDB8fDB8fA%3D%3D&auto=format&fit=crop&w=600&q=60"
      },
      {
        "id": 2,
        "name": "Helicopter Over the Falls",
        "duration": 8,
        "rating": 3.5,
        "numberOfReviews": 641,
        "price": 385,
        "image": "https://d2ru2mvuh5wx24.cloudfront.net/avtivity_bootstrap/1241/flight_of_angels_3__1920x864.jpg"
      },
      {
        "id": 3,
        "name": "The Falls at Night",
        "duration": 2,
        "rating": 4.5,
        "numberOfReviews": 133,
        "price": 144,
        "image": "https://www.niagarafallsstatepark.com/~/media/parks/niagara-falls/attractions-and-tours/illumination/niagarafalls-illumination-header-desktop.jpg?h=500&w=1500&la=en&hash=123E6D5F1744FBCC74EC36570E77872608D24891g"
      },
      {
        "id": 4,
        "name": "Immerse into the Falls",
        "duration": 5,
        "rating": 4.5,
        "numberOfReviews": 462,
        "price": 465,
        "image": "https://tcproduction.blob.core.windows.net/media/%7B240f8b72-1159-4fd3-a150-0a837f50ba4a%7D.2573758641_297d6d19fa_o.jpg"
      }
    ]
  },
  {
    "id": 2,
    "name": "Las Vegas",
    "tours": [
      {
        "id": 4,
        "name": "All Around the World",
        "duration": 5,
        "rating": 4.5,
        "numberOfReviews": 462,
        "price": 465,
        "image": "https://cdn.pixabay.com/photo/2014/12/19/23/40/las-vegas-573600__340.jpg"
      },
      {
        "id": 5,
        "name": "View the Casinos",
        "duration": 5,
        "rating": 4.5,
        "numberOfReviews": 462,
        "price": 465,
        "image": "https://cdn.pixabay.com/photo/2017/01/22/22/02/gambling-2001078__340.jpg"
      },
      {
        "id": 6,
        "name": "Show me the Magic",
        "duration": 8,
        "rating": 3.5,
        "numberOfReviews": 641,
        "price": 385,
        "image": "https://cdn.pixabay.com/photo/2016/01/08/18/00/las-vegas-1128811__340.jpg"
      },
      {
        "id": 7,
        "name": "The Falls at Night",
        "duration": 2,
        "rating": 4.5,
        "numberOfReviews": 133,
        "price": 144,
        "image": "https://assets.simpleviewcms.com/simpleview/image/upload/c_limit,h_1200,q_75,w_1200/v1/clients/lasvegas/strip_b86ddbea-3add-4995-b449-ac85d700b027.jpg"
      }
    ]
  }
]
