{
	"threads": 4,
	"coin": "egem",
	"name": "main",
	"api": {
		"enabled": true,
		"purgeOnly": false,
		"purgeInterval": "10m",
		"listen": "0.0.0.0:8080",
		"statsCollectInterval": "10s",
		"hashrateWindow": "30m",
		"hashrateLargeWindow": "3h",
		"luckWindow": [64, 128, 256],
		"payments": 30,
		"blocks": 50,
		"poolCharts":"0 */20 * * * *",
		"poolChartsNum":74,
		"minerCharts":"0 */20 * * * *",
		"minerChartsNum":74
	},
	"upstreamCheckInterval": "10s",
	"upstream":[
		{
			"name": "main",
			"url": "http://127.0.0.1:8895",
			"timeout": "10s"
		}
	],
	"redis": {
		"endpoint": "127.0.0.1:6379",
		"poolSize": 10,
		"database": 0,
		"password": ""
	},
	"newrelicEnabled": false,
	"newrelicName": "MyEtherProxy",
	"newrelicKey": "",
	"newrelicVerbose": false
}