[gd_scene load_steps=22 format=2]

[ext_resource path="res://Scenes/UnitaryScene.gd" type="Script" id=1]
[ext_resource path="res://assets/TileSet/Decors.tres" type="TileSet" id=2]
[ext_resource path="res://assets/TileSet/Level.tres" type="TileSet" id=3]
[ext_resource path="res://assets/TileSet/Traps.tres" type="TileSet" id=4]
[ext_resource path="res://assets/Rideau_1.png" type="Texture" id=5]
[ext_resource path="res://assets/Rideau_2.png" type="Texture" id=6]
[ext_resource path="res://assets/Rideau_3.png" type="Texture" id=7]
[ext_resource path="res://assets/Rideau_4.png" type="Texture" id=8]
[ext_resource path="res://assets/Rideau_5.png" type="Texture" id=9]
[ext_resource path="res://assets/Rideau_6.png" type="Texture" id=10]
[ext_resource path="res://assets/Rideau_7.png" type="Texture" id=11]
[ext_resource path="res://assets/Rideau_8.png" type="Texture" id=12]
[ext_resource path="res://assets/Rideau_10.png" type="Texture" id=13]
[ext_resource path="res://assets/Rideau_11.png" type="Texture" id=14]
[ext_resource path="res://assets/Rideau_12.png" type="Texture" id=15]
[ext_resource path="res://assets/Rideau_13.png" type="Texture" id=16]
[ext_resource path="res://assets/Rideau_14.png" type="Texture" id=17]
[ext_resource path="res://Scenes/Entities/Collectable.tscn" type="PackedScene" id=18]
[ext_resource path="res://assets/Corde.png" type="Texture" id=19]
[ext_resource path="res://assets/Carton_Herbe.png" type="Texture" id=20]

[sub_resource type="SpriteFrames" id=1]
animations = [ {
"frames": [ ExtResource( 5 ), ExtResource( 6 ), ExtResource( 7 ), ExtResource( 8 ), ExtResource( 9 ), ExtResource( 10 ), ExtResource( 11 ), ExtResource( 12 ), ExtResource( 13 ), ExtResource( 14 ), ExtResource( 15 ), ExtResource( 16 ), ExtResource( 17 ), null ],
"loop": false,
"name": "curtain_up",
"speed": 10.0
} ]

[node name="Node2D" type="Node2D"]
script = ExtResource( 1 )
left_exit = true
up_exit = true

[node name="Decor" type="TileMap" parent="."]
tile_set = ExtResource( 2 )
cell_size = Vector2( 32, 32 )
format = 1
tile_data = PoolIntArray( 196611, 1, 0, 2686976, 0, 0, 2686987, 0, 0, 2686998, 0, 0, 2687011, 0, 0, 2687023, 0, 0 )

[node name="Wall" type="TileMap" parent="."]
tile_set = ExtResource( 3 )
format = 1
tile_data = PoolIntArray( 0, -1073741823, 0, 1, -1610612734, 0, 2, -1610612734, 0, 3, -1610612734, 0, 4, -1610612734, 0, 5, -1610612734, 0, 6, -1610612734, 0, 7, -1610612734, 0, 8, -1610612734, 0, 9, -1610612734, 0, 10, -1610612734, 0, 11, -1610612734, 0, 12, -1610612734, 0, 13, -1610612720, 0, 18, -1073741823, 0, 19, -1610612734, 0, 20, -1610612734, 0, 21, -1610612734, 0, 22, -1610612734, 0, 23, -1610612734, 0, 24, -1610612734, 0, 25, -1610612734, 0, 26, -1610612734, 0, 27, -1610612734, 0, 28, -1610612734, 0, 29, -1610612734, 0, 30, -1610612734, 0, 31, 1, 0, 65536, 2, 0, 65554, 2, 0, 65555, 10, 0, 65562, 10, 0, 65567, 2, 0, 131072, 2, 0, 131086, 3, 0, 131090, 2, 0, 131103, 2, 0, 196608, 2, 0, 196626, 2, 0, 196632, -1073741815, 0, 196639, 2, 0, 262144, 2, 0, 262162, 2, 0, 262165, 1610612746, 0, 262172, 1610612746, 0, 262175, 2, 0, 327680, 2, 0, 327693, -1073741808, 0, 327694, -1073741822, 0, 327695, -1073741822, 0, 327696, -1073741822, 0, 327697, -1073741822, 0, 327698, 1610612753, 0, 327704, -1073741817, 0, 327711, 2, 0, 393216, 2, 0, 393222, 3, 0, 393234, 2, 0, 393247, 2, 0, 458752, 2, 0, 458770, 2, 0, 458771, -1073741816, 0, 458775, -1073741816, 0, 458779, -1073741816, 0, 458783, 2, 0, 524288, 2, 0, 524306, 1610612737, 0, 524307, -1073741822, 0, 524308, -1073741822, 0, 524309, -1073741822, 0, 524310, -1073741822, 0, 524311, -1073741822, 0, 524312, -1073741822, 0, 524313, -1073741822, 0, 524314, -1073741822, 0, 524315, -1073741822, 0, 524316, -1073741822, 0, 524317, -1073741822, 0, 524318, -1073741822, 0, 524319, 1610612753, 0, 589824, 1610612752, 0, 589855, 2, 0, 655369, 3, 0, 655391, 2, 0, 720927, 2, 0, 786463, 2, 0, 851999, 2, 0, 917504, -1073741823, 0, 917505, -1073741822, 0, 917506, -1073741822, 0, 917507, -1073741822, 0, 917508, -1073741822, 0, 917509, -1073741822, 0, 917510, -1073741822, 0, 917511, -1073741822, 0, 917512, -1073741822, 0, 917513, -1073741822, 0, 917514, -1073741822, 0, 917515, -1073741822, 0, 917516, -1073741822, 0, 917517, -1073741822, 0, 917518, -1073741822, 0, 917519, -1073741822, 0, 917520, -1073741822, 0, 917521, -1073741822, 0, 917522, -1073741822, 0, 917523, -1610612720, 0, 917535, 2, 0, 983040, 2, 0, 983071, 2, 0, 1048576, 2, 0, 1048602, 5, 0, 1048607, 2, 0, 1114112, 2, 0, 1114143, 2, 0, 1179648, 2, 0, 1179649, 3, 0, 1179663, 3, 0, 1179679, 2, 0, 1245184, 2, 0, 1245215, 2, 0, 1310720, 2, 0, 1310728, 3, 0, 1310741, 3, 0, 1310751, 2, 0, 1376256, 2, 0, 1376287, 2, 0, 1441792, 2, 0, 1441823, 2, 0, 1507328, 1610612737, 0, 1507329, -1610612734, 0, 1507330, -1610612734, 0, 1507331, -1610612734, 0, 1507332, -1610612734, 0, 1507333, -1610612734, 0, 1507334, -1610612734, 0, 1507335, -1610612734, 0, 1507336, -1610612734, 0, 1507337, -1610612734, 0, 1507338, -1610612734, 0, 1507339, -1610612734, 0, 1507340, -1610612734, 0, 1507341, -1610612734, 0, 1507342, -1610612734, 0, 1507343, -1610612734, 0, 1507344, -1610612734, 0, 1507345, -1610612734, 0, 1507346, -1610612734, 0, 1507347, -1610612734, 0, 1507348, -1610612734, 0, 1507349, -1610612734, 0, 1507350, -1610612734, 0, 1507351, -1610612734, 0, 1507352, -1610612734, 0, 1507353, -1610612734, 0, 1507354, -1610612734, 0, 1507355, -1610612734, 0, 1507356, -1610612734, 0, 1507357, -1610612734, 0, 1507358, -1610612734, 0, 1507359, -1610612735, 0 )

[node name="Trap" type="TileMap" parent="." groups=[
"Trap",
]]
tile_set = ExtResource( 4 )
format = 1
tile_data = PoolIntArray( 262147, 4, 0, 1376257, 2, 0, 1376263, 2, 0, 1376269, 2, 0, 1376275, 2, 0, 1376281, 2, 0 )

[node name="AnimatedSprite" type="AnimatedSprite" parent="."]
position = Vector2( 1024.28, 768.375 )
scale = Vector2( 0.826007, 0.866986 )
z_index = 4096
frames = SubResource( 1 )
animation = "curtain_up"

[node name="Collectable" parent="." instance=ExtResource( 18 )]
position = Vector2( 140.943, 1068.82 )

[node name="Sprite" type="Sprite" parent="."]
position = Vector2( 228.509, 98.8612 )
scale = Vector2( 0.327787, 0.0912187 )
z_index = -2
texture = ExtResource( 19 )

[node name="Sprite2" type="Sprite" parent="."]
position = Vector2( 400.294, 860.563 )
scale = Vector2( 0.150853, 0.150853 )
z_index = -4
texture = ExtResource( 20 )

[node name="Sprite3" type="Sprite" parent="."]
position = Vector2( 1092.09, 294.293 )
scale = Vector2( 0.150853, 0.150853 )
z_index = -4
texture = ExtResource( 20 )
