[gd_scene load_steps=21 format=2]

[ext_resource path="res://Scenes/UnitaryScene.gd" type="Script" id=1]
[ext_resource path="res://assets/TileSet/Decors.tres" type="TileSet" id=2]
[ext_resource path="res://assets/TileSet/Level.tres" type="TileSet" id=3]
[ext_resource path="res://assets/TileSet/Traps.tres" type="TileSet" id=4]
[ext_resource path="res://assets/Rideau_1.png" type="Texture" id=5]
[ext_resource path="res://assets/Rideau_2.png" type="Texture" id=6]
[ext_resource path="res://assets/Rideau_3.png" type="Texture" id=7]
[ext_resource path="res://assets/Rideau_4.png" type="Texture" id=8]
[ext_resource path="res://assets/Rideau_5.png" type="Texture" id=9]
[ext_resource path="res://assets/Rideau_6.png" type="Texture" id=10]
[ext_resource path="res://assets/Rideau_7.png" type="Texture" id=11]
[ext_resource path="res://assets/Rideau_8.png" type="Texture" id=12]
[ext_resource path="res://assets/Rideau_10.png" type="Texture" id=13]
[ext_resource path="res://assets/Rideau_11.png" type="Texture" id=14]
[ext_resource path="res://assets/Rideau_12.png" type="Texture" id=15]
[ext_resource path="res://assets/Rideau_13.png" type="Texture" id=16]
[ext_resource path="res://assets/Rideau_14.png" type="Texture" id=17]
[ext_resource path="res://Scenes/Entities/Collectable.tscn" type="PackedScene" id=18]
[ext_resource path="res://assets/Carton_Herbe.png" type="Texture" id=19]

[sub_resource type="SpriteFrames" id=1]
animations = [ {
"frames": [ ExtResource( 5 ), ExtResource( 6 ), ExtResource( 7 ), ExtResource( 8 ), ExtResource( 9 ), ExtResource( 10 ), ExtResource( 11 ), ExtResource( 12 ), ExtResource( 13 ), ExtResource( 14 ), ExtResource( 15 ), ExtResource( 16 ), ExtResource( 17 ), null ],
"loop": false,
"name": "curtain_up",
"speed": 10.0
} ]

[node name="Node2D" type="Node2D"]
script = ExtResource( 1 )
down_exit = true
up_exit = true

[node name="Decor" type="TileMap" parent="."]
tile_set = ExtResource( 2 )
cell_size = Vector2( 32, 32 )
format = 1

[node name="Wall" type="TileMap" parent="."]
tile_set = ExtResource( 3 )
format = 1
tile_data = PoolIntArray( 0, -1073741823, 0, 1, -1610612734, 0, 2, -1610612734, 0, 3, -1610612734, 0, 4, -1610612734, 0, 5, -1610612734, 0, 6, -1610612734, 0, 7, -1610612719, 0, 8, -1610612734, 0, 9, -1610612734, 0, 10, -1610612734, 0, 11, -1610612734, 0, 12, -1610612734, 0, 13, -1610612720, 0, 18, -1073741808, 0, 19, -1610612734, 0, 20, -1610612734, 0, 21, -1610612734, 0, 22, -1610612734, 0, 23, -1610612734, 0, 24, -1610612734, 0, 25, -1610612734, 0, 26, -1610612734, 0, 27, -1610612734, 0, 28, -1610612734, 0, 29, -1610612734, 0, 30, -1610612734, 0, 31, 1, 0, 65536, 2, 0, 65540, -1610612726, 0, 65543, 2, 0, 65560, 2, 0, 65561, 2, 0, 65567, 2, 0, 131072, 2, 0, 131079, 2, 0, 131096, 2, 0, 131097, 2, 0, 131103, 2, 0, 196608, 2, 0, 196609, -1073741814, 0, 196615, 2, 0, 196622, -1073741823, 0, 196623, -1610612734, 0, 196624, -1610612734, 0, 196625, 1, 0, 196632, 2, 0, 196633, 2, 0, 196639, 2, 0, 262144, 2, 0, 262151, 2, 0, 262158, 2, 0, 262159, -1610612727, 0, 262161, 2, 0, 262168, 2, 0, 262169, 2, 0, 262175, 2, 0, 327680, 2, 0, 327687, 2, 0, 327691, 3, 0, 327694, 2, 0, 327697, 17, 0, 327698, -1610612734, 0, 327699, -1610612734, 0, 327700, -1610612720, 0, 327704, 2, 0, 327705, 2, 0, 327711, 2, 0, 393216, 2, 0, 393220, -1610612726, 0, 393223, 2, 0, 393230, 2, 0, 393233, 2, 0, 393240, 2, 0, 393241, 2, 0, 393244, 3, 0, 393247, 2, 0, 458752, 2, 0, 458759, 2, 0, 458766, 2, 0, 458769, 2, 0, 458776, 2, 0, 458777, 2, 0, 458783, 2, 0, 524288, 2, 0, 524289, -1073741814, 0, 524295, 2, 0, 524302, 2, 0, 524305, 2, 0, 524312, 2, 0, 524313, 2, 0, 524319, 2, 0, 589824, 2, 0, 589831, 2, 0, 589832, 3, 0, 589838, 2, 0, 589841, 2, 0, 589845, -1073741808, 0, 589846, -1610612734, 0, 589847, -1610612734, 0, 589848, -1610612734, 0, 589849, -1610612735, 0, 589855, 2, 0, 655360, 2, 0, 655367, 2, 0, 655374, 2, 0, 655375, -1073741815, 0, 655377, 2, 0, 655385, 3, 0, 655391, 2, 0, 720896, 2, 0, 720900, -1610612726, 0, 720903, 2, 0, 720910, 2, 0, 720913, 2, 0, 720927, 2, 0, 786432, 2, 0, 786439, 2, 0, 786446, 2, 0, 786447, -1610612727, 0, 786449, 2, 0, 786463, 2, 0, 851968, 2, 0, 851969, -1073741814, 0, 851975, 2, 0, 851979, 3, 0, 851982, 2, 0, 851985, 17, 0, 851986, -1610612734, 0, 851987, -1610612734, 0, 851988, -1610612720, 0, 851999, 2, 0, 917504, 2, 0, 917511, 2, 0, 917518, 2, 0, 917521, 2, 0, 917528, -1073741823, 0, 917529, -1610612734, 0, 917530, -1610612734, 0, 917531, -1610612734, 0, 917532, -1610612734, 0, 917533, -1610612734, 0, 917534, -1610612734, 0, 917535, 1610612753, 0, 983040, 2, 0, 983047, 2, 0, 983054, 2, 0, 983057, 2, 0, 983064, 2, 0, 983068, -1610612726, 0, 983071, 2, 0, 1048576, 2, 0, 1048580, -1610612726, 0, 1048583, 2, 0, 1048590, 2, 0, 1048591, 1610612743, 0, 1048593, 2, 0, 1048600, 2, 0, 1048607, 2, 0, 1114112, 2, 0, 1114119, 2, 0, 1114120, 3, 0, 1114126, 2, 0, 1114129, 2, 0, 1114133, -1073741808, 0, 1114134, -1610612734, 0, 1114135, -1610612734, 0, 1114136, 1610612753, 0, 1114137, -1073741814, 0, 1114143, 2, 0, 1179648, 2, 0, 1179649, -1073741814, 0, 1179655, 2, 0, 1179662, 1610612737, 0, 1179663, -1610612734, 0, 1179664, -1610612734, 0, 1179665, -1610612735, 0, 1179672, 2, 0, 1179679, 2, 0, 1245184, 2, 0, 1245191, 2, 0, 1245208, 2, 0, 1245215, 2, 0, 1310720, 2, 0, 1310727, 2, 0, 1310744, 2, 0, 1310745, -1073741810, 0, 1310748, 1610612746, 0, 1310751, 2, 0, 1376256, 2, 0, 1376259, 1610612745, 0, 1376261, 1610612743, 0, 1376263, 1610612737, 0, 1376264, -1610612734, 0, 1376265, -1610612734, 0, 1376266, -1610612734, 0, 1376267, -1610612734, 0, 1376268, -1610612734, 0, 1376269, 1, 0, 1376274, -1073741823, 0, 1376275, -1610612734, 0, 1376276, -1610612734, 0, 1376277, -1610612734, 0, 1376278, -1610612734, 0, 1376279, -1610612734, 0, 1376280, -1610612735, 0, 1376281, -1073741813, 0, 1376287, 2, 0, 1441792, 2, 0, 1441799, -1073741816, 0, 1441803, -1073741811, 0, 1441804, -1073741810, 0, 1441805, 2, 0, 1441806, 3, 0, 1441810, 2, 0, 1441811, -1073741816, 0, 1441815, -1073741811, 0, 1441816, -1073741812, 0, 1441817, -1073741811, 0, 1441823, 2, 0, 1507328, 1610612737, 0, 1507329, -1073741822, 0, 1507330, -1073741822, 0, 1507331, -1073741822, 0, 1507332, -1073741822, 0, 1507333, -1073741822, 0, 1507334, -1073741822, 0, 1507335, -1073741822, 0, 1507336, -1073741822, 0, 1507337, -1073741822, 0, 1507338, -1073741822, 0, 1507339, -1073741822, 0, 1507340, -1073741822, 0, 1507341, -1610612735, 0, 1507346, 1610612737, 0, 1507347, -1073741822, 0, 1507348, -1073741822, 0, 1507349, -1073741822, 0, 1507350, -1073741822, 0, 1507351, -1073741822, 0, 1507352, -1073741822, 0, 1507353, -1073741822, 0, 1507354, -1073741822, 0, 1507355, -1073741822, 0, 1507356, -1073741822, 0, 1507357, -1073741822, 0, 1507358, -1073741822, 0, 1507359, -1610612735, 0 )

[node name="Trap" type="TileMap" parent="." groups=[
"Trap",
]]
tile_set = ExtResource( 4 )
format = 1
tile_data = PoolIntArray( 262167, -1073741824, 0, 327703, -1073741824, 0, 393239, -1073741824, 0, 458782, -1073741824, 0, 524306, -1610612736, 0, 524318, -1073741824, 0, 589842, -1610612736, 0, 589854, -1073741824, 0, 655378, -1610612736, 0, 655390, -1073741824, 0, 720926, -1073741824, 0, 786462, -1073741824, 0, 851998, -1073741824, 0, 983063, -1073741824, 0, 1048594, -1610612736, 0, 1114130, -1610612736, 0, 1179666, -1610612736, 0 )

[node name="AnimatedSprite" type="AnimatedSprite" parent="."]
position = Vector2( 1024.28, 768.375 )
scale = Vector2( 0.826007, 0.866986 )
z_index = 4096
frames = SubResource( 1 )
animation = "curtain_up"

[node name="Collectable" parent="." instance=ExtResource( 18 )]
position = Vector2( 1868.97, 212.003 )

[node name="Sprite" type="Sprite" parent="."]
position = Vector2( 1669.52, 843.827 )
scale = Vector2( 0.166221, 0.166221 )
texture = ExtResource( 19 )
