[gd_scene load_steps=22 format=2]

[ext_resource path="res://Scenes/UnitaryScene.gd" type="Script" id=1]
[ext_resource path="res://assets/TileSet/Decors.tres" type="TileSet" id=2]
[ext_resource path="res://assets/TileSet/Level.tres" type="TileSet" id=3]
[ext_resource path="res://assets/TileSet/Traps.tres" type="TileSet" id=4]
[ext_resource path="res://assets/Rideau_1.png" type="Texture" id=5]
[ext_resource path="res://assets/Rideau_2.png" type="Texture" id=6]
[ext_resource path="res://assets/Rideau_3.png" type="Texture" id=7]
[ext_resource path="res://assets/Rideau_4.png" type="Texture" id=8]
[ext_resource path="res://assets/Rideau_5.png" type="Texture" id=9]
[ext_resource path="res://assets/Rideau_6.png" type="Texture" id=10]
[ext_resource path="res://assets/Rideau_7.png" type="Texture" id=11]
[ext_resource path="res://assets/Rideau_8.png" type="Texture" id=12]
[ext_resource path="res://assets/Rideau_10.png" type="Texture" id=13]
[ext_resource path="res://assets/Rideau_11.png" type="Texture" id=14]
[ext_resource path="res://assets/Rideau_12.png" type="Texture" id=15]
[ext_resource path="res://assets/Rideau_13.png" type="Texture" id=16]
[ext_resource path="res://assets/Rideau_14.png" type="Texture" id=17]
[ext_resource path="res://Scenes/Entities/circularsaw.tscn" type="PackedScene" id=18]
[ext_resource path="res://Scenes/Entities/Collectable.tscn" type="PackedScene" id=19]
[ext_resource path="res://assets/Corde.png" type="Texture" id=20]

[sub_resource type="SpriteFrames" id=1]
animations = [ {
"frames": [ ExtResource( 5 ), ExtResource( 6 ), ExtResource( 7 ), ExtResource( 8 ), ExtResource( 9 ), ExtResource( 10 ), ExtResource( 11 ), ExtResource( 12 ), ExtResource( 13 ), ExtResource( 14 ), ExtResource( 15 ), ExtResource( 16 ), ExtResource( 17 ), null ],
"loop": false,
"name": "curtain_up",
"speed": 10.0
} ]

[node name="Node2D" type="Node2D"]
script = ExtResource( 1 )
left_exit = true
right_exit = true

[node name="Decor" type="TileMap" parent="."]
tile_set = ExtResource( 2 )
cell_size = Vector2( 32, 32 )
format = 1

[node name="Wall" type="TileMap" parent="."]
tile_set = ExtResource( 3 )
format = 1
tile_data = PoolIntArray( 0, -1073741823, 0, 1, -1610612734, 0, 2, -1610612734, 0, 3, -1610612734, 0, 4, -1610612734, 0, 5, -1610612734, 0, 6, -1610612734, 0, 7, -1610612734, 0, 8, -1610612734, 0, 9, -1610612734, 0, 10, -1610612734, 0, 11, -1610612734, 0, 12, -1610612734, 0, 13, -1610612734, 0, 14, -1610612734, 0, 15, -1610612734, 0, 16, -1610612734, 0, 17, -1610612734, 0, 18, -1610612734, 0, 19, -1610612734, 0, 20, -1610612734, 0, 21, -1610612734, 0, 22, -1610612734, 0, 23, -1610612734, 0, 24, -1610612734, 0, 25, -1610612734, 0, 26, -1610612734, 0, 27, -1610612734, 0, 28, -1610612734, 0, 29, -1610612734, 0, 30, -1610612734, 0, 31, 1, 0, 65536, 2, 0, 65537, 10, 0, 65542, 10, 0, 65547, 10, 0, 65552, 10, 0, 65557, 10, 0, 65562, 10, 0, 65567, 2, 0, 131072, 2, 0, 131103, 2, 0, 196608, 2, 0, 196639, 2, 0, 262144, 2, 0, 262149, 1610612745, 0, 262153, 1610612745, 0, 262155, -1073741817, 0, 262157, -1073741823, 0, 262158, -1073741822, 0, 262159, -1073741822, 0, 262160, -1073741822, 0, 262161, -1073741822, 0, 262162, 1, 0, 262163, -1073741817, 0, 262167, 1610612745, 0, 262171, 1610612745, 0, 262175, 2, 0, 327680, 2, 0, 327693, 2, 0, 327698, 2, 0, 327711, 2, 0, 393216, 2, 0, 393217, -1073741815, 0, 393221, 1610612746, 0, 393226, 1610612746, 0, 393229, 2, 0, 393234, 2, 0, 393237, 1610612746, 0, 393242, 1610612746, 0, 393245, -1073741815, 0, 393247, 2, 0, 458752, 2, 0, 458765, 2, 0, 458770, 2, 0, 458783, 2, 0, 524288, 2, 0, 524289, -1073741811, 0, 524290, -1073741813, 0, 524301, 2, 0, 524306, 2, 0, 524317, -1073741813, 0, 524318, -1073741811, 0, 524319, 2, 0, 589824, 1610612737, 0, 589825, -1073741822, 0, 589826, -1073741822, 0, 589827, -1073741822, 0, 589828, -1073741822, 0, 589829, -1073741822, 0, 589830, -1073741822, 0, 589831, -1073741822, 0, 589832, -1073741822, 0, 589833, -1073741822, 0, 589834, -1073741822, 0, 589835, -1073741822, 0, 589836, -1073741822, 0, 589837, -1610612735, 0, 589842, 1610612737, 0, 589843, -1073741822, 0, 589844, -1073741822, 0, 589845, -1073741822, 0, 589846, -1073741822, 0, 589847, -1073741822, 0, 589848, -1073741822, 0, 589849, -1073741822, 0, 589850, -1073741822, 0, 589851, -1073741822, 0, 589852, -1073741822, 0, 589853, -1073741822, 0, 589854, -1073741822, 0, 589855, -1610612735, 0, 786446, 4, 0, 917504, -1073741823, 0, 917505, -1073741822, 0, 917506, 1, 0, 917533, -1073741823, 0, 917534, -1073741822, 0, 917535, 1, 0, 983040, 2, 0, 983041, 12, 0, 983042, 2, 0, 983069, 2, 0, 983070, 12, 0, 983071, 2, 0, 1048576, 2, 0, 1048577, 13, 0, 1048578, 1610612737, 0, 1048579, -1610612734, 0, 1048580, -1610612734, 0, 1048581, -1610612734, 0, 1048582, -1610612734, 0, 1048583, -1610612734, 0, 1048584, -1610612734, 0, 1048585, -1610612734, 0, 1048586, -1610612734, 0, 1048587, -1610612734, 0, 1048588, -1610612734, 0, 1048589, -1610612734, 0, 1048590, -1610612734, 0, 1048591, -1610612734, 0, 1048592, -1610612734, 0, 1048593, -1610612734, 0, 1048594, -1610612734, 0, 1048595, -1610612734, 0, 1048596, -1610612734, 0, 1048597, -1610612734, 0, 1048598, -1610612734, 0, 1048599, -1610612734, 0, 1048600, -1610612734, 0, 1048601, -1610612734, 0, 1048602, -1610612734, 0, 1048603, -1610612734, 0, 1048604, -1610612734, 0, 1048605, -1610612735, 0, 1048606, 13, 0, 1048607, 2, 0, 1114112, 2, 0, 1114113, 10, 0, 1114118, 10, 0, 1114123, 10, 0, 1114128, 10, 0, 1114133, 10, 0, 1114138, 10, 0, 1114143, 2, 0, 1179648, 2, 0, 1179679, 2, 0, 1245184, 2, 0, 1245215, 2, 0, 1310720, 2, 0, 1310723, 1610612746, 0, 1310728, 1610612746, 0, 1310733, 1610612746, 0, 1310738, 1610612746, 0, 1310743, 1610612746, 0, 1310748, 1610612746, 0, 1310751, 2, 0, 1376256, 2, 0, 1376287, 2, 0, 1441792, 2, 0, 1441823, 2, 0, 1507328, 1610612737, 0, 1507329, -1610612734, 0, 1507330, -1610612734, 0, 1507331, -1610612734, 0, 1507332, -1610612734, 0, 1507333, -1610612734, 0, 1507334, -1610612734, 0, 1507335, -1610612734, 0, 1507336, -1610612734, 0, 1507337, -1610612734, 0, 1507338, -1610612734, 0, 1507339, -1610612734, 0, 1507340, -1610612734, 0, 1507341, -1610612734, 0, 1507342, -1610612734, 0, 1507343, -1610612734, 0, 1507344, -1610612734, 0, 1507345, -1610612734, 0, 1507346, -1610612734, 0, 1507347, -1610612734, 0, 1507348, -1610612734, 0, 1507349, -1610612734, 0, 1507350, -1610612734, 0, 1507351, -1610612734, 0, 1507352, -1610612734, 0, 1507353, -1610612734, 0, 1507354, -1610612734, 0, 1507355, -1610612734, 0, 1507356, -1610612734, 0, 1507357, -1610612734, 0, 1507358, -1610612734, 0, 1507359, -1610612735, 0 )

[node name="Trap" type="TileMap" parent="." groups=[
"Trap",
]]
tile_set = ExtResource( 4 )
format = 1

[node name="AnimatedSprite" type="AnimatedSprite" parent="."]
position = Vector2( 1024.28, 768.375 )
scale = Vector2( 0.826007, 0.866986 )
z_index = 4096
frames = SubResource( 1 )
animation = "curtain_up"

[node name="root" parent="." instance=ExtResource( 18 )]
position = Vector2( 569.128, 941.521 )
scale = Vector2( 0.2, 0.2 )
p1 = Vector2( 475, 600 )
p2 = Vector2( 475, 800 )

[node name="Collectable" parent="." instance=ExtResource( 19 )]
position = Vector2( 1018.9, 475.684 )

[node name="root2" parent="." instance=ExtResource( 18 )]
position = Vector2( 1406.5, 945.496 )
scale = Vector2( 0.2, 0.2 )
p1 = Vector2( 1275, 600 )
p2 = Vector2( 1275, 800 )

[node name="Sprite" type="Sprite" parent="."]
position = Vector2( 563.9, 838.938 )
scale = Vector2( 0.272386, 0.272386 )
z_index = -5
texture = ExtResource( 20 )

[node name="Sprite2" type="Sprite" parent="."]
position = Vector2( 1408.72, 826.635 )
scale = Vector2( 0.272386, 0.272386 )
z_index = -5
texture = ExtResource( 20 )
