[gd_scene load_steps=6 format=2]

[ext_resource path="res://assets/Star_1.png" type="Texture" id=1]
[ext_resource path="res://Scenes/Entities/Collectable.gd" type="Script" id=2]
[ext_resource path="res://Scenes/Entities/Data/411460__inspectorj__power-up-bright-a.wav" type="AudioStream" id=3]

[sub_resource type="CircleShape2D" id=1]
radius = 160.321

[sub_resource type="Animation" id=2]
resource_name = "get_collectable"
tracks/0/type = "value"
tracks/0/path = NodePath(".:rotation_degrees")
tracks/0/interp = 1
tracks/0/loop_wrap = true
tracks/0/imported = false
tracks/0/enabled = true
tracks/0/keys = {
"times": PoolRealArray( 0, 1 ),
"transitions": PoolRealArray( 1, 1 ),
"update": 0,
"values": [ 0.0, 180.0 ]
}
tracks/1/type = "value"
tracks/1/path = NodePath(".:scale")
tracks/1/interp = 1
tracks/1/loop_wrap = true
tracks/1/imported = false
tracks/1/enabled = true
tracks/1/keys = {
"times": PoolRealArray( 0, 1 ),
"transitions": PoolRealArray( 1, 1 ),
"update": 0,
"values": [ Vector2( 0.25, 0.25 ), Vector2( 1e-005, 1e-005 ) ]
}
tracks/2/type = "value"
tracks/2/path = NodePath(".:offset")
tracks/2/interp = 1
tracks/2/loop_wrap = true
tracks/2/imported = false
tracks/2/enabled = false
tracks/2/keys = {
"times": PoolRealArray( 0, 1 ),
"transitions": PoolRealArray( 1, 1 ),
"update": 0,
"values": [ Vector2( 0, 0 ), Vector2( 0, 1e+006 ) ]
}

[node name="Collectable" type="Sprite"]
scale = Vector2( 0.25, 0.25 )
texture = ExtResource( 1 )
script = ExtResource( 2 )

[node name="StaticBody2D" type="StaticBody2D" parent="."]

[node name="CollisionShape2D" type="CollisionShape2D" parent="StaticBody2D"]
shape = SubResource( 1 )
one_way_collision_margin = 0.0

[node name="AnimationPlayer" type="AnimationPlayer" parent="."]
anims/get_collectable = SubResource( 2 )

[node name="Jingle" type="AudioStreamPlayer2D" parent="."]
stream = ExtResource( 3 )
attenuation = 0.108819
[connection signal="animation_finished" from="AnimationPlayer" to="." method="_on_AnimationPlayer_animation_finished" binds= [ false ]]
