[gd_scene load_steps=20 format=2]

[ext_resource path="res://Scenes/UnitaryScene.gd" type="Script" id=1]
[ext_resource path="res://assets/TileSet/Decors.tres" type="TileSet" id=2]
[ext_resource path="res://assets/TileSet/Level.tres" type="TileSet" id=3]
[ext_resource path="res://assets/TileSet/Traps.tres" type="TileSet" id=4]
[ext_resource path="res://assets/Rideau_1.png" type="Texture" id=5]
[ext_resource path="res://assets/Rideau_2.png" type="Texture" id=6]
[ext_resource path="res://assets/Rideau_3.png" type="Texture" id=7]
[ext_resource path="res://assets/Rideau_4.png" type="Texture" id=8]
[ext_resource path="res://assets/Rideau_5.png" type="Texture" id=9]
[ext_resource path="res://assets/Rideau_6.png" type="Texture" id=10]
[ext_resource path="res://assets/Rideau_7.png" type="Texture" id=11]
[ext_resource path="res://assets/Rideau_8.png" type="Texture" id=12]
[ext_resource path="res://assets/Rideau_10.png" type="Texture" id=13]
[ext_resource path="res://assets/Rideau_11.png" type="Texture" id=14]
[ext_resource path="res://assets/Rideau_12.png" type="Texture" id=15]
[ext_resource path="res://assets/Rideau_13.png" type="Texture" id=16]
[ext_resource path="res://assets/Rideau_14.png" type="Texture" id=17]
[ext_resource path="res://Scenes/Entities/Collectable.tscn" type="PackedScene" id=18]

[sub_resource type="SpriteFrames" id=1]
animations = [ {
"frames": [ ExtResource( 5 ), ExtResource( 6 ), ExtResource( 7 ), ExtResource( 8 ), ExtResource( 9 ), ExtResource( 10 ), ExtResource( 11 ), ExtResource( 12 ), ExtResource( 13 ), ExtResource( 14 ), ExtResource( 15 ), ExtResource( 16 ), ExtResource( 17 ), null ],
"loop": false,
"name": "curtain_up",
"speed": 10.0
} ]

[node name="Node2D" type="Node2D"]
script = ExtResource( 1 )
left_exit = true
up_exit = true

[node name="Decor" type="TileMap" parent="."]
tile_set = ExtResource( 2 )
cell_size = Vector2( 32, 32 )
format = 1
tile_data = PoolIntArray( 655388, 5, 0, 2359297, 536870920, 0, 2359308, 7, 0, 2752515, 4, 0, 2752532, 536870918, 0 )

[node name="Wall" type="TileMap" parent="."]
tile_set = ExtResource( 3 )
format = 1
tile_data = PoolIntArray( 0, -1073741823, 0, 1, -1610612734, 0, 2, -1610612734, 0, 3, -1610612734, 0, 4, -1610612719, 0, 5, -1610612734, 0, 6, -1610612734, 0, 7, -1610612734, 0, 8, -1610612734, 0, 9, -1610612734, 0, 10, -1610612734, 0, 11, -1610612734, 0, 12, -1610612734, 0, 13, -1610612720, 0, 18, -1073741823, 0, 19, -1610612734, 0, 20, -1610612734, 0, 21, -1610612734, 0, 22, -1610612734, 0, 23, -1610612734, 0, 24, -1610612734, 0, 25, -1610612734, 0, 26, -1610612734, 0, 27, -1610612734, 0, 28, -1610612734, 0, 29, -1610612734, 0, 30, -1610612734, 0, 31, 1, 0, 65536, 2, 0, 65540, 2, 0, 65554, 2, 0, 65557, 1610612746, 0, 65562, 1610612746, 0, 65565, -1610612727, 0, 65567, 2, 0, 131072, 2, 0, 131076, 2, 0, 131090, 2, 0, 131103, 2, 0, 196608, 2, 0, 196609, -1073741814, 0, 196612, 2, 0, 196622, 4, 0, 196626, 2, 0, 196639, 2, 0, 262144, 2, 0, 262148, 2, 0, 262162, 2, 0, 262166, -1610612726, 0, 262172, -1610612726, 0, 262175, 2, 0, 327680, 2, 0, 327684, 2, 0, 327698, 2, 0, 327711, 2, 0, 393216, 2, 0, 393217, -1610612729, 0, 393219, -1610612722, 0, 393220, 2, 0, 393234, 2, 0, 393235, -1073741814, 0, 393241, -1073741814, 0, 393247, 2, 0, 458752, 2, 0, 458755, -1610612724, 0, 458756, 2, 0, 458762, -1073741823, 0, 458763, -1610612734, 0, 458764, -1610612734, 0, 458765, -1610612734, 0, 458766, -1610612734, 0, 458767, -1610612734, 0, 458768, -1610612734, 0, 458769, -1610612734, 0, 458770, -1610612735, 0, 458783, 2, 0, 524288, 2, 0, 524289, -1610612723, 0, 524290, -1610612722, 0, 524291, -1610612725, 0, 524292, 2, 0, 524298, 2, 0, 524302, -1610612728, 0, 524306, -1610612728, 0, 524319, 2, 0, 589824, 1610612737, 0, 589825, -1610612734, 0, 589826, -1610612734, 0, 589827, -1610612734, 0, 589828, -1610612735, 0, 589834, 1610612737, 0, 589835, -1610612734, 0, 589836, -1610612734, 0, 589837, -1610612734, 0, 589838, -1610612734, 0, 589839, -1610612734, 0, 589840, -1610612734, 0, 589841, -1610612734, 0, 589842, -1610612734, 0, 589843, -1610612734, 0, 589844, -1610612734, 0, 589845, -1610612734, 0, 589846, -1610612734, 0, 589847, -1610612734, 0, 589848, -1610612734, 0, 589849, -1610612734, 0, 589850, -1610612734, 0, 589851, -1610612734, 0, 589852, -1610612734, 0, 589853, -1610612734, 0, 589854, -1610612734, 0, 589855, 1610612753, 0, 655365, 3, 0, 655391, 2, 0, 720927, 2, 0, 786463, 2, 0, 851999, 2, 0, 917504, -1073741823, 0, 917505, -1610612734, 0, 917506, -1610612734, 0, 917507, -1610612734, 0, 917508, -1610612734, 0, 917509, -1610612734, 0, 917510, -1610612734, 0, 917511, -1610612734, 0, 917512, -1610612734, 0, 917513, -1610612734, 0, 917514, -1610612734, 0, 917515, -1610612734, 0, 917516, -1610612734, 0, 917517, -1610612734, 0, 917518, -1610612734, 0, 917519, -1610612734, 0, 917520, -1610612734, 0, 917521, -1610612734, 0, 917522, -1610612734, 0, 917523, -1610612720, 0, 917535, 2, 0, 983040, 2, 0, 983071, 2, 0, 1048576, 2, 0, 1048607, 2, 0, 1114112, 2, 0, 1114134, 3, 0, 1114143, 2, 0, 1179648, 2, 0, 1179679, 2, 0, 1245184, 2, 0, 1245213, 0, 0, 1245215, 2, 0, 1310720, 2, 0, 1310751, 2, 0, 1376256, 2, 0, 1376283, 0, 0, 1376285, 0, 0, 1376287, 2, 0, 1441792, 2, 0, 1441823, 2, 0, 1507328, 1610612737, 0, 1507329, -1610612734, 0, 1507330, -1610612734, 0, 1507331, -1610612734, 0, 1507332, -1610612734, 0, 1507333, -1610612734, 0, 1507334, -1610612734, 0, 1507335, -1610612734, 0, 1507336, -1610612734, 0, 1507337, -1610612734, 0, 1507338, -1610612734, 0, 1507339, -1610612734, 0, 1507340, -1610612734, 0, 1507341, -1610612734, 0, 1507342, -1610612734, 0, 1507343, -1610612734, 0, 1507344, -1610612734, 0, 1507345, -1610612734, 0, 1507346, -1610612734, 0, 1507347, -1610612734, 0, 1507348, -1610612734, 0, 1507349, -1610612734, 0, 1507350, -1610612734, 0, 1507351, -1610612734, 0, 1507352, -1610612734, 0, 1507353, -1610612734, 0, 1507354, -1610612734, 0, 1507355, -1610612734, 0, 1507356, -1610612734, 0, 1507357, -1610612734, 0, 1507358, -1610612734, 0, 1507359, -1610612735, 0 )

[node name="Trap" type="TileMap" parent="." groups=[
"Trap",
]]
tile_set = ExtResource( 4 )
format = 1
tile_data = PoolIntArray( 655380, 1610612736, 0, 655381, 1610612736, 0, 655382, 1610612736, 0, 1048585, 1610612737, 0, 1048586, 1610612737, 0, 1048587, 1610612737, 0, 1048588, 1610612737, 0, 1048589, 1610612737, 0, 1048590, 1610612737, 0, 1048591, 1610612737, 0, 1048592, 1610612737, 0, 1048593, 1610612737, 0, 1441804, 0, 0, 1441805, 0, 0, 1441806, 0, 0 )

[node name="AnimatedSprite" type="AnimatedSprite" parent="."]
position = Vector2( 1024.28, 768.375 )
scale = Vector2( 0.826007, 0.866986 )
z_index = 4096
frames = SubResource( 1 )
animation = "curtain_up"

[node name="Collectable" parent="." instance=ExtResource( 18 )]
position = Vector2( 298.478, 1244.12 )
