module github.com/marouenne/qrcodeGenerator

go 1.19

require (
	github.com/fogleman/gg v1.3.0
	github.com/nfnt/resize v0.0.0-20180221191011-83c6a9932646
	github.com/skip2/go-qrcode v0.0.0-20200617195104-da1b6568686e
)

require (
	github.com/golang/freetype v0.0.0-20170609003504-e2365dfdc4a0 // indirect
	golang.org/x/image v0.7.0 // indirect
	gonum.org/v1/gonum v0.13.0
)
