{
    "$schema": "http:\/\/json-schema.org\/draft-04\/schema#",
    "type": "object",
    "title": "PourcentUsufruit",
    "description": "<p>barème du pourcentage de valeur du bien en fonction de l'age usufruitier<\/p>",
    "properties": {
        "BaremeUsufruit": {
            "type": "array",
            "title": "barème du pourcentage de valeur du bien en fonction de l'age usufruitier",
            "description": "",
            "items": {
                "type": "object",
                "properties": {
                    "id": {
                        "type": "integer",
                        "title": "id [primarykey:1, autoincrement:9, type:integer]",
                        "description": "Identifiant interne"
                    },
                    "DebutTranche": {
                        "type": "integer",
                        "title": "Début de la tranche [type:integer]",
                        "description": "<p>Début de la tranche<\/p>"
                    },
                    "FinTranche": {
                        "type": "integer",
                        "title": "Fin de la tranche [type:integer]",
                        "description": "<p>Fin de la tranche<\/p>"
                    },
                    "PourcentUsufruit": {
                        "type": "number",
                        "title": "Pourcentage usufruit [type:percent]",
                        "description": "<p>Pourcentage usufruit<\/p>"
                    },
                    "Pourcentnuepropriete": {
                        "type": "number",
                        "title": "Pourcentage nue propriété [type:percent]",
                        "description": "<p>Pourcentage nue propriété<\/p>"
                    }
                },
                "required": [
                    "id",
                    "DebutTranche",
                    "FinTranche",
                    "PourcentUsufruit",
                    "Pourcentnuepropriete"
                ]
            }
        }
    },
    "required": [
        "BaremeUsufruit"
    ]
}