{
    "annuaire": [
        {
            "id": 2,
            "nom": "Fédération française d'athlétisme",
            "telephone": "01 53 80 70 00",
            "Freqyence": "3 ans",
            "siteweb": "www.athle.fr",
            "email": "ffa@athle.org",
            "maj": "16 juillet 2018"
        },
        {
            "id": 3,
            "nom": "Fédération française d'aviron",
            "telephone": "01 45 14 26 40",
            "siteweb": "www.ffaviron.fr",
            "email": "vanessa.lete@ffaviron.fr",
            "maj": "16 juillet 2018"
        },
        {
            "id": 4,
            "nom": "Fédération française de badminton",
            "telephone": "01 49 45 07 07",
            "Freqyence": "3 ans",
            "siteweb": "www.ffbad.org",
            "email": "ffbad@ffbad.org",
            "maj": "16 juillet 2018"
        },
        {
            "id": 5,
            "nom": "Fédération française de baseball, softball",
            "telephone": "01 44 68 89 30",
            "siteweb": "www.ffbs.fr",
            "email": "contact@ffbs.fr",
            "maj": "16 juillet 2018"
        },
        {
            "id": 6,
            "nom": "Fédération française de basketball",
            "telephone": "01 53 94 25 00",
            "Freqyence": "3 ans",
            "siteweb": "www.ffbb.com",
            "email": "www@basketfrance.com",
            "maj": "16 juillet 2018"
        },
        {
            "id": 7,
            "nom": "Fédération française de boxe",
            "telephone": "01 49 42 28 79",
            "siteweb": "www.ffboxe.asso.fr",
            "email": "jean-baptiste.marsaud@ff-boxe.com",
            "maj": "16 juillet 2018"
        },
        {
            "id": 8,
            "nom": "Fédération française de canoë-kayak",
            "telephone": "01 45 11 08 50",
            "siteweb": "www.ffck.org",
            "email": "ffck@ffck.org",
            "maj": "16 juillet 2018"
        },
        {
            "id": 9,
            "nom": "Fédération française de cyclisme",
            "telephone": "01 81 88 09 24",
            "Freqyence": "3 ans",
            "siteweb": "www.ffc.fr",
            "email": "info@ffc.fr",
            "maj": "16 juillet 2018"
        },
        {
            "id": 10,
            "nom": "Fédération française d'équitation",
            "telephone": "02 54 94 46 00",
            "Freqyence": "3 ans",
            "siteweb": "www.ffe.com",
            "email": "direction@ffe.com",
            "maj": "16 juillet 2018"
        },
        {
            "id": 11,
            "nom": "Fédération française d'escrime",
            "telephone": "01 43 62 20 50",
            "siteweb": "www.escrime-ffe.fr",
            "email": "ffe@escrime-ffe.fr",
            "maj": "16 juillet 2018"
        },
        {
            "id": 12,
            "nom": "Fédération française de football",
            "telephone": "01 44 31 73 00",
            "Freqyence": "3 ans",
            "siteweb": "www.fff.fr",
            "email": "webmaster@fff.fr",
            "maj": "16 juillet 2018"
        },
        {
            "id": 13,
            "nom": "Fédération française de golf",
            "telephone": "01 41 49 77 00",
            "Freqyence": "3 ans",
            "siteweb": "www.ffgolf.org",
            "email": "accueil@ffgolf.org",
            "maj": "16 juillet 2018"
        },
        {
            "id": 14,
            "nom": "Fédération française de gymnastique",
            "telephone": "01 48 01 24 48",
            "Freqyence": "3 ans",
            "siteweb": "www.ffgym.com",
            "email": "contact@ffgym.fr",
            "maj": "16 juillet 2018"
        },
        {
            "id": 15,
            "nom": "Fédération française d'haltérophilie, musculation",
            "telephone": "01 55 09 14 25",
            "siteweb": "www.ffhaltero.fr",
            "email": "contact@ffhaltero.fr",
            "maj": "16 juillet 2018"
        },
        {
            "id": 16,
            "nom": "Fédération française de handball",
            "telephone": "01 46 15 03 55",
            "Freqyence": "3 ans",
            "siteweb": "www.ff-handball.org",
            "email": "reception@ff-handball.org",
            "maj": "16 juillet 2018"
        },
        {
            "id": 17,
            "nom": "Fédération française de hockey",
            "telephone": "01 44 69 33 69",
            "siteweb": "www.ffhockey.org",
            "email": "ffh@ffhockey.org",
            "maj": "16 juillet 2018"
        },
        {
            "id": 18,
            "nom": "Fédération française de hockey sur glace",
            "telephone": "01 85 76 49 49",
            "siteweb": "www.hockeyfrance.com",
            "email": "contacts@ffhg.eu",
            "maj": "13 Juillet 2018"
        },
        {
            "id": 19,
            "nom": "Fédération française de judo, jujitsu, kendo et disciplines associées",
            "telephone": "01 40 52 16 16",
            "Freqyence": "3 ans",
            "siteweb": "www.ffjudo.com",
            "email": "sportif@ffjudo.com",
            "maj": "16 juillet 2018"
        },
        {
            "id": 20,
            "nom": "Fédération française de karaté et disciplines associées",
            "telephone": "01 41 17 44 40",
            "Freqyence": "1 an",
            "siteweb": "www.ffkarate.fr",
            "email": "info@ffkarate.fr",
            "maj": "16 juillet 2018"
        },
        {
            "id": 21,
            "nom": "Fédération française de lutte",
            "telephone": "01 41 79 59 10",
            "siteweb": "www.fflutte.com",
            "email": "ffl@fflutte.org",
            "maj": "16 juillet 2018"
        },
        {
            "id": 22,
            "nom": "Fédération française de la montagne et de l'escalade",
            "telephone": "01 40 18 75 50",
            "siteweb": "www.ffme.fr",
            "email": "dtn@ffme.fr",
            "maj": "16 juillet 2018"
        },
        {
            "id": 23,
            "nom": "Fédération française de natation",
            "telephone": "01 41 83 87 70",
            "Freqyence": "3 ans",
            "siteweb": "www.ffnatation.fr",
            "email": "ffn@ffnatation.fr",
            "maj": "16 juillet 2018"
        },
        {
            "id": 24,
            "nom": "Fédération française de pentathlon moderne",
            "telephone": "01 58 10 06 66",
            "siteweb": "www.ffpentathlon.fr",
            "email": "federation@ffpentathlon.f",
            "maj": "16 juillet 2018"
        },
        {
            "id": 25,
            "nom": "Fédération française de roller et skateboard",
            "telephone": "05 56 33 65 65",
            "siteweb": "www.ffroller-skateboard.com",
            "email": "contact@ffroller-skateboard.com",
            "maj": "16 juillet 2018"
        },
        {
            "id": 26,
            "nom": "Fédération française de rugby",
            "telephone": "01 69 63 64 65",
            "Freqyence": "1 an",
            "siteweb": "www.ffr.fr",
            "maj": "16 juillet 2018"
        },
        {
            "id": 27,
            "nom": "Fédération française de ski",
            "telephone": "04 50 51 40 34",
            "Freqyence": "3 ans",
            "siteweb": "www.ffs.fr",
            "email": "contact@ffs.fr",
            "maj": "16 juillet 2018"
        },
        {
            "id": 28,
            "nom": "Fédération française des sports de glace",
            "telephone": "01 43 46 10 20",
            "siteweb": "www.ffsg.org",
            "email": "ffsg@ffsg.org",
            "maj": "16 juillet 2018"
        },
        {
            "id": 29,
            "nom": "Fédération française de surf",
            "telephone": "05 58 43 55 88",
            "siteweb": "www.surfingfrance.com",
            "email": "dtn@surfingfrance.com",
            "maj": "16 juillet 2018"
        },
        {
            "id": 30,
            "nom": "Fédération française de taekwondo",
            "telephone": "04 37 56 14 14",
            "siteweb": "www.fftda.fr",
            "email": "assistante.dtn@fftda.fr",
            "maj": "16 juillet 2018"
        },
        {
            "id": 31,
            "nom": "Fédération française de tennis",
            "telephone": "01 47 43 48 00",
            "Freqyence": "3 ans",
            "siteweb": "www.fft.fr",
            "email": "fft@fft.fr",
            "maj": "16 juillet 2018"
        },
        {
            "id": 32,
            "nom": "Fédération française de tennis de table",
            "telephone": "01 53 94 50 00",
            "Freqyence": "3 ans",
            "siteweb": "www.fftt.com",
            "email": "fftt@fftt.email",
            "maj": "16 juillet 2018"
        },
        {
            "id": 33,
            "nom": "Fédération française de tir",
            "telephone": "01 58 05 45 45",
            "Freqyence": "1 an",
            "siteweb": "www.fftir.org",
            "email": "accueil@fftir.org",
            "maj": "16 juillet 2018"
        },
        {
            "id": 34,
            "nom": "Fédération française de tir à l'arc",
            "telephone": "01 58 03 58 58",
            "siteweb": "www.ffta.fr",
            "email": "ffta@ffta.fr",
            "maj": "16 juillet 2018"
        },
        {
            "id": 35,
            "nom": "Fédération française de triathlon",
            "telephone": "01 49 46 13 50",
            "siteweb": "www.fftri.com",
            "email": "contact@fftri.com",
            "maj": "16 juillet 2018"
        },
        {
            "id": 36,
            "nom": "Fédération française de voile",
            "telephone": "01 40 60 37 00",
            "Freqyence": "3 ans",
            "siteweb": "www.ffvoile.fr",
            "email": "dtn@ffvoile.fr",
            "maj": "16 juillet 2018"
        },
        {
            "id": 37,
            "nom": "Fédération française de volley-ball",
            "telephone": "01 58 42 22 22",
            "siteweb": "www.ffvb.org",
            "email": "ffvb@ffvb.org",
            "maj": "16 juillet 2018"
        },
        {
            "id": 38,
            "nom": "Fédération française d'aéromodélisme",
            "telephone": "01 43 55 82 03",
            "siteweb": "www.ffam.asso.fr",
            "email": "ffam@ffam.asso.fr",
            "maj": "16 juillet 2018"
        },
        {
            "id": 39,
            "nom": "Fédération française aéronautique",
            "telephone": "01 44 29 92 00",
            "siteweb": "www.ff-aero.fr",
            "email": "contact@ff-aero.fr",
            "maj": "16 juillet 2018"
        },
        {
            "id": 40,
            "nom": "Fédération française d'aérostation",
            "telephone": "01 47 23 56 20",
            "siteweb": "www.ffaerostation.org",
            "email": "ffa@ffaerostation.org",
            "maj": "16 juillet 2018"
        },
        {
            "id": 41,
            "nom": "Fédération française d'aïkido, d'aïkibudo et affinitaires",
            "telephone": "01 43 48 22 22",
            "siteweb": "www.aikido.com.fr",
            "email": "ffaaa@aikido.com.fr",
            "maj": "16 juillet 2018"
        },
        {
            "id": 42,
            "nom": "Fédération française d'aïkido et de budo",
            "telephone": "04 98 05 22 28",
            "siteweb": "www.ffabaikido.fr",
            "email": "ffab.aikido@wanadoo.fr",
            "maj": "16 juillet 2018"
        },
        {
            "id": 43,
            "nom": "Fédération des arts énergétiques et martiaux chinois",
            "telephone": "01 40 26 95 42",
            "siteweb": "www.faemc.fr",
            "email": "adpresident@faemc.fr",
            "maj": "16 juillet 2018"
        },
        {
            "id": 44,
            "nom": "Fédération française de ballon au poing",
            "telephone": "03 22 96 86 65",
            "siteweb": "http:\/\/balonaupoing.com\/",
            "email": "ffbp@wanadoo.fr",
            "maj": "16 juillet 2018"
        },
        {
            "id": 45,
            "nom": "Fédération française de ball-trap",
            "telephone": "01 41 41 05 05",
            "siteweb": "www.ffbt.asso.fr",
            "email": "secretariat@ffbt.asso.fr",
            "maj": "16 juillet 2018"
        },
        {
            "id": 46,
            "nom": "Fédération française de billard",
            "telephone": "04 70 96 01 01",
            "siteweb": "www.ffbillard.com",
            "email": "ffb@ffbillard.com",
            "maj": "16 juillet 2018"
        },
        {
            "id": 47,
            "nom": "Fédération française de bowling et de sport de quilles",
            "telephone": "01 69 02 70 00",
            "siteweb": "www.ffbsq.org",
            "email": "contact@ffbsq.org"
        },
        {
            "id": 48,
            "nom": "Fédération française de char à voile",
            "telephone": "01 45 58 75 75",
            "siteweb": "www.ffcv.org",
            "email": "secretariat@ffcv.org"
        },
        {
            "id": 49,
            "nom": "Fédération française de course camarguaise",
            "telephone": "04 66 26 05 35",
            "siteweb": "www.ffcc.info",
            "email": "catherine.ffcc@gmail.com"
        },
        {
            "id": 50,
            "nom": "Fédération française de la course landaise",
            "telephone": "05 58 46 50 89",
            "siteweb": "www.courselandaise.org\/",
            "email": "contact@ffcl.fr"
        },
        {
            "id": 51,
            "nom": "Fédération française de course d'orientation",
            "telephone": "01 47 97 11 91",
            "siteweb": "www.ffcorientation.fr",
            "email": "contact@ffcorientation.fr"
        },
        {
            "id": 52,
            "nom": "Fédération française de cyclotourisme",
            "telephone": "01 56 20 88 88",
            "Freqyence": "5 ans",
            "siteweb": "www.ffct.org",
            "email": "info@ffct.org",
            "maj": "16 juillet 2018"
        },
        {
            "id": 53,
            "nom": "Fédération française de danse",
            "telephone": "01 40 16 53 38",
            "siteweb": "www.ffdanse.fr",
            "email": "contact@ffdanse.fr"
        },
        {
            "id": 54,
            "nom": "Fédération de double dutch",
            "telephone": "01 45 73 07 02",
            "siteweb": "www.ffdd.fr",
            "email": "federationfrancaisedoubledutch@gmail.com"
        },
        {
            "id": 55,
            "nom": "Fédération française d'études et sports sous-marins",
            "telephone": "04 91 33 99 31",
            "siteweb": "www.ffessm.fr",
            "email": "secretariat@ffessm.fr"
        },
        {
            "id": 56,
            "nom": "Fédération de flying disc France",
            "telephone": "09 53 68 14 83",
            "siteweb": "www.ffdf.fr",
            "email": "info@ffdf.fr"
        },
        {
            "id": 57,
            "nom": "Fédération française de football américain",
            "telephone": "01 43 11 14 70",
            "siteweb": "www.fffa.org",
            "email": "fffa@fffa.org"
        },
        {
            "id": 58,
            "nom": "Fédération française de force",
            "telephone": "01 76 24 88 08",
            "siteweb": "http:\/\/www.force.fr",
            "email": "stephane.hatot@ffforce.fr"
        },
        {
            "id": 59,
            "nom": "Fédération française de giraviation",
            "telephone": "01 60 05 71 20",
            "siteweb": "www.helico.org",
            "email": "ff.giraviation@gmail.com"
        },
        {
            "id": 60,
            "nom": "Fédération française de javelot tir sur cible",
            "telephone": "03 22 77 29 97",
            "siteweb": "http:\/\/philippe.plouviez.pagesperso-orange.fr\/javelot\/fede\/fede.htm",
            "email": "daniel.breviere@sfr.fr"
        },
        {
            "id": 61,
            "nom": "Fédération française de jeu de paume",
            "telephone": "03 27 66 33 04",
            "siteweb": "www.jeudepaume.fr\/",
            "email": "ffjp@jeudepaume.fr"
        },
        {
            "id": 62,
            "nom": "Fédération française de joute et sauvetage nautique",
            "telephone": "06 85 94 46 43",
            "siteweb": "www.ffjsn.com",
            "email": "anne-lise.perret@orange.f"
        },
        {
            "id": 63,
            "nom": "Fédération française de Kick Boxing, Muay Thaï et disciplines associées",
            "telephone": "01 43 60 53 95",
            "siteweb": "www.ffkmda.fr",
            "email": "direction@ffkmda.fr"
        },
        {
            "id": 64,
            "nom": "Fédération française de longue paume",
            "telephone": "03 22 95 65 09",
            "siteweb": "www.longue-paume.fr",
            "email": "bruno.chiraux@gmail.com"
        },
        {
            "id": 65,
            "nom": "Fédération française de motocyclisme",
            "telephone": "01 49 23 77 00",
            "siteweb": "www.ffmoto.org",
            "email": "ffm@ffmoto.com"
        },
        {
            "id": 66,
            "nom": "Fédération française motonautique",
            "telephone": "01 42 24 60 88",
            "siteweb": "www.ffmotonautique.com",
            "email": "contact@ffmotonautique.com"
        },
        {
            "id": 67,
            "nom": "Fédération française de parachutisme",
            "telephone": "01 53 46 68 68",
            "siteweb": "www.ffp.asso.fr",
            "email": "ffp@ffp.asso.fr"
        },
        {
            "id": 68,
            "nom": "Fédération nautique de pêche sportive  en apnée",
            "telephone": "02 98 06 57 76",
            "siteweb": "www.fnpsa.net\/",
            "email": "fnpsa.secretariatfederal@orange.fr"
        },
        {
            "id": 69,
            "nom": "Fédération française des pêches sportives",
            "telephone": "06 08 46 39 81",
            "email": "jgoupil@ffpspeches.fr"
        },
        {
            "id": 70,
            "nom": "Fédération française de pelote basque",
            "telephone": "05 59 59 22 34",
            "siteweb": "www.ffpb.net",
            "email": "ffpb@orange.fr"
        },
        {
            "id": 71,
            "nom": "Fédération française de pétanque et jeu provençal",
            "telephone": "04 91 14 05 80",
            "Freqyence": "3 ans",
            "siteweb": "http:\/\/www.portail-ffpjp.fr\/",
            "email": "ffpjp.siege@petanque.fr",
            "maj": "16 juillet 2018"
        },
        {
            "id": 72,
            "nom": "Fédération française de planeur ultraléger motorisé",
            "telephone": "01 49 81 74 43",
            "siteweb": "www.ffplum.org",
            "email": "ffplum@ffplum.org"
        },
        {
            "id": 73,
            "nom": "Fédération française de polo",
            "telephone": "01 44 14 10 00",
            "siteweb": "www.francepolo.com",
            "email": "communication@francepolo.com"
        },
        {
            "id": 74,
            "nom": "Fédération française de pulka et traineau à chiens",
            "telephone": "06 07 05 03 73"
        },
        {
            "id": 75,
            "nom": "Fédération française de la randonnée pédestre",
            "telephone": "01 44 89 93 93",
            "Freqyence": "3 ans",
            "siteweb": "www.ffrandonnee.fr",
            "email": "direction@ffrandonnee.fr",
            "maj": "16 juillet 2018"
        },
        {
            "id": 76,
            "nom": "Fédération française de rugby à XIII",
            "telephone": "01 75 44 97 57",
            "siteweb": "www.ffr13.fr",
            "email": "contact@ffr13.fr"
        },
        {
            "id": 77,
            "nom": "Fédération française de savate, boxe française et disciplines associées",
            "telephone": "01 53 24 60 60",
            "siteweb": "www.ffsavate.com",
            "email": "webmaster@ffsavate.com"
        },
        {
            "id": 78,
            "nom": "Fédération française de sauvetage et de secourisme",
            "telephone": "01 46 27 62 90",
            "siteweb": "www.ffss.fr",
            "email": "ffssparis@orange.fr"
        },
        {
            "id": 79,
            "nom": "fédération française de ski nautique et de wakeboard",
            "telephone": "01 53 20 19 19",
            "siteweb": "www.ffsnw.fr",
            "email": "ffsnw@ffsnw.fr"
        },
        {
            "id": 80,
            "nom": "Fédération française de spéléologie",
            "telephone": "04 72 56 09 63",
            "siteweb": "www.ffspeleo.fr",
            "email": "secretariat@ffspeleo.fr"
        },
        {
            "id": 81,
            "nom": "fédération française de sport automobile",
            "telephone": "01 44 30 24 00",
            "siteweb": "www.ffsa.org",
            "email": "hotesses@ffsa.org"
        },
        {
            "id": 82,
            "nom": "Fédération française du sport boules",
            "telephone": "04 78 52 22 22",
            "siteweb": "www.ffsb.asso.fr",
            "email": "daf@ffsb.asso.fr"
        },
        {
            "id": 83,
            "nom": "Fédération française des sports de traîneau, de ski\/vtt joëring et de canicross",
            "telephone": "04 71 20 93 38",
            "siteweb": "ffst.info",
            "email": "antoineffst@orange.fr"
        },
        {
            "id": 84,
            "nom": "Fédération française sportive de twirling bâton",
            "telephone": "08 05 69 03 82",
            "siteweb": "www.fftwirling.fr",
            "email": "accueil@ffstb.fr"
        },
        {
            "id": 85,
            "nom": "Fédération française de squash",
            "telephone": "01 55 12 34 90",
            "siteweb": "www.ffsquash.com",
            "email": "contact@ffsquash.com"
        },
        {
            "id": 86,
            "nom": "Fédération française de vol à voile",
            "telephone": "01 45 44 04 78",
            "siteweb": "www.ffvv.org",
            "email": "info@ffvv.org"
        },
        {
            "id": 87,
            "nom": "Fédération française de vol libre",
            "telephone": "04 97 03 82 82",
            "siteweb": "www.ffvl.fr",
            "email": "ffvl@ffvl.fr"
        },
        {
            "id": 88,
            "nom": "Fédération sportive des ASPTT",
            "telephone": "01 43 90 64 90",
            "siteweb": "http:\/\/www.asptt.com",
            "email": "contact@asptt.com"
        },
        {
            "id": 89,
            "nom": "Fédération française des clubs alpins et de montagne",
            "telephone": "01 53 72 87 52",
            "siteweb": "http:\/\/www.clubalpin.com",
            "email": "directeur@ffcam.fr"
        },
        {
            "id": 90,
            "nom": "Fédération française des clubs omnisports",
            "telephone": "01 42 53 00 05",
            "siteweb": "http:\/\/www.ffco.org",
            "email": "ffco@wanadoo.fr"
        },
        {
            "id": 91,
            "nom": "Fédération des clubs sportifs et artistiques de la défense",
            "telephone": "01 79 86 34 89",
            "siteweb": "https:\/\/www.lafederationdefense.fr\/",
            "email": "p.raveau@lafederationdefense.fr"
        },
        {
            "id": 92,
            "nom": "Fédération sportive et culturelle de France",
            "telephone": "01 43 38 50 57",
            "siteweb": "https:\/\/www.fscf.asso.fr\/",
            "email": "direction@fscf.asso.fr"
        },
        {
            "id": 93,
            "nom": "Fédération Sportive Educative de l'Enseignement Catholique (UGSEL)",
            "telephone": "01 44 41 48 50",
            "siteweb": "http:\/\/www.ugsel.org\/",
            "email": "ugsel@ugsel.org"
        },
        {
            "id": 94,
            "nom": "Fédération française d'éducation physique et de gymnastique volontaire",
            "telephone": "01 41 72 26 00",
            "siteweb": "https:\/\/www.sport-sante.fr\/",
            "email": "sabine.macuace@ffepgv.fr"
        },
        {
            "id": 95,
            "nom": "Fédération française handisport",
            "telephone": "01 40 31 45 00",
            "siteweb": "http:\/\/www.handisport.org\/",
            "email": "accueil@handisport.org"
        },
        {
            "id": 96,
            "nom": "Fédération française maccabi",
            "telephone": "01 43 67 07 62",
            "siteweb": "http:\/\/www.maccabifrance.fr\/",
            "email": "ffmaccabi@free.fr"
        },
        {
            "id": 97,
            "nom": "Fédération nationale des offices municipaux des sports",
            "telephone": "01 79 84 85 10",
            "siteweb": "https:\/\/www.fnoms.org\/",
            "email": "fnoms@fnoms.org"
        },
        {
            "id": 98,
            "nom": "Fédération française omnisports des personnels de l'éducation nationale de la jeunesse et sports",
            "telephone": "02 47 40 05 39",
            "siteweb": "https:\/\/www.2fopen.com\/",
            "email": "contact@2fopen.com"
        },
        {
            "id": 99,
            "nom": "Fédération sportive de la police nationale",
            "telephone": "01 57 14 21 36",
            "siteweb": "http:\/\/www.france-police-sport.org\/",
            "email": "fspn-sport-police@interieur.gouv.fr"
        },
        {
            "id": 100,
            "nom": "Fédération française de la retraite sportive",
            "telephone": "04 76 53 09 80",
            "siteweb": "https:\/\/www.ffrs-retraite-sportive.org\/",
            "email": "ffrs38@free.fr"
        },
        {
            "id": 101,
            "nom": "Fédération sportive et gymnique du travail",
            "telephone": "01 49 42 23 20",
            "siteweb": "http:\/\/www.fsgt.org\/",
            "email": "direction@fsgt.org"
        },
        {
            "id": 102,
            "nom": "Fédération française du sport adapté",
            "telephone": "01 42 73 90 00",
            "siteweb": "http:\/\/www.ffsa.asso.fr\/",
            "email": "mireille.segerie@ffsa.asso.f"
        },
        {
            "id": 103,
            "nom": "Fédération française du sport d'entreprise",
            "telephone": "01 56 64 02 10",
            "siteweb": "http:\/\/www.ffse.fr\/",
            "email": "secretariat@ffse.fr"
        },
        {
            "id": 104,
            "nom": "Fédération nationale du sport en milieu rural",
            "telephone": "09 72 29 09 72",
            "siteweb": "http:\/\/www.fnsmr.org\/",
            "email": "federation@sportrural.fr"
        },
        {
            "id": 105,
            "nom": "Fédération française des sports populaires",
            "telephone": "03 90 23 46 52"
        },
        {
            "id": 106,
            "nom": "Fédération française sports pour tous",
            "telephone": "01 41 67 50 70",
            "siteweb": "https:\/\/www.sportspourtous.org\/",
            "email": "info@sportspourtous.org"
        },
        {
            "id": 107,
            "nom": "Fédération française du sport travailliste",
            "telephone": "01 30 07 70 70",
            "siteweb": "http:\/\/www.ffst-multisports.com\/",
            "email": "f-f-s-t@orange.fr"
        },
        {
            "id": 108,
            "nom": "Fédération française du sport universitaire",
            "telephone": "01 58 68 22 75",
            "siteweb": "http:\/\/www.sport-u.com\/",
            "email": "federation@sport-u.com"
        },
        {
            "id": 109,
            "nom": "UCPA SPORT VACANCES",
            "telephone": "01 45 87 45 87",
            "siteweb": "https:\/\/www.ucpa-vacances.com\/",
            "email": "bthomas@ucpa.asso.f"
        },
        {
            "id": 110,
            "nom": "Union nationale sportive Léo Lagrange",
            "telephone": "01 53 09 00 22",
            "siteweb": "http:\/\/www.leolagrange-sport.org\/",
            "email": "union.sportive@leolagrange.org"
        },
        {
            "id": 111,
            "nom": "Union française des œuvres laïques d'éducation physique",
            "telephone": "01 43 58 97 65",
            "siteweb": "http:\/\/www.ufolep.org\/",
            "email": "avrignaud.laligue@ufolep-usep.fr"
        },
        {
            "id": 112,
            "nom": "Union nationale du sport scolaire",
            "telephone": "01 42 81 55 11",
            "siteweb": "https:\/\/unss.org\/",
            "email": "dn@unss.org"
        },
        {
            "id": 113,
            "nom": "Union nationale des clubs universitaires",
            "telephone": "04 99 58 80 50",
            "siteweb": "http:\/\/www.uncu.fr\/",
            "email": "secretariat@uncu.fr"
        },
        {
            "id": 114,
            "nom": "Union sportive de l'enseignement du premier degré",
            "telephone": "01 43 58 97 48",
            "siteweb": "https:\/\/usep.org\/",
            "email": "hrichard.laligue@ufolep-usep.fr"
        },
        {
            "id": 115
        }
    ]
}